{"text_format":"1","workbook":"xlsx","n_sheets":14,"sheets":["celk Výsledky","Prezentace","1","1(M)","2","2(M)","3(M)","3","4","4(M)","5","5(M)","6","6(M)"],"not_rendered":{"charts":0,"images":1,"macros":1,"external_links":0,"defined_names":3,"comments":2,"pivot_tables":0},"unopened":[],"bounds":{"document_bytes":16777216,"sheet_cells":100000,"rows_first":2000,"rows_last":500,"rows_between":2000,"halvings":0,"cell_chars":16384,"cell_head_chars":4096},"cells_cut":0,"cells_raw":0,"read":"whole","date_system":"1900"}

{"sheet":"celk Výsledky","index":0,"n_rows":103,"n_cols":23,"rows_kept":103,"cut":false,"hidden":false,"merged":[[3,13,4,13],[0,0,2,6],[0,19,2,22],[3,0,4,0],[3,1,4,1],[3,2,4,2],[3,3,4,3],[3,4,4,4],[3,5,4,5],[3,6,4,6],[3,7,4,7],[3,8,4,8],[3,9,4,9],[3,10,4,10],[3,11,4,11],[3,12,4,12],[3,20,4,20],[3,21,4,21],[3,22,4,22],[3,14,4,14],[3,15,4,15],[3,16,4,16],[3,17,4,17],[3,18,4,18],[3,19,4,19]]}
["Klubový přebor  ",null,null,null,null,null,null,null,null,null,null,null,null,null,null,null,null,null,null,"Datum: 30.3.2019\nHorní Cerekev\nPočátky"]
[]
[]
["Druž.","Kap.","Start. číslo","Zbraň","Příjmení","Jméno","Klub (organizace)","Disc.\n1","Disc.\n1","Disc.\n2","Disc.\n2","Disc.\n3","Disc.\n3","Disc.\n4","Disc.\n4","Disc.\n5","Disc.\n5","Disc.\n6","Disc.\n6","Celkový výsledek","Pořadí","Celkem družstvo","Pořadí družstvo"]
[]
[null,null,20,"P","Koch  st. ","Miroslav","Kvz Policie Počátky",{"$f":"'1'!V23","v":0},{"$f":"'1(M)'!T22","v":133},{"$f":"'2'!V22","v":71.69},{"$f":"'2(M)'!T23","v":0},{"$f":"'3'!V22","v":82.68},{"$f":"'3(M)'!T23","v":0},{"$f":"'4'!V22","v":37.730000000000004},{"$f":"'4(M)'!T23","v":0},{"$f":"'5'!V22","v":128.23000000000002},{"$f":"'5(M)'!T23","v":0},{"$f":"'6'!V23","v":0},{"$f":"'6(M)'!T23","v":0},{"$f":"IF(SUM(H6:S6)<0,0,SUM(H6:S6))","v":453.33000000000004},{"$f":"RANK(T6,$T$6:$T$103)","v":1},{"$f":"IF($B6=\"K\",SUMIFS($T$6:$T$103,$A$6:$A$103,A6),\"\")","v":""},{"$f":"IF($B6=\"K\",RANK(V6,$V$6:$V$103),\"\")","v":""}]
[null,null,6,"P","VejslíK ","Vladimír","KVZ Fruko J.Hradec",{"$f":"'1'!V9","v":0},{"$f":"'1(M)'!T9","v":123},{"$f":"'2'!V9","v":70.41},{"$f":"'2(M)'!T9","v":0},{"$f":"'3'!V9","v":82.65},{"$f":"'3(M)'!T9","v":0},{"$f":"'4'!V9","v":25.33},{"$f":"'4(M)'!T9","v":0},{"$f":"'5'!V9","v":149.35},{"$f":"'5(M)'!T9","v":0},{"$f":"'6'!V9","v":0},{"$f":"'6(M)'!T9","v":0},450.74,2,"",""]
[null,null,7,"P","Kraus ","Milan","KVZ Týn n Vltavou",{"$f":"'1'!V10","v":0},{"$f":"'1(M)'!T10","v":128},{"$f":"'2'!V10","v":72.210000000000008},{"$f":"'2(M)'!T10","v":0},{"$f":"'3'!V10","v":96.86},{"$f":"'3(M)'!T10","v":0},{"$f":"'4'!V10","v":41.1},{"$f":"'4(M)'!T10","v":0},{"$f":"'5'!V10","v":108.64},{"$f":"'5(M)'!T10","v":0},{"$f":"'6'!V10","v":0},{"$f":"'6(M)'!T10","v":0},446.81,3,"",""]
[null,null,10,"P","Získal ","Karel","KVZ Pelhřimov",{"$f":"'1'!V13","v":0},{"$f":"'1(M)'!T12","v":121},{"$f":"'2'!V12","v":68.88},{"$f":"'2(M)'!T13","v":0},{"$f":"'3'!V12","v":79.400000000000006},{"$f":"'3(M)'!T13","v":0},{"$f":"'4'!V12","v":24.810000000000002},{"$f":"'4(M)'!T13","v":0},{"$f":"'5'!V12","v":136.97999999999999},{"$f":"'5(M)'!T13","v":0},{"$f":"'6'!V13","v":0},{"$f":"'6(M)'!T13","v":0},431.06999999999994,4,"",""]
[null,null,18,"P","Fuksa  ","Viktor","Kvz Policie Počátky",{"$f":"'1'!V21","v":0},{"$f":"'1(M)'!T20","v":130},{"$f":"'2'!V20","v":71.349999999999994},{"$f":"'2(M)'!T21","v":0},{"$f":"'3'!V20","v":67.81},{"$f":"'3(M)'!T21","v":0},{"$f":"'4'!V20","v":24.810000000000002},{"$f":"'4(M)'!T21","v":0},{"$f":"'5'!V20","v":130.57999999999998},{"$f":"'5(M)'!T21","v":0},{"$f":"'6'!V21","v":0},{"$f":"'6(M)'!T21","v":0},424.54999999999995,5,"",""]
[null,null,23,"P","Petržílka","Miloslav","KVZ UVS J.Hradec",{"$f":"'1'!V26","v":0},{"$f":"'1(M)'!T25","v":120},{"$f":"'2'!V25","v":63.83},{"$f":"'2(M)'!T26","v":0},{"$f":"'3'!V25","v":71.430000000000007},{"$f":"'3(M)'!T26","v":0},{"$f":"'4'!V25","v":28.6},{"$f":"'4(M)'!T26","v":0},{"$f":"'5'!V25","v":138.31},{"$f":"'5(M)'!T26","v":0},{"$f":"'6'!V26","v":0},{"$f":"'6(M)'!T26","v":0},422.17,6,"",""]
[null,null,4,"P","Švihálek ","Jiří","KVZ Fruko J.Hradec",{"$f":"'1'!V7","v":0},{"$f":"'1(M)'!T7","v":132},{"$f":"'2'!V7","v":59.54},{"$f":"'2(M)'!T7","v":0},{"$f":"'3'!V7","v":72.44},{"$f":"'3(M)'!T7","v":0},{"$f":"'4'!V7","v":34.769999999999996},{"$f":"'4(M)'!T7","v":0},{"$f":"'5'!V7","v":122.62},{"$f":"'5(M)'!T7","v":0},{"$f":"'6'!V7","v":0},{"$f":"'6(M)'!T7","v":0},421.37,7,"",""]
[null,null,19,"P","Koch   ml.","Miroslav","Kvz Policie Počátky",{"$f":"'1'!V22","v":0},{"$f":"'1(M)'!T21","v":131},{"$f":"'2'!V21","v":57.480000000000004},{"$f":"'2(M)'!T22","v":0},{"$f":"'3'!V21","v":63.55},{"$f":"'3(M)'!T22","v":0},{"$f":"'4'!V21","v":25.619999999999997},{"$f":"'4(M)'!T22","v":0},{"$f":"'5'!V21","v":141.91},{"$f":"'5(M)'!T22","v":0},{"$f":"'6'!V22","v":0},{"$f":"'6(M)'!T22","v":0},419.56000000000006,8,"",""]
[null,null,3,"P","Toman ","František","KVZ Fruko J.Hradec",{"$f":"'1'!V6","v":0},{"$f":"'1(M)'!T6","v":124},{"$f":"'2'!V6","v":64.05},{"$f":"'2(M)'!T6","v":0},{"$f":"'3'!V6","v":69.989999999999995},{"$f":"'3(M)'!T6","v":0},{"$f":"'4'!V6","v":34.409999999999997},{"$f":"'4(M)'!T6","v":0},{"$f":"'5'!V6","v":115.61},{"$f":"'5(M)'!T6","v":0},{"$f":"'6'!V6","v":0},{"$f":"'6(M)'!T6","v":0},408.06000000000006,9,"",""]
[null,null,17,"P","Svoboda","Michal","KVZ Počátky",{"$f":"'1'!V20","v":0},{"$f":"'1(M)'!T19","v":118},{"$f":"'2'!V19","v":68.72},{"$f":"'2(M)'!T20","v":0},{"$f":"'3'!V19","v":100.8},{"$f":"'3(M)'!T20","v":0},{"$f":"'4'!V19","v":19.3},{"$f":"'4(M)'!T20","v":0},{"$f":"'5'!V19","v":100.52},{"$f":"'5(M)'!T20","v":0},{"$f":"'6'!V20","v":0},{"$f":"'6(M)'!T20","v":0},407.34,10,"",""]
[null,null,5,"R","Švihálek ","Jiří","KVZ Fruko J.Hradec",{"$f":"'1'!V8","v":0},{"$f":"'1(M)'!T8","v":116},{"$f":"'2'!V8","v":50.510000000000005},{"$f":"'2(M)'!T8","v":0},{"$f":"'3'!V8","v":70.52000000000001},{"$f":"'3(M)'!T8","v":0},{"$f":"'4'!V8","v":25.41},{"$f":"'4(M)'!T8","v":0},{"$f":"'5'!V8","v":143.28},{"$f":"'5(M)'!T8","v":0},{"$f":"'6'!V8","v":0},{"$f":"'6(M)'!T8","v":0},405.72,11,"",""]
[null,null,2,"P","Fiala  ","Miroslav","KVZ Fruko J.Hradec",{"$f":"'1'!V5","v":0},{"$f":"'1(M)'!T5","v":123},{"$f":"'2'!V5","v":56.14},{"$f":"'2(M)'!T5","v":0},{"$f":"'3'!V5","v":54.7},{"$f":"'3(M)'!T5","v":0},{"$f":"'4'!V5","v":29.380000000000003},{"$f":"'4(M)'!T5","v":0},{"$f":"'5'!V5","v":139.76},{"$f":"'5(M)'!T5","v":0},{"$f":"'6'!V5","v":0},{"$f":"'6(M)'!T5","v":0},402.97999999999996,12,"",""]
[null,null,16,"P","Herceg","Bohumil","Kvz Policie Počátky",{"$f":"'1'!V19","v":0},{"$f":"'1(M)'!T18","v":119},{"$f":"'2'!V18","v":51.85},{"$f":"'2(M)'!T19","v":0},{"$f":"'3'!V18","v":68.81},{"$f":"'3(M)'!T19","v":0},{"$f":"'4'!V18","v":34.17},{"$f":"'4(M)'!T19","v":0},{"$f":"'5'!V18","v":115.82},{"$f":"'5(M)'!T19","v":0},{"$f":"'6'!V19","v":0},{"$f":"'6(M)'!T19","v":0},389.65,13,"",""]
[null,null,9,"P","Brejžek ","Vojtěch","KVZ Fruko J.Hradec",{"$f":"'1'!V12","v":0},{"$f":"'1(M)'!T11","v":132},{"$f":"'2'!V11","v":69.010000000000005},{"$f":"'2(M)'!T12","v":0},{"$f":"'3'!V11","v":55.03},{"$f":"'3(M)'!T12","v":0},{"$f":"'4'!V11","v":20.98},{"$f":"'4(M)'!T12","v":0},{"$f":"'5'!V11","v":112.1},{"$f":"'5(M)'!T12","v":0},{"$f":"'6'!V12","v":0},{"$f":"'6(M)'!T12","v":0},389.12,14,"",""]
[null,null,21,"P","Kostříž ","Jaroslav","Kvz Policie Počátky",{"$f":"'1'!V24","v":0},{"$f":"'1(M)'!T23","v":120},{"$f":"'2'!V23","v":71.23},{"$f":"'2(M)'!T24","v":0},{"$f":"'3'!V23","v":62.09},{"$f":"'3(M)'!T24","v":0},{"$f":"'4'!V23","v":18},{"$f":"'4(M)'!T24","v":0},{"$f":"'5'!V23","v":115.66},{"$f":"'5(M)'!T24","v":0},{"$f":"'6'!V24","v":0},{"$f":"'6(M)'!T24","v":0},386.98,15,"",""]
[null,null,12,"P","Žemličková","Marie","KVZ Týn n Vltavou",{"$f":"'1'!V15","v":0},{"$f":"'1(M)'!T14","v":103},{"$f":"'2'!V14","v":64.47},{"$f":"'2(M)'!T15","v":0},{"$f":"'3'!V14","v":50.64},{"$f":"'3(M)'!T15","v":0},{"$f":"'4'!V14","v":33.28},{"$f":"'4(M)'!T15","v":0},{"$f":"'5'!V14","v":133.34},{"$f":"'5(M)'!T15","v":0},{"$f":"'6'!V15","v":0},{"$f":"'6(M)'!T15","v":0},384.73,16,"",""]
[null,null,13,"P","Žemlička ","Ladislav","KVZ Týn n Vltavou",{"$f":"'1'!V16","v":0},{"$f":"'1(M)'!T15","v":118},{"$f":"'2'!V15","v":64.83},{"$f":"'2(M)'!T16","v":0},{"$f":"'3'!V15","v":56.61},{"$f":"'3(M)'!T16","v":0},{"$f":"'4'!V15","v":15.37},{"$f":"'4(M)'!T16","v":0},{"$f":"'5'!V15","v":123.15},{"$f":"'5(M)'!T16","v":0},{"$f":"'6'!V16","v":0},{"$f":"'6(M)'!T16","v":0},377.96000000000004,17,"",""]
[null,null,22,"P","Čekal ","Josef","KVZ Fruko J.Hradec",{"$f":"'1'!V25","v":0},{"$f":"'1(M)'!T24","v":110},{"$f":"'2'!V24","v":47.54},{"$f":"'2(M)'!T25","v":0},{"$f":"'3'!V24","v":68.460000000000008},{"$f":"'3(M)'!T25","v":0},{"$f":"'4'!V24","v":23.17},{"$f":"'4(M)'!T25","v":0},{"$f":"'5'!V24","v":121.51},{"$f":"'5(M)'!T25","v":0},{"$f":"'6'!V25","v":0},{"$f":"'6(M)'!T25","v":0},370.68,18,"",""]
[null,null,11,"R","Získal ","Karel","KVZ Pelhřimov",{"$f":"'1'!V14","v":0},{"$f":"'1(M)'!T13","v":123},{"$f":"'2'!V13","v":54.09},{"$f":"'2(M)'!T14","v":0},{"$f":"'3'!V13","v":33.83},{"$f":"'3(M)'!T14","v":0},{"$f":"'4'!V13","v":16.399999999999999},{"$f":"'4(M)'!T14","v":0},{"$f":"'5'!V13","v":140.44999999999999},{"$f":"'5(M)'!T14","v":0},{"$f":"'6'!V14","v":0},{"$f":"'6(M)'!T14","v":0},367.77,19,"",""]
[null,null,25,"P","Wrzecionko","Albert","KVZ Fruko J.Hradec",{"$f":"'1'!V28","v":0},{"$f":"'1(M)'!T27","v":103},{"$f":"'2'!V27","v":46.980000000000004},{"$f":"'2(M)'!T28","v":0},{"$f":"'3'!V27","v":56.32},{"$f":"'3(M)'!T28","v":0},{"$f":"'4'!V27","v":2.66},{"$f":"'4(M)'!T28","v":0},{"$f":"'5'!V27","v":106.25},{"$f":"'5(M)'!T28","v":0},{"$f":"'6'!V28","v":0},{"$f":"'6(M)'!T28","v":0},315.21000000000004,20,"",""]
[null,null,24,"P","Landkammer","Václav","KVZ Fruko J.Hradec",{"$f":"'1'!V27","v":0},{"$f":"'1(M)'!T26","v":115},{"$f":"'2'!V26","v":67.349999999999994},{"$f":"'2(M)'!T27","v":0},{"$f":"'3'!V26","v":47.06},{"$f":"'3(M)'!T27","v":0},{"$f":"'4'!V26","v":24.3},{"$f":"'4(M)'!T27","v":0},{"$f":"'5'!V26","v":61.25},{"$f":"'5(M)'!T27","v":0},{"$f":"'6'!V27","v":0},{"$f":"'6(M)'!T27","v":0},314.96000000000004,21,"",""]
[null,null,15,"P","Janovský ","Mojmír","Kvz Policie Počátky",{"$f":"'1'!V18","v":0},{"$f":"'1(M)'!T17","v":111},{"$f":"'2'!V17","v":61.65},{"$f":"'2(M)'!T18","v":0},{"$f":"'3'!V17","v":35.369999999999997},{"$f":"'3(M)'!T18","v":0},{"$f":"'4'!V17","v":5.0000000000000711E-2},{"$f":"'4(M)'!T18","v":0},{"$f":"'5'!V17","v":80.28},{"$f":"'5(M)'!T18","v":0},{"$f":"'6'!V18","v":0},{"$f":"'6(M)'!T18","v":0},288.35000000000002,22,"",""]
[null,null,27,"P","Urbanec  ","Antonín","KVZ Fruko J.Hradec",{"$f":"'1'!V30","v":0},{"$f":"'1(M)'!T29","v":85},{"$f":"'2'!V29","v":41.85},{"$f":"'2(M)'!T30","v":0},{"$f":"'3'!V29","v":53.7},{"$f":"'3(M)'!T30","v":0},{"$f":"'4'!V29","v":5.59},{"$f":"'4(M)'!T30","v":0},{"$f":"'5'!V29","v":97.03},{"$f":"'5(M)'!T30","v":0},{"$f":"'6'!V30","v":0},{"$f":"'6(M)'!T30","v":0},283.17,23,"",""]
[null,null,26,"P","Reisnerová","Michaela","KVZ  Fruko",{"$f":"'1'!V29","v":0},{"$f":"'1(M)'!T28","v":49},{"$f":"'2'!V28","v":48.510000000000005},{"$f":"'2(M)'!T29","v":0},{"$f":"'3'!V28","v":18},{"$f":"'3(M)'!T29","v":0},{"$f":"'4'!V28","v":0},{"$f":"'4(M)'!T29","v":0},{"$f":"'5'!V28","v":97.46},{"$f":"'5(M)'!T29","v":0},{"$f":"'6'!V29","v":0},{"$f":"'6(M)'!T29","v":0},212.97,24,"",""]
[null,null,14,"P","Janovský ","Jiří","KVZ Policie Počátky",{"$f":"'1'!V17","v":0},{"$f":"'1(M)'!T16","v":52},{"$f":"'2'!V16","v":41.17},{"$f":"'2(M)'!T17","v":0},{"$f":"'3'!V16","v":13.75},{"$f":"'3(M)'!T17","v":0},{"$f":"'4'!V16","v":0},{"$f":"'4(M)'!T17","v":0},{"$f":"'5'!V16","v":45.210000000000008},{"$f":"'5(M)'!T17","v":0},{"$f":"'6'!V17","v":0},{"$f":"'6(M)'!T17","v":0},152.13,25,"",""]
[null,null,1,"P","Matějka st.","Milan","Jindřichův Hradec",{"$f":"'1'!V4","v":0},{"$f":"'1(M)'!T4","v":83},{"$f":"'2'!V4","v":16.190000000000001},{"$f":"'2(M)'!T4","v":0},{"$f":"'3'!V4","v":17.72},{"$f":"'3(M)'!T4","v":0},{"$f":"'4'!V4","v":0},{"$f":"'4(M)'!T4","v":0},{"$f":"'5'!V4","v":0},{"$f":"'5(M)'!T4","v":0},{"$f":"'6'!V4","v":0},{"$f":"'6(M)'!T4","v":0},116.91,26,"",""]
[null,null,28,"P",null,null,null,{"$f":"'1'!V31","v":0},{"$f":"'1(M)'!T30","v":0},{"$f":"'2'!V30","v":0},{"$f":"'2(M)'!T31","v":0},{"$f":"'3'!V30","v":0},{"$f":"'3(M)'!T31","v":0},{"$f":"'4'!V30","v":0},{"$f":"'4(M)'!T31","v":0},{"$f":"'5'!V30","v":0},{"$f":"'5(M)'!T31","v":0},{"$f":"'6'!V31","v":0},{"$f":"'6(M)'!T31","v":0},{"$f":"IF(SUM(H32:S32)<0,0,SUM(H32:S32))","v":0},27,"",""]
[null,null,29,"P",null,null,null,{"$f":"'1'!V32","v":0},{"$f":"'1(M)'!T31","v":0},{"$f":"'2'!V31","v":0},{"$f":"'2(M)'!T32","v":0},{"$f":"'3'!V31","v":0},{"$f":"'3(M)'!T32","v":0},{"$f":"'4'!V31","v":0},{"$f":"'4(M)'!T32","v":0},{"$f":"'5'!V31","v":0},{"$f":"'5(M)'!T32","v":0},{"$f":"'6'!V32","v":0},{"$f":"'6(M)'!T32","v":0},0,27,"",""]
[null,null,30,"P",null,null,null,{"$f":"'1'!V33","v":0},{"$f":"'1(M)'!T32","v":0},{"$f":"'2'!V32","v":0},{"$f":"'2(M)'!T33","v":0},{"$f":"'3'!V32","v":0},{"$f":"'3(M)'!T33","v":0},{"$f":"'4'!V32","v":0},{"$f":"'4(M)'!T33","v":0},{"$f":"'5'!V32","v":0},{"$f":"'5(M)'!T33","v":0},{"$f":"'6'!V33","v":0},{"$f":"'6(M)'!T33","v":0},0,27,"",""]
[null,null,31,"P",null,null,null,{"$f":"'1'!V34","v":0},{"$f":"'1(M)'!T33","v":0},{"$f":"'2'!V33","v":0},{"$f":"'2(M)'!T34","v":0},{"$f":"'3'!V33","v":0},{"$f":"'3(M)'!T34","v":0},{"$f":"'4'!V33","v":0},{"$f":"'4(M)'!T34","v":0},{"$f":"'5'!V33","v":0},{"$f":"'5(M)'!T34","v":0},{"$f":"'6'!V34","v":0},{"$f":"'6(M)'!T34","v":0},0,27,"",""]
[null,null,32,"P",null,null,null,{"$f":"'1'!V35","v":0},{"$f":"'1(M)'!T34","v":0},{"$f":"'2'!V34","v":0},{"$f":"'2(M)'!T35","v":0},{"$f":"'3'!V34","v":0},{"$f":"'3(M)'!T35","v":0},{"$f":"'4'!V34","v":0},{"$f":"'4(M)'!T35","v":0},{"$f":"'5'!V34","v":0},{"$f":"'5(M)'!T35","v":0},{"$f":"'6'!V35","v":0},{"$f":"'6(M)'!T35","v":0},0,27,"",""]
[null,null,33,"P",null,null,null,{"$f":"'1'!V36","v":0},{"$f":"'1(M)'!T35","v":0},{"$f":"'2'!V35","v":0},{"$f":"'2(M)'!T36","v":0},{"$f":"'3'!V35","v":0},{"$f":"'3(M)'!T36","v":0},{"$f":"'4'!V35","v":0},{"$f":"'4(M)'!T36","v":0},{"$f":"'5'!V35","v":0},{"$f":"'5(M)'!T36","v":0},{"$f":"'6'!V36","v":0},{"$f":"'6(M)'!T36","v":0},0,27,"",""]
[null,null,34,"P",null,null,null,{"$f":"'1'!V37","v":0},{"$f":"'1(M)'!T36","v":0},{"$f":"'2'!V36","v":0},{"$f":"'2(M)'!T37","v":0},{"$f":"'3'!V36","v":0},{"$f":"'3(M)'!T37","v":0},{"$f":"'4'!V36","v":0},{"$f":"'4(M)'!T37","v":0},{"$f":"'5'!V36","v":0},{"$f":"'5(M)'!T37","v":0},{"$f":"'6'!V37","v":0},{"$f":"'6(M)'!T37","v":0},0,{"$f":"RANK(T38,$T$6:$T$103)","v":27},{"$f":"IF($B38=\"K\",SUMIFS($T$6:$T$103,$A$6:$A$103,A38),\"\")","v":""},{"$f":"IF($B38=\"K\",RANK(V38,$V$6:$V$103),\"\")","v":""}]
[null,null,35,"P",null,null,null,{"$f":"'1'!V38","v":0},{"$f":"'1(M)'!T37","v":0},{"$f":"'2'!V37","v":0},{"$f":"'2(M)'!T38","v":0},{"$f":"'3'!V37","v":0},{"$f":"'3(M)'!T38","v":0},{"$f":"'4'!V37","v":0},{"$f":"'4(M)'!T38","v":0},{"$f":"'5'!V37","v":0},{"$f":"'5(M)'!T38","v":0},{"$f":"'6'!V38","v":0},{"$f":"'6(M)'!T38","v":0},{"$f":"IF(SUM(H39:S39)<0,0,SUM(H39:S39))","v":0},27,"",""]
[null,null,36,"P",null,null,null,{"$f":"'1'!V39","v":0},{"$f":"'1(M)'!T38","v":0},{"$f":"'2'!V38","v":0},{"$f":"'2(M)'!T39","v":0},{"$f":"'3'!V38","v":0},{"$f":"'3(M)'!T39","v":0},{"$f":"'4'!V38","v":0},{"$f":"'4(M)'!T39","v":0},{"$f":"'5'!V38","v":0},{"$f":"'5(M)'!T39","v":0},{"$f":"'6'!V39","v":0},{"$f":"'6(M)'!T39","v":0},0,27,"",""]
[null,null,37,"P",null,null,null,{"$f":"'1'!V40","v":0},{"$f":"'1(M)'!T39","v":0},{"$f":"'2'!V39","v":0},{"$f":"'2(M)'!T40","v":0},{"$f":"'3'!V39","v":0},{"$f":"'3(M)'!T40","v":0},{"$f":"'4'!V39","v":0},{"$f":"'4(M)'!T40","v":0},{"$f":"'5'!V39","v":0},{"$f":"'5(M)'!T40","v":0},{"$f":"'6'!V40","v":0},{"$f":"'6(M)'!T40","v":0},0,27,"",""]
[null,null,38,"P",null,null,null,{"$f":"'1'!V41","v":0},{"$f":"'1(M)'!T40","v":0},{"$f":"'2'!V40","v":0},{"$f":"'2(M)'!T41","v":0},{"$f":"'3'!V40","v":0},{"$f":"'3(M)'!T41","v":0},{"$f":"'4'!V40","v":0},{"$f":"'4(M)'!T41","v":0},{"$f":"'5'!V40","v":0},{"$f":"'5(M)'!T41","v":0},{"$f":"'6'!V41","v":0},{"$f":"'6(M)'!T41","v":0},0,27,"",""]
[null,null,39,"P",null,null,null,{"$f":"'1'!V42","v":0},{"$f":"'1(M)'!T41","v":0},{"$f":"'2'!V41","v":0},{"$f":"'2(M)'!T42","v":0},{"$f":"'3'!V41","v":0},{"$f":"'3(M)'!T42","v":0},{"$f":"'4'!V41","v":0},{"$f":"'4(M)'!T42","v":0},{"$f":"'5'!V41","v":0},{"$f":"'5(M)'!T42","v":0},{"$f":"'6'!V42","v":0},{"$f":"'6(M)'!T42","v":0},0,27,"",""]
[null,null,40,"P",null,null,null,{"$f":"'1'!V43","v":0},{"$f":"'1(M)'!T42","v":0},{"$f":"'2'!V42","v":0},{"$f":"'2(M)'!T43","v":0},{"$f":"'3'!V42","v":0},{"$f":"'3(M)'!T43","v":0},{"$f":"'4'!V42","v":0},{"$f":"'4(M)'!T43","v":0},{"$f":"'5'!V42","v":0},{"$f":"'5(M)'!T43","v":0},{"$f":"'6'!V43","v":0},{"$f":"'6(M)'!T43","v":0},0,27,"",""]
[null,null,41,"P",null,null,null,{"$f":"'1'!V44","v":0},{"$f":"'1(M)'!T43","v":0},{"$f":"'2'!V43","v":0},{"$f":"'2(M)'!T44","v":0},{"$f":"'3'!V43","v":0},{"$f":"'3(M)'!T44","v":0},{"$f":"'4'!V43","v":0},{"$f":"'4(M)'!T44","v":0},{"$f":"'5'!V43","v":0},{"$f":"'5(M)'!T44","v":0},{"$f":"'6'!V44","v":0},{"$f":"'6(M)'!T44","v":0},0,27,"",""]
[null,null,42,"P",null,null,null,{"$f":"'1'!V45","v":0},{"$f":"'1(M)'!T44","v":0},{"$f":"'2'!V44","v":0},{"$f":"'2(M)'!T45","v":0},{"$f":"'3'!V44","v":0},{"$f":"'3(M)'!T45","v":0},{"$f":"'4'!V44","v":0},{"$f":"'4(M)'!T45","v":0},{"$f":"'5'!V44","v":0},{"$f":"'5(M)'!T45","v":0},{"$f":"'6'!V45","v":0},{"$f":"'6(M)'!T45","v":0},0,27,"",""]
[null,null,43,"P",null,null,null,{"$f":"'1'!V46","v":0},{"$f":"'1(M)'!T45","v":0},{"$f":"'2'!V45","v":0},{"$f":"'2(M)'!T46","v":0},{"$f":"'3'!V45","v":0},{"$f":"'3(M)'!T46","v":0},{"$f":"'4'!V45","v":0},{"$f":"'4(M)'!T46","v":0},{"$f":"'5'!V45","v":0},{"$f":"'5(M)'!T46","v":0},{"$f":"'6'!V46","v":0},{"$f":"'6(M)'!T46","v":0},0,27,"",""]
[null,null,44,"P",null,null,null,{"$f":"'1'!V47","v":0},{"$f":"'1(M)'!T46","v":0},{"$f":"'2'!V46","v":0},{"$f":"'2(M)'!T47","v":0},{"$f":"'3'!V46","v":0},{"$f":"'3(M)'!T47","v":0},{"$f":"'4'!V46","v":0},{"$f":"'4(M)'!T47","v":0},{"$f":"'5'!V46","v":0},{"$f":"'5(M)'!T47","v":0},{"$f":"'6'!V47","v":0},{"$f":"'6(M)'!T47","v":0},0,27,"",""]
[null,null,45,"P",null,null,null,{"$f":"'1'!V48","v":0},{"$f":"'1(M)'!T47","v":0},{"$f":"'2'!V47","v":0},{"$f":"'2(M)'!T48","v":0},{"$f":"'3'!V47","v":0},{"$f":"'3(M)'!T48","v":0},{"$f":"'4'!V47","v":0},{"$f":"'4(M)'!T48","v":0},{"$f":"'5'!V47","v":0},{"$f":"'5(M)'!T48","v":0},{"$f":"'6'!V48","v":0},{"$f":"'6(M)'!T48","v":0},0,27,"",""]
[null,null,46,"P",null,null,null,{"$f":"'1'!V49","v":0},{"$f":"'1(M)'!T48","v":0},{"$f":"'2'!V48","v":0},{"$f":"'2(M)'!T49","v":0},{"$f":"'3'!V48","v":0},{"$f":"'3(M)'!T49","v":0},{"$f":"'4'!V48","v":0},{"$f":"'4(M)'!T49","v":0},{"$f":"'5'!V48","v":0},{"$f":"'5(M)'!T49","v":0},{"$f":"'6'!V49","v":0},{"$f":"'6(M)'!T49","v":0},0,27,"",""]
[null,null,47,"P",null,null,null,{"$f":"'1'!V50","v":0},{"$f":"'1(M)'!T49","v":0},{"$f":"'2'!V49","v":0},{"$f":"'2(M)'!T50","v":0},{"$f":"'3'!V49","v":0},{"$f":"'3(M)'!T50","v":0},{"$f":"'4'!V49","v":0},{"$f":"'4(M)'!T50","v":0},{"$f":"'5'!V49","v":0},{"$f":"'5(M)'!T50","v":0},{"$f":"'6'!V50","v":0},{"$f":"'6(M)'!T50","v":0},0,27,"",""]
[null,null,48,"P",null,null,null,{"$f":"'1'!V51","v":0},{"$f":"'1(M)'!T50","v":0},{"$f":"'2'!V50","v":0},{"$f":"'2(M)'!T51","v":0},{"$f":"'3'!V50","v":0},{"$f":"'3(M)'!T51","v":0},{"$f":"'4'!V50","v":0},{"$f":"'4(M)'!T51","v":0},{"$f":"'5'!V50","v":0},{"$f":"'5(M)'!T51","v":0},{"$f":"'6'!V51","v":0},{"$f":"'6(M)'!T51","v":0},0,27,"",""]
[null,null,49,"P",null,null,null,{"$f":"'1'!V52","v":0},{"$f":"'1(M)'!T51","v":0},{"$f":"'2'!V51","v":0},{"$f":"'2(M)'!T52","v":0},{"$f":"'3'!V51","v":0},{"$f":"'3(M)'!T52","v":0},{"$f":"'4'!V51","v":0},{"$f":"'4(M)'!T52","v":0},{"$f":"'5'!V51","v":0},{"$f":"'5(M)'!T52","v":0},{"$f":"'6'!V52","v":0},{"$f":"'6(M)'!T52","v":0},0,27,"",""]
[null,null,50,"P",null,null,null,{"$f":"'1'!V53","v":0},{"$f":"'1(M)'!T52","v":0},{"$f":"'2'!V52","v":0},{"$f":"'2(M)'!T53","v":0},{"$f":"'3'!V52","v":0},{"$f":"'3(M)'!T53","v":0},{"$f":"'4'!V52","v":0},{"$f":"'4(M)'!T53","v":0},{"$f":"'5'!V52","v":0},{"$f":"'5(M)'!T53","v":0},{"$f":"'6'!V53","v":0},{"$f":"'6(M)'!T53","v":0},0,27,"",""]
[null,null,51,"P",null,null,null,{"$f":"'1'!V54","v":0},{"$f":"'1(M)'!T53","v":0},{"$f":"'2'!V53","v":0},{"$f":"'2(M)'!T54","v":0},{"$f":"'3'!V53","v":0},{"$f":"'3(M)'!T54","v":0},{"$f":"'4'!V53","v":0},{"$f":"'4(M)'!T54","v":0},{"$f":"'5'!V53","v":0},{"$f":"'5(M)'!T54","v":0},{"$f":"'6'!V54","v":0},{"$f":"'6(M)'!T54","v":0},0,27,"",""]
[null,null,52,"P",null,null,null,{"$f":"'1'!V55","v":0},{"$f":"'1(M)'!T54","v":0},{"$f":"'2'!V54","v":0},{"$f":"'2(M)'!T55","v":0},{"$f":"'3'!V54","v":0},{"$f":"'3(M)'!T55","v":0},{"$f":"'4'!V54","v":0},{"$f":"'4(M)'!T55","v":0},{"$f":"'5'!V54","v":0},{"$f":"'5(M)'!T55","v":0},{"$f":"'6'!V55","v":0},{"$f":"'6(M)'!T55","v":0},0,27,"",""]
[null,null,53,"P",null,null,null,{"$f":"'1'!V56","v":0},{"$f":"'1(M)'!T55","v":0},{"$f":"'2'!V55","v":0},{"$f":"'2(M)'!T56","v":0},{"$f":"'3'!V55","v":0},{"$f":"'3(M)'!T56","v":0},{"$f":"'4'!V55","v":0},{"$f":"'4(M)'!T56","v":0},{"$f":"'5'!V55","v":0},{"$f":"'5(M)'!T56","v":0},{"$f":"'6'!V56","v":0},{"$f":"'6(M)'!T56","v":0},0,27,"",""]
[null,null,54,"P",null,null,null,{"$f":"'1'!V57","v":0},{"$f":"'1(M)'!T56","v":0},{"$f":"'2'!V56","v":0},{"$f":"'2(M)'!T57","v":0},{"$f":"'3'!V56","v":0},{"$f":"'3(M)'!T57","v":0},{"$f":"'4'!V56","v":0},{"$f":"'4(M)'!T57","v":0},{"$f":"'5'!V56","v":0},{"$f":"'5(M)'!T57","v":0},{"$f":"'6'!V57","v":0},{"$f":"'6(M)'!T57","v":0},0,27,"",""]
[null,null,55,"P",null,null,null,{"$f":"'1'!V58","v":0},{"$f":"'1(M)'!T57","v":0},{"$f":"'2'!V57","v":0},{"$f":"'2(M)'!T58","v":0},{"$f":"'3'!V57","v":0},{"$f":"'3(M)'!T58","v":0},{"$f":"'4'!V57","v":0},{"$f":"'4(M)'!T58","v":0},{"$f":"'5'!V57","v":0},{"$f":"'5(M)'!T58","v":0},{"$f":"'6'!V58","v":0},{"$f":"'6(M)'!T58","v":0},0,27,"",""]
[null,null,56,"P",null,null,null,{"$f":"'1'!V59","v":0},{"$f":"'1(M)'!T58","v":0},{"$f":"'2'!V58","v":0},{"$f":"'2(M)'!T59","v":0},{"$f":"'3'!V58","v":0},{"$f":"'3(M)'!T59","v":0},{"$f":"'4'!V58","v":0},{"$f":"'4(M)'!T59","v":0},{"$f":"'5'!V58","v":0},{"$f":"'5(M)'!T59","v":0},{"$f":"'6'!V59","v":0},{"$f":"'6(M)'!T59","v":0},0,27,"",""]
[null,null,57,"P",null,null,null,{"$f":"'1'!V60","v":0},{"$f":"'1(M)'!T59","v":0},{"$f":"'2'!V59","v":0},{"$f":"'2(M)'!T60","v":0},{"$f":"'3'!V59","v":0},{"$f":"'3(M)'!T60","v":0},{"$f":"'4'!V59","v":0},{"$f":"'4(M)'!T60","v":0},{"$f":"'5'!V59","v":0},{"$f":"'5(M)'!T60","v":0},{"$f":"'6'!V60","v":0},{"$f":"'6(M)'!T60","v":0},0,27,"",""]
[null,null,58,"P",null,null,null,{"$f":"'1'!V61","v":0},{"$f":"'1(M)'!T60","v":0},{"$f":"'2'!V60","v":0},{"$f":"'2(M)'!T61","v":0},{"$f":"'3'!V60","v":0},{"$f":"'3(M)'!T61","v":0},{"$f":"'4'!V60","v":0},{"$f":"'4(M)'!T61","v":0},{"$f":"'5'!V60","v":0},{"$f":"'5(M)'!T61","v":0},{"$f":"'6'!V61","v":0},{"$f":"'6(M)'!T61","v":0},0,27,"",""]
[null,null,59,"P",null,null,null,{"$f":"'1'!V62","v":0},{"$f":"'1(M)'!T61","v":0},{"$f":"'2'!V61","v":0},{"$f":"'2(M)'!T62","v":0},{"$f":"'3'!V61","v":0},{"$f":"'3(M)'!T62","v":0},{"$f":"'4'!V61","v":0},{"$f":"'4(M)'!T62","v":0},{"$f":"'5'!V61","v":0},{"$f":"'5(M)'!T62","v":0},{"$f":"'6'!V62","v":0},{"$f":"'6(M)'!T62","v":0},0,27,"",""]
[null,null,60,"P",null,null,null,{"$f":"'1'!V63","v":0},{"$f":"'1(M)'!T62","v":0},{"$f":"'2'!V62","v":0},{"$f":"'2(M)'!T63","v":0},{"$f":"'3'!V62","v":0},{"$f":"'3(M)'!T63","v":0},{"$f":"'4'!V62","v":0},{"$f":"'4(M)'!T63","v":0},{"$f":"'5'!V62","v":0},{"$f":"'5(M)'!T63","v":0},{"$f":"'6'!V63","v":0},{"$f":"'6(M)'!T63","v":0},0,27,"",""]
[null,null,61,"P",null,null,null,{"$f":"'1'!V64","v":0},{"$f":"'1(M)'!T63","v":0},{"$f":"'2'!V63","v":0},{"$f":"'2(M)'!T64","v":0},{"$f":"'3'!V63","v":0},{"$f":"'3(M)'!T64","v":0},{"$f":"'4'!V63","v":0},{"$f":"'4(M)'!T64","v":0},{"$f":"'5'!V63","v":0},{"$f":"'5(M)'!T64","v":0},{"$f":"'6'!V64","v":0},{"$f":"'6(M)'!T64","v":0},0,27,"",""]
[null,null,62,"P",null,null,null,{"$f":"'1'!V65","v":0},{"$f":"'1(M)'!T64","v":0},{"$f":"'2'!V64","v":0},{"$f":"'2(M)'!T65","v":0},{"$f":"'3'!V64","v":0},{"$f":"'3(M)'!T65","v":0},{"$f":"'4'!V64","v":0},{"$f":"'4(M)'!T65","v":0},{"$f":"'5'!V64","v":0},{"$f":"'5(M)'!T65","v":0},{"$f":"'6'!V65","v":0},{"$f":"'6(M)'!T65","v":0},0,27,"",""]
[null,null,63,"P",null,null,null,{"$f":"'1'!V66","v":0},{"$f":"'1(M)'!T65","v":0},{"$f":"'2'!V65","v":0},{"$f":"'2(M)'!T66","v":0},{"$f":"'3'!V65","v":0},{"$f":"'3(M)'!T66","v":0},{"$f":"'4'!V65","v":0},{"$f":"'4(M)'!T66","v":0},{"$f":"'5'!V65","v":0},{"$f":"'5(M)'!T66","v":0},{"$f":"'6'!V66","v":0},{"$f":"'6(M)'!T66","v":0},0,27,"",""]
[null,null,64,"P",null,null,null,{"$f":"'1'!V67","v":0},{"$f":"'1(M)'!T66","v":0},{"$f":"'2'!V66","v":0},{"$f":"'2(M)'!T67","v":0},{"$f":"'3'!V66","v":0},{"$f":"'3(M)'!T67","v":0},{"$f":"'4'!V66","v":0},{"$f":"'4(M)'!T67","v":0},{"$f":"'5'!V66","v":0},{"$f":"'5(M)'!T67","v":0},{"$f":"'6'!V67","v":0},{"$f":"'6(M)'!T67","v":0},0,27,"",""]
[null,null,65,"P",null,null,null,{"$f":"'1'!V68","v":0},{"$f":"'1(M)'!T67","v":0},{"$f":"'2'!V67","v":0},{"$f":"'2(M)'!T68","v":0},{"$f":"'3'!V67","v":0},{"$f":"'3(M)'!T68","v":0},{"$f":"'4'!V67","v":0},{"$f":"'4(M)'!T68","v":0},{"$f":"'5'!V67","v":0},{"$f":"'5(M)'!T68","v":0},{"$f":"'6'!V68","v":0},{"$f":"'6(M)'!T68","v":0},0,27,"",""]
[null,null,66,"P",null,null,null,{"$f":"'1'!V69","v":0},{"$f":"'1(M)'!T68","v":0},{"$f":"'2'!V68","v":0},{"$f":"'2(M)'!T69","v":0},{"$f":"'3'!V68","v":0},{"$f":"'3(M)'!T69","v":0},{"$f":"'4'!V68","v":0},{"$f":"'4(M)'!T69","v":0},{"$f":"'5'!V68","v":0},{"$f":"'5(M)'!T69","v":0},{"$f":"'6'!V69","v":0},{"$f":"'6(M)'!T69","v":0},0,{"$f":"RANK(T70,$T$6:$T$103)","v":27},{"$f":"IF($B70=\"K\",SUMIFS($T$6:$T$103,$A$6:$A$103,A70),\"\")","v":""},{"$f":"IF($B70=\"K\",RANK(V70,$V$6:$V$103),\"\")","v":""}]
[null,null,67,"P",null,null,null,{"$f":"'1'!V70","v":0},{"$f":"'1(M)'!T69","v":0},{"$f":"'2'!V69","v":0},{"$f":"'2(M)'!T70","v":0},{"$f":"'3'!V69","v":0},{"$f":"'3(M)'!T70","v":0},{"$f":"'4'!V69","v":0},{"$f":"'4(M)'!T70","v":0},{"$f":"'5'!V69","v":0},{"$f":"'5(M)'!T70","v":0},{"$f":"'6'!V70","v":0},{"$f":"'6(M)'!T70","v":0},0,27,"",""]
[null,null,68,"P",null,null,null,{"$f":"'1'!V71","v":0},{"$f":"'1(M)'!T70","v":0},{"$f":"'2'!V70","v":0},{"$f":"'2(M)'!T71","v":0},{"$f":"'3'!V70","v":0},{"$f":"'3(M)'!T71","v":0},{"$f":"'4'!V70","v":0},{"$f":"'4(M)'!T71","v":0},{"$f":"'5'!V70","v":0},{"$f":"'5(M)'!T71","v":0},{"$f":"'6'!V71","v":0},{"$f":"'6(M)'!T71","v":0},0,27,"",""]
[null,null,69,"P",null,null,null,{"$f":"'1'!V72","v":0},{"$f":"'1(M)'!T71","v":0},{"$f":"'2'!V71","v":0},{"$f":"'2(M)'!T72","v":0},{"$f":"'3'!V71","v":0},{"$f":"'3(M)'!T72","v":0},{"$f":"'4'!V71","v":0},{"$f":"'4(M)'!T72","v":0},{"$f":"'5'!V71","v":0},{"$f":"'5(M)'!T72","v":0},{"$f":"'6'!V72","v":0},{"$f":"'6(M)'!T72","v":0},0,27,"",""]
[null,null,70,"P",null,null,null,{"$f":"'1'!V73","v":0},{"$f":"'1(M)'!T72","v":0},{"$f":"'2'!V72","v":0},{"$f":"'2(M)'!T73","v":0},{"$f":"'3'!V72","v":0},{"$f":"'3(M)'!T73","v":0},{"$f":"'4'!V72","v":0},{"$f":"'4(M)'!T73","v":0},{"$f":"'5'!V72","v":0},{"$f":"'5(M)'!T73","v":0},{"$f":"'6'!V73","v":0},{"$f":"'6(M)'!T73","v":0},0,27,"",""]
[null,null,71,"P",null,null,null,{"$f":"'1'!V74","v":0},{"$f":"'1(M)'!T73","v":0},{"$f":"'2'!V73","v":0},{"$f":"'2(M)'!T74","v":0},{"$f":"'3'!V73","v":0},{"$f":"'3(M)'!T74","v":0},{"$f":"'4'!V73","v":0},{"$f":"'4(M)'!T74","v":0},{"$f":"'5'!V73","v":0},{"$f":"'5(M)'!T74","v":0},{"$f":"'6'!V74","v":0},{"$f":"'6(M)'!T74","v":0},0,27,"",""]
[null,null,72,"P",null,null,null,{"$f":"'1'!V75","v":0},{"$f":"'1(M)'!T74","v":0},{"$f":"'2'!V74","v":0},{"$f":"'2(M)'!T75","v":0},{"$f":"'3'!V74","v":0},{"$f":"'3(M)'!T75","v":0},{"$f":"'4'!V74","v":0},{"$f":"'4(M)'!T75","v":0},{"$f":"'5'!V74","v":0},{"$f":"'5(M)'!T75","v":0},{"$f":"'6'!V75","v":0},{"$f":"'6(M)'!T75","v":0},0,27,"",""]
[null,null,73,"P",null,null,null,{"$f":"'1'!V76","v":0},{"$f":"'1(M)'!T75","v":0},{"$f":"'2'!V75","v":0},{"$f":"'2(M)'!T76","v":0},{"$f":"'3'!V75","v":0},{"$f":"'3(M)'!T76","v":0},{"$f":"'4'!V75","v":0},{"$f":"'4(M)'!T76","v":0},{"$f":"'5'!V75","v":0},{"$f":"'5(M)'!T76","v":0},{"$f":"'6'!V76","v":0},{"$f":"'6(M)'!T76","v":0},0,27,"",""]
[null,null,74,"P",null,null,null,{"$f":"'1'!V77","v":0},{"$f":"'1(M)'!T76","v":0},{"$f":"'2'!V76","v":0},{"$f":"'2(M)'!T77","v":0},{"$f":"'3'!V76","v":0},{"$f":"'3(M)'!T77","v":0},{"$f":"'4'!V76","v":0},{"$f":"'4(M)'!T77","v":0},{"$f":"'5'!V76","v":0},{"$f":"'5(M)'!T77","v":0},{"$f":"'6'!V77","v":0},{"$f":"'6(M)'!T77","v":0},0,27,"",""]
[null,null,75,"P",null,null,null,{"$f":"'1'!V78","v":0},{"$f":"'1(M)'!T77","v":0},{"$f":"'2'!V77","v":0},{"$f":"'2(M)'!T78","v":0},{"$f":"'3'!V77","v":0},{"$f":"'3(M)'!T78","v":0},{"$f":"'4'!V77","v":0},{"$f":"'4(M)'!T78","v":0},{"$f":"'5'!V77","v":0},{"$f":"'5(M)'!T78","v":0},{"$f":"'6'!V78","v":0},{"$f":"'6(M)'!T78","v":0},0,27,"",""]
[null,null,76,"P",null,null,null,{"$f":"'1'!V79","v":0},{"$f":"'1(M)'!T78","v":0},{"$f":"'2'!V78","v":0},{"$f":"'2(M)'!T79","v":0},{"$f":"'3'!V78","v":0},{"$f":"'3(M)'!T79","v":0},{"$f":"'4'!V78","v":0},{"$f":"'4(M)'!T79","v":0},{"$f":"'5'!V78","v":0},{"$f":"'5(M)'!T79","v":0},{"$f":"'6'!V79","v":0},{"$f":"'6(M)'!T79","v":0},0,27,"",""]
[null,null,77,"P",null,null,null,{"$f":"'1'!V80","v":0},{"$f":"'1(M)'!T79","v":0},{"$f":"'2'!V79","v":0},{"$f":"'2(M)'!T80","v":0},{"$f":"'3'!V79","v":0},{"$f":"'3(M)'!T80","v":0},{"$f":"'4'!V79","v":0},{"$f":"'4(M)'!T80","v":0},{"$f":"'5'!V79","v":0},{"$f":"'5(M)'!T80","v":0},{"$f":"'6'!V80","v":0},{"$f":"'6(M)'!T80","v":0},0,27,"",""]
[null,null,78,"P",null,null,null,{"$f":"'1'!V81","v":0},{"$f":"'1(M)'!T80","v":0},{"$f":"'2'!V80","v":0},{"$f":"'2(M)'!T81","v":0},{"$f":"'3'!V80","v":0},{"$f":"'3(M)'!T81","v":0},{"$f":"'4'!V80","v":0},{"$f":"'4(M)'!T81","v":0},{"$f":"'5'!V80","v":0},{"$f":"'5(M)'!T81","v":0},{"$f":"'6'!V81","v":0},{"$f":"'6(M)'!T81","v":0},0,27,"",""]
[null,null,79,"P",null,null,null,{"$f":"'1'!V82","v":0},{"$f":"'1(M)'!T81","v":0},{"$f":"'2'!V81","v":0},{"$f":"'2(M)'!T82","v":0},{"$f":"'3'!V81","v":0},{"$f":"'3(M)'!T82","v":0},{"$f":"'4'!V81","v":0},{"$f":"'4(M)'!T82","v":0},{"$f":"'5'!V81","v":0},{"$f":"'5(M)'!T82","v":0},{"$f":"'6'!V82","v":0},{"$f":"'6(M)'!T82","v":0},0,27,"",""]
[null,null,80,"P",null,null,null,{"$f":"'1'!V83","v":0},{"$f":"'1(M)'!T82","v":0},{"$f":"'2'!V82","v":0},{"$f":"'2(M)'!T83","v":0},{"$f":"'3'!V82","v":0},{"$f":"'3(M)'!T83","v":0},{"$f":"'4'!V82","v":0},{"$f":"'4(M)'!T83","v":0},{"$f":"'5'!V82","v":0},{"$f":"'5(M)'!T83","v":0},{"$f":"'6'!V83","v":0},{"$f":"'6(M)'!T83","v":0},0,27,"",""]
[null,null,81,"P",null,null,null,{"$f":"'1'!V84","v":0},{"$f":"'1(M)'!T83","v":0},{"$f":"'2'!V83","v":0},{"$f":"'2(M)'!T84","v":0},{"$f":"'3'!V83","v":0},{"$f":"'3(M)'!T84","v":0},{"$f":"'4'!V83","v":0},{"$f":"'4(M)'!T84","v":0},{"$f":"'5'!V83","v":0},{"$f":"'5(M)'!T84","v":0},{"$f":"'6'!V84","v":0},{"$f":"'6(M)'!T84","v":0},0,27,"",""]
[null,null,82,"P",null,null,null,{"$f":"'1'!V85","v":0},{"$f":"'1(M)'!T84","v":0},{"$f":"'2'!V84","v":0},{"$f":"'2(M)'!T85","v":0},{"$f":"'3'!V84","v":0},{"$f":"'3(M)'!T85","v":0},{"$f":"'4'!V84","v":0},{"$f":"'4(M)'!T85","v":0},{"$f":"'5'!V84","v":0},{"$f":"'5(M)'!T85","v":0},{"$f":"'6'!V85","v":0},{"$f":"'6(M)'!T85","v":0},0,27,"",""]
[null,null,83,"P",null,null,null,{"$f":"'1'!V86","v":0},{"$f":"'1(M)'!T85","v":0},{"$f":"'2'!V85","v":0},{"$f":"'2(M)'!T86","v":0},{"$f":"'3'!V85","v":0},{"$f":"'3(M)'!T86","v":0},{"$f":"'4'!V85","v":0},{"$f":"'4(M)'!T86","v":0},{"$f":"'5'!V85","v":0},{"$f":"'5(M)'!T86","v":0},{"$f":"'6'!V86","v":0},{"$f":"'6(M)'!T86","v":0},0,27,"",""]
[null,null,84,"P",null,null,null,{"$f":"'1'!V87","v":0},{"$f":"'1(M)'!T86","v":0},{"$f":"'2'!V86","v":0},{"$f":"'2(M)'!T87","v":0},{"$f":"'3'!V86","v":0},{"$f":"'3(M)'!T87","v":0},{"$f":"'4'!V86","v":0},{"$f":"'4(M)'!T87","v":0},{"$f":"'5'!V86","v":0},{"$f":"'5(M)'!T87","v":0},{"$f":"'6'!V87","v":0},{"$f":"'6(M)'!T87","v":0},0,27,"",""]
[null,null,85,"P",null,null,null,{"$f":"'1'!V88","v":0},{"$f":"'1(M)'!T87","v":0},{"$f":"'2'!V87","v":0},{"$f":"'2(M)'!T88","v":0},{"$f":"'3'!V87","v":0},{"$f":"'3(M)'!T88","v":0},{"$f":"'4'!V87","v":0},{"$f":"'4(M)'!T88","v":0},{"$f":"'5'!V87","v":0},{"$f":"'5(M)'!T88","v":0},{"$f":"'6'!V88","v":0},{"$f":"'6(M)'!T88","v":0},0,27,"",""]
[null,null,86,"P",null,null,null,{"$f":"'1'!V89","v":0},{"$f":"'1(M)'!T88","v":0},{"$f":"'2'!V88","v":0},{"$f":"'2(M)'!T89","v":0},{"$f":"'3'!V88","v":0},{"$f":"'3(M)'!T89","v":0},{"$f":"'4'!V88","v":0},{"$f":"'4(M)'!T89","v":0},{"$f":"'5'!V88","v":0},{"$f":"'5(M)'!T89","v":0},{"$f":"'6'!V89","v":0},{"$f":"'6(M)'!T89","v":0},0,27,"",""]
[null,null,87,"P",null,null,null,{"$f":"'1'!V90","v":0},{"$f":"'1(M)'!T89","v":0},{"$f":"'2'!V89","v":0},{"$f":"'2(M)'!T90","v":0},{"$f":"'3'!V89","v":0},{"$f":"'3(M)'!T90","v":0},{"$f":"'4'!V89","v":0},{"$f":"'4(M)'!T90","v":0},{"$f":"'5'!V89","v":0},{"$f":"'5(M)'!T90","v":0},{"$f":"'6'!V90","v":0},{"$f":"'6(M)'!T90","v":0},0,27,"",""]
[null,null,88,"P",null,null,null,{"$f":"'1'!V91","v":0},{"$f":"'1(M)'!T90","v":0},{"$f":"'2'!V90","v":0},{"$f":"'2(M)'!T91","v":0},{"$f":"'3'!V90","v":0},{"$f":"'3(M)'!T91","v":0},{"$f":"'4'!V90","v":0},{"$f":"'4(M)'!T91","v":0},{"$f":"'5'!V90","v":0},{"$f":"'5(M)'!T91","v":0},{"$f":"'6'!V91","v":0},{"$f":"'6(M)'!T91","v":0},0,27,"",""]
[null,null,89,"P",null,null,null,{"$f":"'1'!V92","v":0},{"$f":"'1(M)'!T91","v":0},{"$f":"'2'!V91","v":0},{"$f":"'2(M)'!T92","v":0},{"$f":"'3'!V91","v":0},{"$f":"'3(M)'!T92","v":0},{"$f":"'4'!V91","v":0},{"$f":"'4(M)'!T92","v":0},{"$f":"'5'!V91","v":0},{"$f":"'5(M)'!T92","v":0},{"$f":"'6'!V92","v":0},{"$f":"'6(M)'!T92","v":0},0,27,"",""]
[null,null,90,"P",null,null,null,{"$f":"'1'!V93","v":0},{"$f":"'1(M)'!T92","v":0},{"$f":"'2'!V92","v":0},{"$f":"'2(M)'!T93","v":0},{"$f":"'3'!V92","v":0},{"$f":"'3(M)'!T93","v":0},{"$f":"'4'!V92","v":0},{"$f":"'4(M)'!T93","v":0},{"$f":"'5'!V92","v":0},{"$f":"'5(M)'!T93","v":0},{"$f":"'6'!V93","v":0},{"$f":"'6(M)'!T93","v":0},0,27,"",""]
[null,null,91,"P",null,null,null,{"$f":"'1'!V94","v":0},{"$f":"'1(M)'!T93","v":0},{"$f":"'2'!V93","v":0},{"$f":"'2(M)'!T94","v":0},{"$f":"'3'!V93","v":0},{"$f":"'3(M)'!T94","v":0},{"$f":"'4'!V93","v":0},{"$f":"'4(M)'!T94","v":0},{"$f":"'5'!V93","v":0},{"$f":"'5(M)'!T94","v":0},{"$f":"'6'!V94","v":0},{"$f":"'6(M)'!T94","v":0},0,27,"",""]
[null,null,92,"P",null,null,null,{"$f":"'1'!V95","v":0},{"$f":"'1(M)'!T94","v":0},{"$f":"'2'!V94","v":0},{"$f":"'2(M)'!T95","v":0},{"$f":"'3'!V94","v":0},{"$f":"'3(M)'!T95","v":0},{"$f":"'4'!V94","v":0},{"$f":"'4(M)'!T95","v":0},{"$f":"'5'!V94","v":0},{"$f":"'5(M)'!T95","v":0},{"$f":"'6'!V95","v":0},{"$f":"'6(M)'!T95","v":0},0,27,"",""]
[null,null,93,"P",null,null,null,{"$f":"'1'!V96","v":0},{"$f":"'1(M)'!T95","v":0},{"$f":"'2'!V95","v":0},{"$f":"'2(M)'!T96","v":0},{"$f":"'3'!V95","v":0},{"$f":"'3(M)'!T96","v":0},{"$f":"'4'!V95","v":0},{"$f":"'4(M)'!T96","v":0},{"$f":"'5'!V95","v":0},{"$f":"'5(M)'!T96","v":0},{"$f":"'6'!V96","v":0},{"$f":"'6(M)'!T96","v":0},0,27,"",""]
[null,null,94,"P",null,null,null,{"$f":"'1'!V97","v":0},{"$f":"'1(M)'!T96","v":0},{"$f":"'2'!V96","v":0},{"$f":"'2(M)'!T97","v":0},{"$f":"'3'!V96","v":0},{"$f":"'3(M)'!T97","v":0},{"$f":"'4'!V96","v":0},{"$f":"'4(M)'!T97","v":0},{"$f":"'5'!V96","v":0},{"$f":"'5(M)'!T97","v":0},{"$f":"'6'!V97","v":0},{"$f":"'6(M)'!T97","v":0},0,27,"",""]
[null,null,95,"P",null,null,null,{"$f":"'1'!V98","v":0},{"$f":"'1(M)'!T97","v":0},{"$f":"'2'!V97","v":0},{"$f":"'2(M)'!T98","v":0},{"$f":"'3'!V97","v":0},{"$f":"'3(M)'!T98","v":0},{"$f":"'4'!V97","v":0},{"$f":"'4(M)'!T98","v":0},{"$f":"'5'!V97","v":0},{"$f":"'5(M)'!T98","v":0},{"$f":"'6'!V98","v":0},{"$f":"'6(M)'!T98","v":0},0,27,"",""]
[null,null,96,"P",null,null,null,{"$f":"'1'!V99","v":0},{"$f":"'1(M)'!T98","v":0},{"$f":"'2'!V98","v":0},{"$f":"'2(M)'!T99","v":0},{"$f":"'3'!V98","v":0},{"$f":"'3(M)'!T99","v":0},{"$f":"'4'!V98","v":0},{"$f":"'4(M)'!T99","v":0},{"$f":"'5'!V98","v":0},{"$f":"'5(M)'!T99","v":0},{"$f":"'6'!V99","v":0},{"$f":"'6(M)'!T99","v":0},0,27,"",""]
[null,null,97,"P",null,null,null,{"$f":"'1'!V100","v":0},{"$f":"'1(M)'!T99","v":0},{"$f":"'2'!V99","v":0},{"$f":"'2(M)'!T100","v":0},{"$f":"'3'!V99","v":0},{"$f":"'3(M)'!T100","v":0},{"$f":"'4'!V99","v":0},{"$f":"'4(M)'!T100","v":0},{"$f":"'5'!V99","v":0},{"$f":"'5(M)'!T100","v":0},{"$f":"'6'!V100","v":0},{"$f":"'6(M)'!T100","v":0},0,27,"",""]
[null,null,98,"P",null,null,null,{"$f":"'1'!V101","v":0},{"$f":"'1(M)'!T100","v":0},{"$f":"'2'!V100","v":0},{"$f":"'2(M)'!T101","v":0},{"$f":"'3'!V100","v":0},{"$f":"'3(M)'!T101","v":0},{"$f":"'4'!V100","v":0},{"$f":"'4(M)'!T101","v":0},{"$f":"'5'!V100","v":0},{"$f":"'5(M)'!T101","v":0},{"$f":"'6'!V101","v":0},{"$f":"'6(M)'!T101","v":0},0,{"$f":"RANK(T102,$T$6:$T$103)","v":27},"",{"$f":"IF($B102=\"K\",RANK(V102,$V$6:$V$103),\"\")","v":""}]
[null,null,99,"P",null,null,null,{"$f":"'1'!V102","v":0},{"$f":"'1(M)'!T101","v":0},{"$f":"'2'!V101","v":0},{"$f":"'2(M)'!T102","v":0},{"$f":"'3'!V101","v":0},{"$f":"'3(M)'!T102","v":0},{"$f":"'4'!V101","v":0},{"$f":"'4(M)'!T102","v":0},{"$f":"'5'!V101","v":0},{"$f":"'5(M)'!T102","v":0},{"$f":"'6'!V102","v":0},{"$f":"'6(M)'!T102","v":0},{"$f":"IF(SUM(H103:S103)<0,0,SUM(H103:S103))","v":0},27,"",""]

{"sheet":"Prezentace","index":1,"n_rows":80,"n_cols":23,"rows_kept":80,"cut":false,"hidden":false,"merged":[[3,15,4,15],[3,16,4,16],[3,8,4,8],[3,10,4,10],[3,12,4,12],[3,14,4,14],[3,9,4,9],[3,11,4,11],[3,13,4,13],[0,19,2,22],[3,0,4,0],[3,1,4,1],[3,21,4,21],[3,22,4,22],[3,18,4,18],[3,6,4,6],[3,2,4,2],[3,3,4,3],[3,4,4,4],[3,5,4,5],[3,19,4,19],[3,20,4,20],[3,7,4,7],[0,0,2,6],[3,17,4,17]]}
["Klubový přebor   č.  805",null,null,null,null,null,null,null,"KVZ POLICIE",null,null,null,null,null,null,null,null,null,null,"Datum: 30.3.2019\nHorní Cerekev\nPočátky"]
[null,null,null,null,null,null,null,null,"Počátky"]
[]
["Druž.","Kap.","Start. číslo","Zbraň","Příjmení","Jméno","Klub (organizace)","Disc.\n1","Disc.\n1","Disc.\n2","Disc.\n2","Disc.\n3","Disc.\n3","Disc.\n4","Disc.\n4","Disc.\n5","Disc.\n5","Disc.\n6","Disc.\n6","Celkový výsledek","Pořadí","Celkem družstvo","Pořadí družstvo"]
[]
[null,null,1,"P","Matějka st.","Milan","Jindřichův Hradec",{"$f":"'1'!V4","v":0},{"$f":"'1(M)'!T4","v":83},{"$f":"'2'!V4","v":16.190000000000001},{"$f":"'2(M)'!T4","v":0},{"$f":"'3'!V4","v":17.72},{"$f":"'3(M)'!T4","v":0},{"$f":"'4'!V4","v":0},{"$f":"'4(M)'!T4","v":0},{"$f":"'5'!V4","v":0},{"$f":"'5(M)'!T4","v":0},{"$f":"'6'!V4","v":0},{"$f":"'6(M)'!T4","v":0},{"$f":"IF(SUM(H6:S6)<0,0,SUM(H6:S6))","v":116.91},{"$f":"RANK(T6,$T$6:$T$75)","v":26},{"$f":"IF($B6=\"K\",SUMIFS($T$6:$T$75,$A$6:$A$75,A6),\"\")","v":""},{"$f":"IF($B6=\"K\",RANK(V6,$V$6:$V$75),\"\")","v":""}]
[null,null,2,"P","Fiala  ","Miroslav","KVZ Fruko J.Hradec",{"$f":"'1'!V5","v":0},{"$f":"'1(M)'!T5","v":123},{"$f":"'2'!V5","v":56.14},{"$f":"'2(M)'!T5","v":0},{"$f":"'3'!V5","v":54.7},{"$f":"'3(M)'!T5","v":0},{"$f":"'4'!V5","v":29.380000000000003},{"$f":"'4(M)'!T5","v":0},{"$f":"'5'!V5","v":139.76},{"$f":"'5(M)'!T5","v":0},{"$f":"'6'!V5","v":0},{"$f":"'6(M)'!T5","v":0},{"$f":"IF(SUM(H7:S7)<0,0,SUM(H7:S7))","v":402.97999999999996},12,"",""]
[null,null,3,"P","Toman ","František","KVZ Fruko J.Hradec",{"$f":"'1'!V6","v":0},{"$f":"'1(M)'!T6","v":124},{"$f":"'2'!V6","v":64.05},{"$f":"'2(M)'!T6","v":0},{"$f":"'3'!V6","v":69.989999999999995},{"$f":"'3(M)'!T6","v":0},{"$f":"'4'!V6","v":34.409999999999997},{"$f":"'4(M)'!T6","v":0},{"$f":"'5'!V6","v":115.61},{"$f":"'5(M)'!T6","v":0},{"$f":"'6'!V6","v":0},{"$f":"'6(M)'!T6","v":0},408.06000000000006,9,"",""]
[null,null,4,"P","Švihálek ","Jiří","KVZ Fruko J.Hradec",{"$f":"'1'!V7","v":0},{"$f":"'1(M)'!T7","v":132},{"$f":"'2'!V7","v":59.54},{"$f":"'2(M)'!T7","v":0},{"$f":"'3'!V7","v":72.44},{"$f":"'3(M)'!T7","v":0},{"$f":"'4'!V7","v":34.769999999999996},{"$f":"'4(M)'!T7","v":0},{"$f":"'5'!V7","v":122.62},{"$f":"'5(M)'!T7","v":0},{"$f":"'6'!V7","v":0},{"$f":"'6(M)'!T7","v":0},421.37,7,"",""]
[null,null,5,"R","Švihálek ","Jiří","KVZ Fruko J.Hradec",{"$f":"'1'!V8","v":0},{"$f":"'1(M)'!T8","v":116},{"$f":"'2'!V8","v":50.510000000000005},{"$f":"'2(M)'!T8","v":0},{"$f":"'3'!V8","v":70.52000000000001},{"$f":"'3(M)'!T8","v":0},{"$f":"'4'!V8","v":25.41},{"$f":"'4(M)'!T8","v":0},{"$f":"'5'!V8","v":143.28},{"$f":"'5(M)'!T8","v":0},{"$f":"'6'!V8","v":0},{"$f":"'6(M)'!T8","v":0},405.72,11,"",""]
[null,null,6,"P","VejslíK ","Vladimír","KVZ Fruko J.Hradec",{"$f":"'1'!V9","v":0},{"$f":"'1(M)'!T9","v":123},{"$f":"'2'!V9","v":70.41},{"$f":"'2(M)'!T9","v":0},{"$f":"'3'!V9","v":82.65},{"$f":"'3(M)'!T9","v":0},{"$f":"'4'!V9","v":25.33},{"$f":"'4(M)'!T9","v":0},{"$f":"'5'!V9","v":149.35},{"$f":"'5(M)'!T9","v":0},{"$f":"'6'!V9","v":0},{"$f":"'6(M)'!T9","v":0},450.74,2,"",""]
[null,null,7,"P","Kraus ","Milan","KVZ Týn n Vltavou",{"$f":"'1'!V10","v":0},{"$f":"'1(M)'!T10","v":128},{"$f":"'2'!V10","v":72.210000000000008},{"$f":"'2(M)'!T10","v":0},{"$f":"'3'!V10","v":96.86},{"$f":"'3(M)'!T10","v":0},{"$f":"'4'!V10","v":41.1},{"$f":"'4(M)'!T10","v":0},{"$f":"'5'!V10","v":108.64},{"$f":"'5(M)'!T10","v":0},{"$f":"'6'!V10","v":0},{"$f":"'6(M)'!T10","v":0},446.81,3,"",""]
[null,null,9,"P","Brejžek ","Vojtěch","KVZ Fruko J.Hradec",{"$f":"'1'!V12","v":0},{"$f":"'1(M)'!T11","v":132},{"$f":"'2'!V11","v":69.010000000000005},{"$f":"'2(M)'!T12","v":0},{"$f":"'3'!V11","v":55.03},{"$f":"'3(M)'!T12","v":0},{"$f":"'4'!V11","v":20.98},{"$f":"'4(M)'!T12","v":0},{"$f":"'5'!V11","v":112.1},{"$f":"'5(M)'!T12","v":0},{"$f":"'6'!V12","v":0},{"$f":"'6(M)'!T12","v":0},389.12,14,"",""]
[null,null,10,"P","Získal ","Karel","KVZ Pelhřimov",{"$f":"'1'!V13","v":0},{"$f":"'1(M)'!T12","v":121},{"$f":"'2'!V12","v":68.88},{"$f":"'2(M)'!T13","v":0},{"$f":"'3'!V12","v":79.400000000000006},{"$f":"'3(M)'!T13","v":0},{"$f":"'4'!V12","v":24.810000000000002},{"$f":"'4(M)'!T13","v":0},{"$f":"'5'!V12","v":136.97999999999999},{"$f":"'5(M)'!T13","v":0},{"$f":"'6'!V13","v":0},{"$f":"'6(M)'!T13","v":0},431.06999999999994,4,"",""]
[null,null,11,"R","Získal ","Karel","KVZ Pelhřimov",{"$f":"'1'!V14","v":0},{"$f":"'1(M)'!T13","v":123},{"$f":"'2'!V13","v":54.09},{"$f":"'2(M)'!T14","v":0},{"$f":"'3'!V13","v":33.83},{"$f":"'3(M)'!T14","v":0},{"$f":"'4'!V13","v":16.399999999999999},{"$f":"'4(M)'!T14","v":0},{"$f":"'5'!V13","v":140.44999999999999},{"$f":"'5(M)'!T14","v":0},{"$f":"'6'!V14","v":0},{"$f":"'6(M)'!T14","v":0},367.77,19,"",""]
[null,null,12,"P","Žemličková","Marie","KVZ Týn n Vltavou",{"$f":"'1'!V15","v":0},{"$f":"'1(M)'!T14","v":103},{"$f":"'2'!V14","v":64.47},{"$f":"'2(M)'!T15","v":0},{"$f":"'3'!V14","v":50.64},{"$f":"'3(M)'!T15","v":0},{"$f":"'4'!V14","v":33.28},{"$f":"'4(M)'!T15","v":0},{"$f":"'5'!V14","v":133.34},{"$f":"'5(M)'!T15","v":0},{"$f":"'6'!V15","v":0},{"$f":"'6(M)'!T15","v":0},384.73,16,"",""]
[null,null,13,"P","Žemlička ","Ladislav","KVZ Týn n Vltavou",{"$f":"'1'!V16","v":0},{"$f":"'1(M)'!T15","v":118},{"$f":"'2'!V15","v":64.83},{"$f":"'2(M)'!T16","v":0},{"$f":"'3'!V15","v":56.61},{"$f":"'3(M)'!T16","v":0},{"$f":"'4'!V15","v":15.37},{"$f":"'4(M)'!T16","v":0},{"$f":"'5'!V15","v":123.15},{"$f":"'5(M)'!T16","v":0},{"$f":"'6'!V16","v":0},{"$f":"'6(M)'!T16","v":0},377.96000000000004,17,"",""]
[null,null,14,"P","Janovský ","Jiří","KVZ Policie Počátky",{"$f":"'1'!V17","v":0},{"$f":"'1(M)'!T16","v":52},{"$f":"'2'!V16","v":41.17},{"$f":"'2(M)'!T17","v":0},{"$f":"'3'!V16","v":13.75},{"$f":"'3(M)'!T17","v":0},{"$f":"'4'!V16","v":0},{"$f":"'4(M)'!T17","v":0},{"$f":"'5'!V16","v":45.210000000000008},{"$f":"'5(M)'!T17","v":0},{"$f":"'6'!V17","v":0},{"$f":"'6(M)'!T17","v":0},152.13,25,"",""]
[null,null,15,"P","Janovský ","Mojmír","Kvz Policie Počátky",{"$f":"'1'!V18","v":0},{"$f":"'1(M)'!T17","v":111},{"$f":"'2'!V17","v":61.65},{"$f":"'2(M)'!T18","v":0},{"$f":"'3'!V17","v":35.369999999999997},{"$f":"'3(M)'!T18","v":0},{"$f":"'4'!V17","v":5.0000000000000711E-2},{"$f":"'4(M)'!T18","v":0},{"$f":"'5'!V17","v":80.28},{"$f":"'5(M)'!T18","v":0},{"$f":"'6'!V18","v":0},{"$f":"'6(M)'!T18","v":0},288.35000000000002,22,"",""]
[null,null,16,"P","Herceg","Bohumil","Kvz Policie Počátky",{"$f":"'1'!V19","v":0},{"$f":"'1(M)'!T18","v":119},{"$f":"'2'!V18","v":51.85},{"$f":"'2(M)'!T19","v":0},{"$f":"'3'!V18","v":68.81},{"$f":"'3(M)'!T19","v":0},{"$f":"'4'!V18","v":34.17},{"$f":"'4(M)'!T19","v":0},{"$f":"'5'!V18","v":115.82},{"$f":"'5(M)'!T19","v":0},{"$f":"'6'!V19","v":0},{"$f":"'6(M)'!T19","v":0},389.65,13,"",""]
[null,null,17,"P","Svoboda","Michal","KVZ Počátky",{"$f":"'1'!V20","v":0},{"$f":"'1(M)'!T19","v":118},{"$f":"'2'!V19","v":68.72},{"$f":"'2(M)'!T20","v":0},{"$f":"'3'!V19","v":100.8},{"$f":"'3(M)'!T20","v":0},{"$f":"'4'!V19","v":19.3},{"$f":"'4(M)'!T20","v":0},{"$f":"'5'!V19","v":100.52},{"$f":"'5(M)'!T20","v":0},{"$f":"'6'!V20","v":0},{"$f":"'6(M)'!T20","v":0},407.34,10,"",""]
[null,null,18,"P","Fuksa  ","Viktor","Kvz Policie Počátky",{"$f":"'1'!V21","v":0},{"$f":"'1(M)'!T20","v":130},{"$f":"'2'!V20","v":71.349999999999994},{"$f":"'2(M)'!T21","v":0},{"$f":"'3'!V20","v":67.81},{"$f":"'3(M)'!T21","v":0},{"$f":"'4'!V20","v":24.810000000000002},{"$f":"'4(M)'!T21","v":0},{"$f":"'5'!V20","v":130.57999999999998},{"$f":"'5(M)'!T21","v":0},{"$f":"'6'!V21","v":0},{"$f":"'6(M)'!T21","v":0},424.54999999999995,5,"",""]
[null,null,19,"P","Koch   ml.","Miroslav","Kvz Policie Počátky",{"$f":"'1'!V22","v":0},{"$f":"'1(M)'!T21","v":131},{"$f":"'2'!V21","v":57.480000000000004},{"$f":"'2(M)'!T22","v":0},{"$f":"'3'!V21","v":63.55},{"$f":"'3(M)'!T22","v":0},{"$f":"'4'!V21","v":25.619999999999997},{"$f":"'4(M)'!T22","v":0},{"$f":"'5'!V21","v":141.91},{"$f":"'5(M)'!T22","v":0},{"$f":"'6'!V22","v":0},{"$f":"'6(M)'!T22","v":0},419.56000000000006,8,"",""]
[null,null,20,"P","Koch  st. ","Miroslav","Kvz Policie Počátky",{"$f":"'1'!V23","v":0},{"$f":"'1(M)'!T22","v":133},{"$f":"'2'!V22","v":71.69},{"$f":"'2(M)'!T23","v":0},{"$f":"'3'!V22","v":82.68},{"$f":"'3(M)'!T23","v":0},{"$f":"'4'!V22","v":37.730000000000004},{"$f":"'4(M)'!T23","v":0},{"$f":"'5'!V22","v":128.23000000000002},{"$f":"'5(M)'!T23","v":0},{"$f":"'6'!V23","v":0},{"$f":"'6(M)'!T23","v":0},453.33000000000004,1,"",""]
[null,null,21,"P","Kostříž ","Jaroslav","Kvz Policie Počátky",{"$f":"'1'!V24","v":0},{"$f":"'1(M)'!T23","v":120},{"$f":"'2'!V23","v":71.23},{"$f":"'2(M)'!T24","v":0},{"$f":"'3'!V23","v":62.09},{"$f":"'3(M)'!T24","v":0},{"$f":"'4'!V23","v":18},{"$f":"'4(M)'!T24","v":0},{"$f":"'5'!V23","v":115.66},{"$f":"'5(M)'!T24","v":0},{"$f":"'6'!V24","v":0},{"$f":"'6(M)'!T24","v":0},386.98,15,"",""]
[null,null,22,"P","Čekal ","Josef","KVZ Fruko J.Hradec",{"$f":"'1'!V25","v":0},{"$f":"'1(M)'!T24","v":110},{"$f":"'2'!V24","v":47.54},{"$f":"'2(M)'!T25","v":0},{"$f":"'3'!V24","v":68.460000000000008},{"$f":"'3(M)'!T25","v":0},{"$f":"'4'!V24","v":23.17},{"$f":"'4(M)'!T25","v":0},{"$f":"'5'!V24","v":121.51},{"$f":"'5(M)'!T25","v":0},{"$f":"'6'!V25","v":0},{"$f":"'6(M)'!T25","v":0},370.68,18,"",""]
[null,null,23,"P","Petržílka","Miloslav","KVZ UVS J.Hradec",{"$f":"'1'!V26","v":0},{"$f":"'1(M)'!T25","v":120},{"$f":"'2'!V25","v":63.83},{"$f":"'2(M)'!T26","v":0},{"$f":"'3'!V25","v":71.430000000000007},{"$f":"'3(M)'!T26","v":0},{"$f":"'4'!V25","v":28.6},{"$f":"'4(M)'!T26","v":0},{"$f":"'5'!V25","v":138.31},{"$f":"'5(M)'!T26","v":0},{"$f":"'6'!V26","v":0},{"$f":"'6(M)'!T26","v":0},422.17,6,"",""]
[null,null,24,"P","Landkammer","Václav","KVZ Fruko J.Hradec",{"$f":"'1'!V27","v":0},{"$f":"'1(M)'!T26","v":115},{"$f":"'2'!V26","v":67.349999999999994},{"$f":"'2(M)'!T27","v":0},{"$f":"'3'!V26","v":47.06},{"$f":"'3(M)'!T27","v":0},{"$f":"'4'!V26","v":24.3},{"$f":"'4(M)'!T27","v":0},{"$f":"'5'!V26","v":61.25},{"$f":"'5(M)'!T27","v":0},{"$f":"'6'!V27","v":0},{"$f":"'6(M)'!T27","v":0},314.96000000000004,21,"",""]
[null,null,25,"P","Wrzecionko","Albert","KVZ Fruko J.Hradec",{"$f":"'1'!V28","v":0},{"$f":"'1(M)'!T27","v":103},{"$f":"'2'!V27","v":46.980000000000004},{"$f":"'2(M)'!T28","v":0},{"$f":"'3'!V27","v":56.32},{"$f":"'3(M)'!T28","v":0},{"$f":"'4'!V27","v":2.66},{"$f":"'4(M)'!T28","v":0},{"$f":"'5'!V27","v":106.25},{"$f":"'5(M)'!T28","v":0},{"$f":"'6'!V28","v":0},{"$f":"'6(M)'!T28","v":0},315.21000000000004,20,"",""]
[null,null,26,"P","Reisnerová","Michaela","KVZ  Fruko",{"$f":"'1'!V29","v":0},{"$f":"'1(M)'!T28","v":49},{"$f":"'2'!V28","v":48.510000000000005},{"$f":"'2(M)'!T29","v":0},{"$f":"'3'!V28","v":18},{"$f":"'3(M)'!T29","v":0},{"$f":"'4'!V28","v":0},{"$f":"'4(M)'!T29","v":0},{"$f":"'5'!V28","v":97.46},{"$f":"'5(M)'!T29","v":0},{"$f":"'6'!V29","v":0},{"$f":"'6(M)'!T29","v":0},212.97,24,"",""]
[null,null,27,"P","Urbanec  ","Antonín","KVZ Fruko J.Hradec",{"$f":"'1'!V30","v":0},{"$f":"'1(M)'!T29","v":85},{"$f":"'2'!V29","v":41.85},{"$f":"'2(M)'!T30","v":0},{"$f":"'3'!V29","v":53.7},{"$f":"'3(M)'!T30","v":0},{"$f":"'4'!V29","v":5.59},{"$f":"'4(M)'!T30","v":0},{"$f":"'5'!V29","v":97.03},{"$f":"'5(M)'!T30","v":0},{"$f":"'6'!V30","v":0},{"$f":"'6(M)'!T30","v":0},283.17,23,"",""]
[null,null,56,"P",null,null,null,{"$f":"'1'!V59","v":0},{"$f":"'1(M)'!T58","v":0},{"$f":"'2'!V58","v":0},{"$f":"'2(M)'!T59","v":0},{"$f":"'3'!V58","v":0},{"$f":"'3(M)'!T59","v":0},{"$f":"'4'!V58","v":0},{"$f":"'4(M)'!T59","v":0},{"$f":"'5'!V58","v":0},{"$f":"'5(M)'!T59","v":0},{"$f":"'6'!V59","v":0},{"$f":"'6(M)'!T59","v":0},{"$f":"IF(SUM(H32:S32)<0,0,SUM(H32:S32))","v":0},27,"",""]
[null,null,57,"P",null,null,null,{"$f":"'1'!V60","v":0},{"$f":"'1(M)'!T59","v":0},{"$f":"'2'!V59","v":0},{"$f":"'2(M)'!T60","v":0},{"$f":"'3'!V59","v":0},{"$f":"'3(M)'!T60","v":0},{"$f":"'4'!V59","v":0},{"$f":"'4(M)'!T60","v":0},{"$f":"'5'!V59","v":0},{"$f":"'5(M)'!T60","v":0},{"$f":"'6'!V60","v":0},{"$f":"'6(M)'!T60","v":0},0,27,"",""]
[null,null,58,"P",null,null,null,{"$f":"'1'!V61","v":0},{"$f":"'1(M)'!T60","v":0},{"$f":"'2'!V60","v":0},{"$f":"'2(M)'!T61","v":0},{"$f":"'3'!V60","v":0},{"$f":"'3(M)'!T61","v":0},{"$f":"'4'!V60","v":0},{"$f":"'4(M)'!T61","v":0},{"$f":"'5'!V60","v":0},{"$f":"'5(M)'!T61","v":0},{"$f":"'6'!V61","v":0},{"$f":"'6(M)'!T61","v":0},0,27,"",""]
[null,null,59,"P",null,null,null,{"$f":"'1'!V62","v":0},{"$f":"'1(M)'!T61","v":0},{"$f":"'2'!V61","v":0},{"$f":"'2(M)'!T62","v":0},{"$f":"'3'!V61","v":0},{"$f":"'3(M)'!T62","v":0},{"$f":"'4'!V61","v":0},{"$f":"'4(M)'!T62","v":0},{"$f":"'5'!V61","v":0},{"$f":"'5(M)'!T62","v":0},{"$f":"'6'!V62","v":0},{"$f":"'6(M)'!T62","v":0},0,27,"",""]
[null,null,60,"P",null,null,null,{"$f":"'1'!V63","v":0},{"$f":"'1(M)'!T62","v":0},{"$f":"'2'!V62","v":0},{"$f":"'2(M)'!T63","v":0},{"$f":"'3'!V62","v":0},{"$f":"'3(M)'!T63","v":0},{"$f":"'4'!V62","v":0},{"$f":"'4(M)'!T63","v":0},{"$f":"'5'!V62","v":0},{"$f":"'5(M)'!T63","v":0},{"$f":"'6'!V63","v":0},{"$f":"'6(M)'!T63","v":0},0,27,"",""]
[null,null,61,"P",null,null,null,{"$f":"'1'!V64","v":0},{"$f":"'1(M)'!T63","v":0},{"$f":"'2'!V63","v":0},{"$f":"'2(M)'!T64","v":0},{"$f":"'3'!V63","v":0},{"$f":"'3(M)'!T64","v":0},{"$f":"'4'!V63","v":0},{"$f":"'4(M)'!T64","v":0},{"$f":"'5'!V63","v":0},{"$f":"'5(M)'!T64","v":0},{"$f":"'6'!V64","v":0},{"$f":"'6(M)'!T64","v":0},0,27,"",""]
[null,null,62,"P",null,null,null,{"$f":"'1'!V65","v":0},{"$f":"'1(M)'!T64","v":0},{"$f":"'2'!V64","v":0},{"$f":"'2(M)'!T65","v":0},{"$f":"'3'!V64","v":0},{"$f":"'3(M)'!T65","v":0},{"$f":"'4'!V64","v":0},{"$f":"'4(M)'!T65","v":0},{"$f":"'5'!V64","v":0},{"$f":"'5(M)'!T65","v":0},{"$f":"'6'!V65","v":0},{"$f":"'6(M)'!T65","v":0},0,{"$f":"RANK(T38,$T$6:$T$75)","v":27},{"$f":"IF($B38=\"K\",SUMIFS($T$6:$T$75,$A$6:$A$75,A38),\"\")","v":""},{"$f":"IF($B38=\"K\",RANK(V38,$V$6:$V$75),\"\")","v":""}]
[null,null,63,"P",null,null,null,{"$f":"'1'!V66","v":0},{"$f":"'1(M)'!T65","v":0},{"$f":"'2'!V65","v":0},{"$f":"'2(M)'!T66","v":0},{"$f":"'3'!V65","v":0},{"$f":"'3(M)'!T66","v":0},{"$f":"'4'!V65","v":0},{"$f":"'4(M)'!T66","v":0},{"$f":"'5'!V65","v":0},{"$f":"'5(M)'!T66","v":0},{"$f":"'6'!V66","v":0},{"$f":"'6(M)'!T66","v":0},0,27,"",""]
[null,null,64,"P",null,null,null,{"$f":"'1'!V67","v":0},{"$f":"'1(M)'!T66","v":0},{"$f":"'2'!V66","v":0},{"$f":"'2(M)'!T67","v":0},{"$f":"'3'!V66","v":0},{"$f":"'3(M)'!T67","v":0},{"$f":"'4'!V66","v":0},{"$f":"'4(M)'!T67","v":0},{"$f":"'5'!V66","v":0},{"$f":"'5(M)'!T67","v":0},{"$f":"'6'!V67","v":0},{"$f":"'6(M)'!T67","v":0},0,27,"",""]
[null,null,65,"P",null,null,null,{"$f":"'1'!V68","v":0},{"$f":"'1(M)'!T67","v":0},{"$f":"'2'!V67","v":0},{"$f":"'2(M)'!T68","v":0},{"$f":"'3'!V67","v":0},{"$f":"'3(M)'!T68","v":0},{"$f":"'4'!V67","v":0},{"$f":"'4(M)'!T68","v":0},{"$f":"'5'!V67","v":0},{"$f":"'5(M)'!T68","v":0},{"$f":"'6'!V68","v":0},{"$f":"'6(M)'!T68","v":0},0,27,"",""]
[null,null,66,"P",null,null,null,{"$f":"'1'!V69","v":0},{"$f":"'1(M)'!T68","v":0},{"$f":"'2'!V68","v":0},{"$f":"'2(M)'!T69","v":0},{"$f":"'3'!V68","v":0},{"$f":"'3(M)'!T69","v":0},{"$f":"'4'!V68","v":0},{"$f":"'4(M)'!T69","v":0},{"$f":"'5'!V68","v":0},{"$f":"'5(M)'!T69","v":0},{"$f":"'6'!V69","v":0},{"$f":"'6(M)'!T69","v":0},0,27,"",""]
[null,null,67,"P",null,null,null,{"$f":"'1'!V70","v":0},{"$f":"'1(M)'!T69","v":0},{"$f":"'2'!V69","v":0},{"$f":"'2(M)'!T70","v":0},{"$f":"'3'!V69","v":0},{"$f":"'3(M)'!T70","v":0},{"$f":"'4'!V69","v":0},{"$f":"'4(M)'!T70","v":0},{"$f":"'5'!V69","v":0},{"$f":"'5(M)'!T70","v":0},{"$f":"'6'!V70","v":0},{"$f":"'6(M)'!T70","v":0},0,27,"",""]
[null,null,68,"P",null,null,null,{"$f":"'1'!V71","v":0},{"$f":"'1(M)'!T70","v":0},{"$f":"'2'!V70","v":0},{"$f":"'2(M)'!T71","v":0},{"$f":"'3'!V70","v":0},{"$f":"'3(M)'!T71","v":0},{"$f":"'4'!V70","v":0},{"$f":"'4(M)'!T71","v":0},{"$f":"'5'!V70","v":0},{"$f":"'5(M)'!T71","v":0},{"$f":"'6'!V71","v":0},{"$f":"'6(M)'!T71","v":0},0,27,"",""]
[null,null,69,"P",null,null,null,{"$f":"'1'!V72","v":0},{"$f":"'1(M)'!T71","v":0},{"$f":"'2'!V71","v":0},{"$f":"'2(M)'!T72","v":0},{"$f":"'3'!V71","v":0},{"$f":"'3(M)'!T72","v":0},{"$f":"'4'!V71","v":0},{"$f":"'4(M)'!T72","v":0},{"$f":"'5'!V71","v":0},{"$f":"'5(M)'!T72","v":0},{"$f":"'6'!V72","v":0},{"$f":"'6(M)'!T72","v":0},0,27,"",""]
[null,null,70,"P",null,null,null,{"$f":"'1'!V73","v":0},{"$f":"'1(M)'!T72","v":0},{"$f":"'2'!V72","v":0},{"$f":"'2(M)'!T73","v":0},{"$f":"'3'!V72","v":0},{"$f":"'3(M)'!T73","v":0},{"$f":"'4'!V72","v":0},{"$f":"'4(M)'!T73","v":0},{"$f":"'5'!V72","v":0},{"$f":"'5(M)'!T73","v":0},{"$f":"'6'!V73","v":0},{"$f":"'6(M)'!T73","v":0},0,27,"",""]
[null,null,71,"P",null,null,null,{"$f":"'1'!V74","v":0},{"$f":"'1(M)'!T73","v":0},{"$f":"'2'!V73","v":0},{"$f":"'2(M)'!T74","v":0},{"$f":"'3'!V73","v":0},{"$f":"'3(M)'!T74","v":0},{"$f":"'4'!V73","v":0},{"$f":"'4(M)'!T74","v":0},{"$f":"'5'!V73","v":0},{"$f":"'5(M)'!T74","v":0},{"$f":"'6'!V74","v":0},{"$f":"'6(M)'!T74","v":0},0,27,"",""]
[null,null,72,"P",null,null,null,{"$f":"'1'!V75","v":0},{"$f":"'1(M)'!T74","v":0},{"$f":"'2'!V74","v":0},{"$f":"'2(M)'!T75","v":0},{"$f":"'3'!V74","v":0},{"$f":"'3(M)'!T75","v":0},{"$f":"'4'!V74","v":0},{"$f":"'4(M)'!T75","v":0},{"$f":"'5'!V74","v":0},{"$f":"'5(M)'!T75","v":0},{"$f":"'6'!V75","v":0},{"$f":"'6(M)'!T75","v":0},0,27,"",""]
[null,null,73,"P",null,null,null,{"$f":"'1'!V76","v":0},{"$f":"'1(M)'!T75","v":0},{"$f":"'2'!V75","v":0},{"$f":"'2(M)'!T76","v":0},{"$f":"'3'!V75","v":0},{"$f":"'3(M)'!T76","v":0},{"$f":"'4'!V75","v":0},{"$f":"'4(M)'!T76","v":0},{"$f":"'5'!V75","v":0},{"$f":"'5(M)'!T76","v":0},{"$f":"'6'!V76","v":0},{"$f":"'6(M)'!T76","v":0},0,27,"",""]
[null,null,74,"P",null,null,null,{"$f":"'1'!V77","v":0},{"$f":"'1(M)'!T76","v":0},{"$f":"'2'!V76","v":0},{"$f":"'2(M)'!T77","v":0},{"$f":"'3'!V76","v":0},{"$f":"'3(M)'!T77","v":0},{"$f":"'4'!V76","v":0},{"$f":"'4(M)'!T77","v":0},{"$f":"'5'!V76","v":0},{"$f":"'5(M)'!T77","v":0},{"$f":"'6'!V77","v":0},{"$f":"'6(M)'!T77","v":0},0,27,"",""]
[null,null,75,"P",null,null,null,{"$f":"'1'!V78","v":0},{"$f":"'1(M)'!T77","v":0},{"$f":"'2'!V77","v":0},{"$f":"'2(M)'!T78","v":0},{"$f":"'3'!V77","v":0},{"$f":"'3(M)'!T78","v":0},{"$f":"'4'!V77","v":0},{"$f":"'4(M)'!T78","v":0},{"$f":"'5'!V77","v":0},{"$f":"'5(M)'!T78","v":0},{"$f":"'6'!V78","v":0},{"$f":"'6(M)'!T78","v":0},0,27,"",""]
[null,null,76,"P",null,null,null,{"$f":"'1'!V79","v":0},{"$f":"'1(M)'!T78","v":0},{"$f":"'2'!V78","v":0},{"$f":"'2(M)'!T79","v":0},{"$f":"'3'!V78","v":0},{"$f":"'3(M)'!T79","v":0},{"$f":"'4'!V78","v":0},{"$f":"'4(M)'!T79","v":0},{"$f":"'5'!V78","v":0},{"$f":"'5(M)'!T79","v":0},{"$f":"'6'!V79","v":0},{"$f":"'6(M)'!T79","v":0},0,27,"",""]
[null,null,77,"P",null,null,null,{"$f":"'1'!V80","v":0},{"$f":"'1(M)'!T79","v":0},{"$f":"'2'!V79","v":0},{"$f":"'2(M)'!T80","v":0},{"$f":"'3'!V79","v":0},{"$f":"'3(M)'!T80","v":0},{"$f":"'4'!V79","v":0},{"$f":"'4(M)'!T80","v":0},{"$f":"'5'!V79","v":0},{"$f":"'5(M)'!T80","v":0},{"$f":"'6'!V80","v":0},{"$f":"'6(M)'!T80","v":0},0,27,"",""]
[null,null,78,"P",null,null,null,{"$f":"'1'!V81","v":0},{"$f":"'1(M)'!T80","v":0},{"$f":"'2'!V80","v":0},{"$f":"'2(M)'!T81","v":0},{"$f":"'3'!V80","v":0},{"$f":"'3(M)'!T81","v":0},{"$f":"'4'!V80","v":0},{"$f":"'4(M)'!T81","v":0},{"$f":"'5'!V80","v":0},{"$f":"'5(M)'!T81","v":0},{"$f":"'6'!V81","v":0},{"$f":"'6(M)'!T81","v":0},0,27,"",""]
[null,null,79,"P",null,null,null,{"$f":"'1'!V82","v":0},{"$f":"'1(M)'!T81","v":0},{"$f":"'2'!V81","v":0},{"$f":"'2(M)'!T82","v":0},{"$f":"'3'!V81","v":0},{"$f":"'3(M)'!T82","v":0},{"$f":"'4'!V81","v":0},{"$f":"'4(M)'!T82","v":0},{"$f":"'5'!V81","v":0},{"$f":"'5(M)'!T82","v":0},{"$f":"'6'!V82","v":0},{"$f":"'6(M)'!T82","v":0},0,27,"",""]
[null,null,80,"P",null,null,null,{"$f":"'1'!V83","v":0},{"$f":"'1(M)'!T82","v":0},{"$f":"'2'!V82","v":0},{"$f":"'2(M)'!T83","v":0},{"$f":"'3'!V82","v":0},{"$f":"'3(M)'!T83","v":0},{"$f":"'4'!V82","v":0},{"$f":"'4(M)'!T83","v":0},{"$f":"'5'!V82","v":0},{"$f":"'5(M)'!T83","v":0},{"$f":"'6'!V83","v":0},{"$f":"'6(M)'!T83","v":0},0,27,"",""]
[null,null,81,"P",null,null,null,{"$f":"'1'!V84","v":0},{"$f":"'1(M)'!T83","v":0},{"$f":"'2'!V83","v":0},{"$f":"'2(M)'!T84","v":0},{"$f":"'3'!V83","v":0},{"$f":"'3(M)'!T84","v":0},{"$f":"'4'!V83","v":0},{"$f":"'4(M)'!T84","v":0},{"$f":"'5'!V83","v":0},{"$f":"'5(M)'!T84","v":0},{"$f":"'6'!V84","v":0},{"$f":"'6(M)'!T84","v":0},0,27,"",""]
[null,null,82,"P",null,null,null,{"$f":"'1'!V85","v":0},{"$f":"'1(M)'!T84","v":0},{"$f":"'2'!V84","v":0},{"$f":"'2(M)'!T85","v":0},{"$f":"'3'!V84","v":0},{"$f":"'3(M)'!T85","v":0},{"$f":"'4'!V84","v":0},{"$f":"'4(M)'!T85","v":0},{"$f":"'5'!V84","v":0},{"$f":"'5(M)'!T85","v":0},{"$f":"'6'!V85","v":0},{"$f":"'6(M)'!T85","v":0},0,27,"",""]
[null,null,83,"P",null,null,null,{"$f":"'1'!V86","v":0},{"$f":"'1(M)'!T85","v":0},{"$f":"'2'!V85","v":0},{"$f":"'2(M)'!T86","v":0},{"$f":"'3'!V85","v":0},{"$f":"'3(M)'!T86","v":0},{"$f":"'4'!V85","v":0},{"$f":"'4(M)'!T86","v":0},{"$f":"'5'!V85","v":0},{"$f":"'5(M)'!T86","v":0},{"$f":"'6'!V86","v":0},{"$f":"'6(M)'!T86","v":0},0,27,"",""]
[null,null,84,"P",null,null,null,{"$f":"'1'!V87","v":0},{"$f":"'1(M)'!T86","v":0},{"$f":"'2'!V86","v":0},{"$f":"'2(M)'!T87","v":0},{"$f":"'3'!V86","v":0},{"$f":"'3(M)'!T87","v":0},{"$f":"'4'!V86","v":0},{"$f":"'4(M)'!T87","v":0},{"$f":"'5'!V86","v":0},{"$f":"'5(M)'!T87","v":0},{"$f":"'6'!V87","v":0},{"$f":"'6(M)'!T87","v":0},0,27,"",""]
[null,null,85,"P",null,null,null,{"$f":"'1'!V88","v":0},{"$f":"'1(M)'!T87","v":0},{"$f":"'2'!V87","v":0},{"$f":"'2(M)'!T88","v":0},{"$f":"'3'!V87","v":0},{"$f":"'3(M)'!T88","v":0},{"$f":"'4'!V87","v":0},{"$f":"'4(M)'!T88","v":0},{"$f":"'5'!V87","v":0},{"$f":"'5(M)'!T88","v":0},{"$f":"'6'!V88","v":0},{"$f":"'6(M)'!T88","v":0},0,27,"",""]
[null,null,86,"P",null,null,null,{"$f":"'1'!V89","v":0},{"$f":"'1(M)'!T88","v":0},{"$f":"'2'!V88","v":0},{"$f":"'2(M)'!T89","v":0},{"$f":"'3'!V88","v":0},{"$f":"'3(M)'!T89","v":0},{"$f":"'4'!V88","v":0},{"$f":"'4(M)'!T89","v":0},{"$f":"'5'!V88","v":0},{"$f":"'5(M)'!T89","v":0},{"$f":"'6'!V89","v":0},{"$f":"'6(M)'!T89","v":0},0,27,"",""]
[null,null,87,"P",null,null,null,{"$f":"'1'!V90","v":0},{"$f":"'1(M)'!T89","v":0},{"$f":"'2'!V89","v":0},{"$f":"'2(M)'!T90","v":0},{"$f":"'3'!V89","v":0},{"$f":"'3(M)'!T90","v":0},{"$f":"'4'!V89","v":0},{"$f":"'4(M)'!T90","v":0},{"$f":"'5'!V89","v":0},{"$f":"'5(M)'!T90","v":0},{"$f":"'6'!V90","v":0},{"$f":"'6(M)'!T90","v":0},0,27,"",""]
[null,null,88,"P",null,null,null,{"$f":"'1'!V91","v":0},{"$f":"'1(M)'!T90","v":0},{"$f":"'2'!V90","v":0},{"$f":"'2(M)'!T91","v":0},{"$f":"'3'!V90","v":0},{"$f":"'3(M)'!T91","v":0},{"$f":"'4'!V90","v":0},{"$f":"'4(M)'!T91","v":0},{"$f":"'5'!V90","v":0},{"$f":"'5(M)'!T91","v":0},{"$f":"'6'!V91","v":0},{"$f":"'6(M)'!T91","v":0},0,27,"",""]
[null,null,89,"P",null,null,null,{"$f":"'1'!V92","v":0},{"$f":"'1(M)'!T91","v":0},{"$f":"'2'!V91","v":0},{"$f":"'2(M)'!T92","v":0},{"$f":"'3'!V91","v":0},{"$f":"'3(M)'!T92","v":0},{"$f":"'4'!V91","v":0},{"$f":"'4(M)'!T92","v":0},{"$f":"'5'!V91","v":0},{"$f":"'5(M)'!T92","v":0},{"$f":"'6'!V92","v":0},{"$f":"'6(M)'!T92","v":0},0,27,"",""]
[null,null,90,"P",null,null,null,{"$f":"'1'!V93","v":0},{"$f":"'1(M)'!T92","v":0},{"$f":"'2'!V92","v":0},{"$f":"'2(M)'!T93","v":0},{"$f":"'3'!V92","v":0},{"$f":"'3(M)'!T93","v":0},{"$f":"'4'!V92","v":0},{"$f":"'4(M)'!T93","v":0},{"$f":"'5'!V92","v":0},{"$f":"'5(M)'!T93","v":0},{"$f":"'6'!V93","v":0},{"$f":"'6(M)'!T93","v":0},0,27,"",""]
[null,null,91,"P",null,null,null,{"$f":"'1'!V94","v":0},{"$f":"'1(M)'!T93","v":0},{"$f":"'2'!V93","v":0},{"$f":"'2(M)'!T94","v":0},{"$f":"'3'!V93","v":0},{"$f":"'3(M)'!T94","v":0},{"$f":"'4'!V93","v":0},{"$f":"'4(M)'!T94","v":0},{"$f":"'5'!V93","v":0},{"$f":"'5(M)'!T94","v":0},{"$f":"'6'!V94","v":0},{"$f":"'6(M)'!T94","v":0},0,27,"",""]
[null,null,92,"P",null,null,null,{"$f":"'1'!V95","v":0},{"$f":"'1(M)'!T94","v":0},{"$f":"'2'!V94","v":0},{"$f":"'2(M)'!T95","v":0},{"$f":"'3'!V94","v":0},{"$f":"'3(M)'!T95","v":0},{"$f":"'4'!V94","v":0},{"$f":"'4(M)'!T95","v":0},{"$f":"'5'!V94","v":0},{"$f":"'5(M)'!T95","v":0},{"$f":"'6'!V95","v":0},{"$f":"'6(M)'!T95","v":0},0,27,"",""]
[null,null,93,"P",null,null,null,{"$f":"'1'!V96","v":0},{"$f":"'1(M)'!T95","v":0},{"$f":"'2'!V95","v":0},{"$f":"'2(M)'!T96","v":0},{"$f":"'3'!V95","v":0},{"$f":"'3(M)'!T96","v":0},{"$f":"'4'!V95","v":0},{"$f":"'4(M)'!T96","v":0},{"$f":"'5'!V95","v":0},{"$f":"'5(M)'!T96","v":0},{"$f":"'6'!V96","v":0},{"$f":"'6(M)'!T96","v":0},0,27,"",""]
[null,null,94,"P",null,null,null,{"$f":"'1'!V97","v":0},{"$f":"'1(M)'!T96","v":0},{"$f":"'2'!V96","v":0},{"$f":"'2(M)'!T97","v":0},{"$f":"'3'!V96","v":0},{"$f":"'3(M)'!T97","v":0},{"$f":"'4'!V96","v":0},{"$f":"'4(M)'!T97","v":0},{"$f":"'5'!V96","v":0},{"$f":"'5(M)'!T97","v":0},{"$f":"'6'!V97","v":0},{"$f":"'6(M)'!T97","v":0},0,{"$f":"RANK(T70,$T$6:$T$75)","v":27},{"$f":"IF($B70=\"K\",SUMIFS($T$6:$T$75,$A$6:$A$75,A70),\"\")","v":""},{"$f":"IF($B70=\"K\",RANK(V70,$V$6:$V$75),\"\")","v":""}]
[null,null,95,"P",null,null,null,{"$f":"'1'!V98","v":0},{"$f":"'1(M)'!T97","v":0},{"$f":"'2'!V97","v":0},{"$f":"'2(M)'!T98","v":0},{"$f":"'3'!V97","v":0},{"$f":"'3(M)'!T98","v":0},{"$f":"'4'!V97","v":0},{"$f":"'4(M)'!T98","v":0},{"$f":"'5'!V97","v":0},{"$f":"'5(M)'!T98","v":0},{"$f":"'6'!V98","v":0},{"$f":"'6(M)'!T98","v":0},0,27,"",""]
[null,null,96,"P",null,null,null,{"$f":"'1'!V99","v":0},{"$f":"'1(M)'!T98","v":0},{"$f":"'2'!V98","v":0},{"$f":"'2(M)'!T99","v":0},{"$f":"'3'!V98","v":0},{"$f":"'3(M)'!T99","v":0},{"$f":"'4'!V98","v":0},{"$f":"'4(M)'!T99","v":0},{"$f":"'5'!V98","v":0},{"$f":"'5(M)'!T99","v":0},{"$f":"'6'!V99","v":0},{"$f":"'6(M)'!T99","v":0},0,27,"",""]
[null,null,97,"P",null,null,null,{"$f":"'1'!V100","v":0},{"$f":"'1(M)'!T99","v":0},{"$f":"'2'!V99","v":0},{"$f":"'2(M)'!T100","v":0},{"$f":"'3'!V99","v":0},{"$f":"'3(M)'!T100","v":0},{"$f":"'4'!V99","v":0},{"$f":"'4(M)'!T100","v":0},{"$f":"'5'!V99","v":0},{"$f":"'5(M)'!T100","v":0},{"$f":"'6'!V100","v":0},{"$f":"'6(M)'!T100","v":0},0,27,"",""]
[null,null,98,"P",null,null,null,{"$f":"'1'!V101","v":0},{"$f":"'1(M)'!T100","v":0},{"$f":"'2'!V100","v":0},{"$f":"'2(M)'!T101","v":0},{"$f":"'3'!V100","v":0},{"$f":"'3(M)'!T101","v":0},{"$f":"'4'!V100","v":0},{"$f":"'4(M)'!T101","v":0},{"$f":"'5'!V100","v":0},{"$f":"'5(M)'!T101","v":0},{"$f":"'6'!V101","v":0},{"$f":"'6(M)'!T101","v":0},0,27,"",""]
[null,null,99,"P",null,null,null,{"$f":"'1'!V102","v":0},{"$f":"'1(M)'!T101","v":0},{"$f":"'2'!V101","v":0},{"$f":"'2(M)'!T102","v":0},{"$f":"'3'!V101","v":0},{"$f":"'3(M)'!T102","v":0},{"$f":"'4'!V101","v":0},{"$f":"'4(M)'!T102","v":0},{"$f":"'5'!V101","v":0},{"$f":"'5(M)'!T102","v":0},{"$f":"'6'!V102","v":0},{"$f":"'6(M)'!T102","v":0},{"$f":"IF(SUM(H75:S75)<0,0,SUM(H75:S75))","v":0},27,"",""]
[]
[null,null,null,null,null,null,"2019-03-31T14:30:00"]
[]
[null,null,"Hlavní rozhodčí ",null,null,"1-089",null,null,null,"řiditel soutěže"]
[null,null,null,null,null,null,null,null,null,null,null,null,null,null,null,null,null,null,null," n"]

{"sheet":"1","index":2,"n_rows":102,"n_cols":22,"rows_kept":102,"cut":false,"hidden":true,"merged":[[0,3,0,20],[0,0,2,0],[0,1,2,1]]}
["Druž.","Kap.",null,"Disciplina 1"]
[]
[null,null,null,null,null,"K","M",1,2,3,4,5,6,7,8,9,10,11,12,"TB","Čas","Součet"]
[{"$f":"IF(Prezentace!A6=0,\"\",Prezentace!A6)","v":""},{"$f":"IF(Prezentace!B6=0,\"\",Prezentace!B6)","v":""},{"$f":"Prezentace!D6","v":"P"},{"$f":"IF(Prezentace!F6=0,\"\",Prezentace!F6)","v":"Milan"},{"$f":"IF(Prezentace!E6=0,\"\",Prezentace!E6)","v":"Matějka st."},null,null,null,null,null,null,null,null,null,null,null,null,null,null,null,null,{"$f":"(SUM(F4:T4))-U4","v":0}]
[{"$f":"IF(Prezentace!A7=0,\"\",Prezentace!A7)","v":""},{"$f":"IF(Prezentace!B7=0,\"\",Prezentace!B7)","v":""},{"$f":"Prezentace!D7","v":"P"},{"$f":"IF(Prezentace!F7=0,\"\",Prezentace!F7)","v":"Miroslav"},{"$f":"IF(Prezentace!E7=0,\"\",Prezentace!E7)","v":"Fiala  "},null,null,null,null,null,null,null,null,null,null,null,null,null,null,null,null,{"$f":"(SUM(F5:T5))-U5","v":0}]
[{"$f":"IF(Prezentace!A8=0,\"\",Prezentace!A8)","v":""},{"$f":"IF(Prezentace!B8=0,\"\",Prezentace!B8)","v":""},{"$f":"Prezentace!D8","v":"P"},{"$f":"IF(Prezentace!F8=0,\"\",Prezentace!F8)","v":"František"},{"$f":"IF(Prezentace!E8=0,\"\",Prezentace!E8)","v":"Toman "},null,null,null,null,null,null,null,null,null,null,null,null,null,null,null,null,0]
[{"$f":"IF(Prezentace!A9=0,\"\",Prezentace!A9)","v":""},{"$f":"IF(Prezentace!B9=0,\"\",Prezentace!B9)","v":""},{"$f":"Prezentace!D9","v":"P"},{"$f":"IF(Prezentace!F9=0,\"\",Prezentace!F9)","v":"Jiří"},{"$f":"IF(Prezentace!E9=0,\"\",Prezentace!E9)","v":"Švihálek "},null,null,null,null,null,null,null,null,null,null,null,null,null,null,null,null,0]
[{"$f":"IF(Prezentace!A10=0,\"\",Prezentace!A10)","v":""},{"$f":"IF(Prezentace!B10=0,\"\",Prezentace!B10)","v":""},{"$f":"Prezentace!D10","v":"R"},{"$f":"IF(Prezentace!F10=0,\"\",Prezentace!F10)","v":"Jiří"},{"$f":"IF(Prezentace!E10=0,\"\",Prezentace!E10)","v":"Švihálek "},null,null,null,null,null,null,null,null,null,null,null,null,null,null,null,null,0]
[{"$f":"IF(Prezentace!A11=0,\"\",Prezentace!A11)","v":""},{"$f":"IF(Prezentace!B11=0,\"\",Prezentace!B11)","v":""},{"$f":"Prezentace!D11","v":"P"},{"$f":"IF(Prezentace!F11=0,\"\",Prezentace!F11)","v":"Vladimír"},{"$f":"IF(Prezentace!E11=0,\"\",Prezentace!E11)","v":"VejslíK "},null,null,null,null,null,null,null,null,null,null,null,null,null,null,null,null,0]
[{"$f":"IF(Prezentace!A12=0,\"\",Prezentace!A12)","v":""},{"$f":"IF(Prezentace!B12=0,\"\",Prezentace!B12)","v":""},{"$f":"Prezentace!D12","v":"P"},{"$f":"IF(Prezentace!F12=0,\"\",Prezentace!F12)","v":"Milan"},{"$f":"IF(Prezentace!E12=0,\"\",Prezentace!E12)","v":"Kraus "},null,null,null,null,null,null,null,null,null,null,null,null,null,null,null,null,0]
[{"$f":"IF(Prezentace!#REF!=0,\"\",Prezentace!#REF!)","v":{"$error":"#REF!"}},{"$f":"IF(Prezentace!#REF!=0,\"\",Prezentace!#REF!)","v":{"$error":"#REF!"}},{"$f":"Prezentace!#REF!","v":{"$error":"#REF!"}},{"$f":"IF(Prezentace!#REF!=0,\"\",Prezentace!#REF!)","v":{"$error":"#REF!"}},{"$f":"IF(Prezentace!#REF!=0,\"\",Prezentace!#REF!)","v":{"$error":"#REF!"}},null,null,null,null,null,null,null,null,null,null,null,null,null,null,null,null,0]
[{"$f":"IF(Prezentace!A13=0,\"\",Prezentace!A13)","v":""},{"$f":"IF(Prezentace!B13=0,\"\",Prezentace!B13)","v":""},{"$f":"Prezentace!D13","v":"P"},{"$f":"IF(Prezentace!F13=0,\"\",Prezentace!F13)","v":"Vojtěch"},{"$f":"IF(Prezentace!E13=0,\"\",Prezentace!E13)","v":"Brejžek "},null,null,null,null,null,null,null,null,null,null,null,null,null,null,null,null,0]
[{"$f":"IF(Prezentace!A14=0,\"\",Prezentace!A14)","v":""},{"$f":"IF(Prezentace!B14=0,\"\",Prezentace!B14)","v":""},{"$f":"Prezentace!D14","v":"P"},{"$f":"IF(Prezentace!F14=0,\"\",Prezentace!F14)","v":"Karel"},{"$f":"IF(Prezentace!E14=0,\"\",Prezentace!E14)","v":"Získal "},null,null,null,null,null,null,null,null,null,null,null,null,null,null,null,null,0]
[{"$f":"IF(Prezentace!A15=0,\"\",Prezentace!A15)","v":""},{"$f":"IF(Prezentace!B15=0,\"\",Prezentace!B15)","v":""},{"$f":"Prezentace!D15","v":"R"},{"$f":"IF(Prezentace!F15=0,\"\",Prezentace!F15)","v":"Karel"},{"$f":"IF(Prezentace!E15=0,\"\",Prezentace!E15)","v":"Získal "},null,null,null,null,null,null,null,null,null,null,null,null,null,null,null,null,0]
[{"$f":"IF(Prezentace!A16=0,\"\",Prezentace!A16)","v":""},{"$f":"IF(Prezentace!B16=0,\"\",Prezentace!B16)","v":""},{"$f":"Prezentace!D16","v":"P"},{"$f":"IF(Prezentace!F16=0,\"\",Prezentace!F16)","v":"Marie"},{"$f":"IF(Prezentace!E16=0,\"\",Prezentace!E16)","v":"Žemličková"},null,null,null,null,null,null,null,null,null,null,null,null,null,null,null,null,0]
[{"$f":"IF(Prezentace!A17=0,\"\",Prezentace!A17)","v":""},{"$f":"IF(Prezentace!B17=0,\"\",Prezentace!B17)","v":""},{"$f":"Prezentace!D17","v":"P"},{"$f":"IF(Prezentace!F17=0,\"\",Prezentace!F17)","v":"Ladislav"},{"$f":"IF(Prezentace!E17=0,\"\",Prezentace!E17)","v":"Žemlička "},null,null,null,null,null,null,null,null,null,null,null,null,null,null,null,null,0]
[{"$f":"IF(Prezentace!A18=0,\"\",Prezentace!A18)","v":""},{"$f":"IF(Prezentace!B18=0,\"\",Prezentace!B18)","v":""},{"$f":"Prezentace!D18","v":"P"},{"$f":"IF(Prezentace!F18=0,\"\",Prezentace!F18)","v":"Jiří"},{"$f":"IF(Prezentace!E18=0,\"\",Prezentace!E18)","v":"Janovský "},null,null,null,null,null,null,null,null,null,null,null,null,null,null,null,null,0]
[{"$f":"IF(Prezentace!A19=0,\"\",Prezentace!A19)","v":""},{"$f":"IF(Prezentace!B19=0,\"\",Prezentace!B19)","v":""},{"$f":"Prezentace!D19","v":"P"},{"$f":"IF(Prezentace!F19=0,\"\",Prezentace!F19)","v":"Mojmír"},{"$f":"IF(Prezentace!E19=0,\"\",Prezentace!E19)","v":"Janovský "},null,null,null,null,null,null,null,null,null,null,null,null,null,null,null,null,0]
[{"$f":"IF(Prezentace!A20=0,\"\",Prezentace!A20)","v":""},{"$f":"IF(Prezentace!B20=0,\"\",Prezentace!B20)","v":""},{"$f":"Prezentace!D20","v":"P"},{"$f":"IF(Prezentace!F20=0,\"\",Prezentace!F20)","v":"Bohumil"},{"$f":"IF(Prezentace!E20=0,\"\",Prezentace!E20)","v":"Herceg"},null,null,null,null,null,null,null,null,null,null,null,null,null,null,null,null,0]
[{"$f":"IF(Prezentace!A21=0,\"\",Prezentace!A21)","v":""},{"$f":"IF(Prezentace!B21=0,\"\",Prezentace!B21)","v":""},{"$f":"Prezentace!D21","v":"P"},{"$f":"IF(Prezentace!F21=0,\"\",Prezentace!F21)","v":"Michal"},{"$f":"IF(Prezentace!E21=0,\"\",Prezentace!E21)","v":"Svoboda"},null,null,null,null,null,null,null,null,null,null,null,null,null,null,null,null,0]
[{"$f":"IF(Prezentace!A22=0,\"\",Prezentace!A22)","v":""},{"$f":"IF(Prezentace!B22=0,\"\",Prezentace!B22)","v":""},{"$f":"Prezentace!D22","v":"P"},{"$f":"IF(Prezentace!F22=0,\"\",Prezentace!F22)","v":"Viktor"},{"$f":"IF(Prezentace!E22=0,\"\",Prezentace!E22)","v":"Fuksa  "},null,null,null,null,null,null,null,null,null,null,null,null,null,null,null,null,0]
[{"$f":"IF(Prezentace!A23=0,\"\",Prezentace!A23)","v":""},{"$f":"IF(Prezentace!B23=0,\"\",Prezentace!B23)","v":""},{"$f":"Prezentace!D23","v":"P"},{"$f":"IF(Prezentace!F23=0,\"\",Prezentace!F23)","v":"Miroslav"},{"$f":"IF(Prezentace!E23=0,\"\",Prezentace!E23)","v":"Koch   ml."},null,null,null,null,null,null,null,null,null,null,null,null,null,null,null,null,0]
[{"$f":"IF(Prezentace!A24=0,\"\",Prezentace!A24)","v":""},{"$f":"IF(Prezentace!B24=0,\"\",Prezentace!B24)","v":""},{"$f":"Prezentace!D24","v":"P"},{"$f":"IF(Prezentace!F24=0,\"\",Prezentace!F24)","v":"Miroslav"},{"$f":"IF(Prezentace!E24=0,\"\",Prezentace!E24)","v":"Koch  st. "},null,null,null,null,null,null,null,null,null,null,null,null,null,null,null,null,0]
[{"$f":"IF(Prezentace!A25=0,\"\",Prezentace!A25)","v":""},{"$f":"IF(Prezentace!B25=0,\"\",Prezentace!B25)","v":""},{"$f":"Prezentace!D25","v":"P"},{"$f":"IF(Prezentace!F25=0,\"\",Prezentace!F25)","v":"Jaroslav"},{"$f":"IF(Prezentace!E25=0,\"\",Prezentace!E25)","v":"Kostříž "},null,null,null,null,null,null,null,null,null,null,null,null,null,null,null,null,0]
[{"$f":"IF(Prezentace!A26=0,\"\",Prezentace!A26)","v":""},{"$f":"IF(Prezentace!B26=0,\"\",Prezentace!B26)","v":""},{"$f":"Prezentace!D26","v":"P"},{"$f":"IF(Prezentace!F26=0,\"\",Prezentace!F26)","v":"Josef"},{"$f":"IF(Prezentace!E26=0,\"\",Prezentace!E26)","v":"Čekal "},null,null,null,null,null,null,null,null,null,null,null,null,null,null,null,null,0]
[{"$f":"IF(Prezentace!A27=0,\"\",Prezentace!A27)","v":""},{"$f":"IF(Prezentace!B27=0,\"\",Prezentace!B27)","v":""},{"$f":"Prezentace!D27","v":"P"},{"$f":"IF(Prezentace!F27=0,\"\",Prezentace!F27)","v":"Miloslav"},{"$f":"IF(Prezentace!E27=0,\"\",Prezentace!E27)","v":"Petržílka"},null,null,null,null,null,null,null,null,null,null,null,null,null,null,null,null,0]
[{"$f":"IF(Prezentace!A28=0,\"\",Prezentace!A28)","v":""},{"$f":"IF(Prezentace!B28=0,\"\",Prezentace!B28)","v":""},{"$f":"Prezentace!D28","v":"P"},{"$f":"IF(Prezentace!F28=0,\"\",Prezentace!F28)","v":"Václav"},{"$f":"IF(Prezentace!E28=0,\"\",Prezentace!E28)","v":"Landkammer"},null,null,null,null,null,null,null,null,null,null,null,null,null,null,null,null,0]
[{"$f":"IF(Prezentace!A29=0,\"\",Prezentace!A29)","v":""},{"$f":"IF(Prezentace!B29=0,\"\",Prezentace!B29)","v":""},{"$f":"Prezentace!D29","v":"P"},{"$f":"IF(Prezentace!F29=0,\"\",Prezentace!F29)","v":"Albert"},{"$f":"IF(Prezentace!E29=0,\"\",Prezentace!E29)","v":"Wrzecionko"},null,null,null,null,null,null,null,null,null,null,null,null,null,null,null,null,0]
[{"$f":"IF(Prezentace!A30=0,\"\",Prezentace!A30)","v":""},{"$f":"IF(Prezentace!B30=0,\"\",Prezentace!B30)","v":""},{"$f":"Prezentace!D30","v":"P"},{"$f":"IF(Prezentace!F30=0,\"\",Prezentace!F30)","v":"Michaela"},{"$f":"IF(Prezentace!E30=0,\"\",Prezentace!E30)","v":"Reisnerová"},null,null,null,null,null,null,null,null,null,null,null,null,null,null,null,null,0]
[{"$f":"IF(Prezentace!A31=0,\"\",Prezentace!A31)","v":""},{"$f":"IF(Prezentace!B31=0,\"\",Prezentace!B31)","v":""},{"$f":"Prezentace!D31","v":"P"},{"$f":"IF(Prezentace!F31=0,\"\",Prezentace!F31)","v":"Antonín"},{"$f":"IF(Prezentace!E31=0,\"\",Prezentace!E31)","v":"Urbanec  "},null,null,null,null,null,null,null,null,null,null,null,null,null,null,null,null,0]
[{"$f":"IF(Prezentace!#REF!=0,\"\",Prezentace!#REF!)","v":{"$error":"#REF!"}},{"$f":"IF(Prezentace!#REF!=0,\"\",Prezentace!#REF!)","v":{"$error":"#REF!"}},{"$f":"Prezentace!#REF!","v":{"$error":"#REF!"}},{"$f":"IF(Prezentace!#REF!=0,\"\",Prezentace!#REF!)","v":{"$error":"#REF!"}},{"$f":"IF(Prezentace!#REF!=0,\"\",Prezentace!#REF!)","v":{"$error":"#REF!"}},null,null,null,null,null,null,null,null,null,null,null,null,null,null,null,null,0]
[{"$f":"IF(Prezentace!#REF!=0,\"\",Prezentace!#REF!)","v":{"$error":"#REF!"}},{"$f":"IF(Prezentace!#REF!=0,\"\",Prezentace!#REF!)","v":{"$error":"#REF!"}},{"$f":"Prezentace!#REF!","v":{"$error":"#REF!"}},{"$f":"IF(Prezentace!#REF!=0,\"\",Prezentace!#REF!)","v":{"$error":"#REF!"}},{"$f":"IF(Prezentace!#REF!=0,\"\",Prezentace!#REF!)","v":{"$error":"#REF!"}},null,null,null,null,null,null,null,null,null,null,null,null,null,null,null,null,0]
[{"$f":"IF(Prezentace!#REF!=0,\"\",Prezentace!#REF!)","v":{"$error":"#REF!"}},{"$f":"IF(Prezentace!#REF!=0,\"\",Prezentace!#REF!)","v":{"$error":"#REF!"}},{"$f":"Prezentace!#REF!","v":{"$error":"#REF!"}},{"$f":"IF(Prezentace!#REF!=0,\"\",Prezentace!#REF!)","v":{"$error":"#REF!"}},{"$f":"IF(Prezentace!#REF!=0,\"\",Prezentace!#REF!)","v":{"$error":"#REF!"}},null,null,null,null,null,null,null,null,null,null,null,null,null,null,null,null,0]
[{"$f":"IF(Prezentace!#REF!=0,\"\",Prezentace!#REF!)","v":{"$error":"#REF!"}},{"$f":"IF(Prezentace!#REF!=0,\"\",Prezentace!#REF!)","v":{"$error":"#REF!"}},{"$f":"Prezentace!#REF!","v":{"$error":"#REF!"}},{"$f":"IF(Prezentace!#REF!=0,\"\",Prezentace!#REF!)","v":{"$error":"#REF!"}},{"$f":"IF(Prezentace!#REF!=0,\"\",Prezentace!#REF!)","v":{"$error":"#REF!"}},null,null,null,null,null,null,null,null,null,null,null,null,null,null,null,null,0]
[{"$f":"IF(Prezentace!#REF!=0,\"\",Prezentace!#REF!)","v":{"$error":"#REF!"}},{"$f":"IF(Prezentace!#REF!=0,\"\",Prezentace!#REF!)","v":{"$error":"#REF!"}},{"$f":"Prezentace!#REF!","v":{"$error":"#REF!"}},{"$f":"IF(Prezentace!#REF!=0,\"\",Prezentace!#REF!)","v":{"$error":"#REF!"}},{"$f":"IF(Prezentace!#REF!=0,\"\",Prezentace!#REF!)","v":{"$error":"#REF!"}},null,null,null,null,null,null,null,null,null,null,null,null,null,null,null,null,0]
[{"$f":"IF(Prezentace!#REF!=0,\"\",Prezentace!#REF!)","v":{"$error":"#REF!"}},{"$f":"IF(Prezentace!#REF!=0,\"\",Prezentace!#REF!)","v":{"$error":"#REF!"}},{"$f":"Prezentace!#REF!","v":{"$error":"#REF!"}},{"$f":"IF(Prezentace!#REF!=0,\"\",Prezentace!#REF!)","v":{"$error":"#REF!"}},{"$f":"IF(Prezentace!#REF!=0,\"\",Prezentace!#REF!)","v":{"$error":"#REF!"}},null,null,null,null,null,null,null,null,null,null,null,null,null,null,null,null,0]
[{"$f":"IF(Prezentace!#REF!=0,\"\",Prezentace!#REF!)","v":{"$error":"#REF!"}},{"$f":"IF(Prezentace!#REF!=0,\"\",Prezentace!#REF!)","v":{"$error":"#REF!"}},{"$f":"Prezentace!#REF!","v":{"$error":"#REF!"}},{"$f":"IF(Prezentace!#REF!=0,\"\",Prezentace!#REF!)","v":{"$error":"#REF!"}},{"$f":"IF(Prezentace!#REF!=0,\"\",Prezentace!#REF!)","v":{"$error":"#REF!"}},null,null,null,null,null,null,null,null,null,null,null,null,null,null,null,null,0]
[{"$f":"IF(Prezentace!#REF!=0,\"\",Prezentace!#REF!)","v":{"$error":"#REF!"}},{"$f":"IF(Prezentace!#REF!=0,\"\",Prezentace!#REF!)","v":{"$error":"#REF!"}},{"$f":"Prezentace!#REF!","v":{"$error":"#REF!"}},{"$f":"IF(Prezentace!#REF!=0,\"\",Prezentace!#REF!)","v":{"$error":"#REF!"}},{"$f":"IF(Prezentace!#REF!=0,\"\",Prezentace!#REF!)","v":{"$error":"#REF!"}},null,null,null,null,null,null,null,null,null,null,null,null,null,null,null,null,{"$f":"(SUM(F38:T38))-U38","v":0}]
[{"$f":"IF(Prezentace!#REF!=0,\"\",Prezentace!#REF!)","v":{"$error":"#REF!"}},{"$f":"IF(Prezentace!#REF!=0,\"\",Prezentace!#REF!)","v":{"$error":"#REF!"}},{"$f":"Prezentace!#REF!","v":{"$error":"#REF!"}},{"$f":"IF(Prezentace!#REF!=0,\"\",Prezentace!#REF!)","v":{"$error":"#REF!"}},{"$f":"IF(Prezentace!#REF!=0,\"\",Prezentace!#REF!)","v":{"$error":"#REF!"}},null,null,null,null,null,null,null,null,null,null,null,null,null,null,null,null,0]
[{"$f":"IF(Prezentace!#REF!=0,\"\",Prezentace!#REF!)","v":{"$error":"#REF!"}},{"$f":"IF(Prezentace!#REF!=0,\"\",Prezentace!#REF!)","v":{"$error":"#REF!"}},{"$f":"Prezentace!#REF!","v":{"$error":"#REF!"}},{"$f":"IF(Prezentace!#REF!=0,\"\",Prezentace!#REF!)","v":{"$error":"#REF!"}},{"$f":"IF(Prezentace!#REF!=0,\"\",Prezentace!#REF!)","v":{"$error":"#REF!"}},null,null,null,null,null,null,null,null,null,null,null,null,null,null,null,null,0]
[{"$f":"IF(Prezentace!#REF!=0,\"\",Prezentace!#REF!)","v":{"$error":"#REF!"}},{"$f":"IF(Prezentace!#REF!=0,\"\",Prezentace!#REF!)","v":{"$error":"#REF!"}},{"$f":"Prezentace!#REF!","v":{"$error":"#REF!"}},{"$f":"IF(Prezentace!#REF!=0,\"\",Prezentace!#REF!)","v":{"$error":"#REF!"}},{"$f":"IF(Prezentace!#REF!=0,\"\",Prezentace!#REF!)","v":{"$error":"#REF!"}},null,null,null,null,null,null,null,null,null,null,null,null,null,null,null,null,0]
[{"$f":"IF(Prezentace!#REF!=0,\"\",Prezentace!#REF!)","v":{"$error":"#REF!"}},{"$f":"IF(Prezentace!#REF!=0,\"\",Prezentace!#REF!)","v":{"$error":"#REF!"}},{"$f":"Prezentace!#REF!","v":{"$error":"#REF!"}},{"$f":"IF(Prezentace!#REF!=0,\"\",Prezentace!#REF!)","v":{"$error":"#REF!"}},{"$f":"IF(Prezentace!#REF!=0,\"\",Prezentace!#REF!)","v":{"$error":"#REF!"}},null,null,null,null,null,null,null,null,null,null,null,null,null,null,null,null,0]
[{"$f":"IF(Prezentace!#REF!=0,\"\",Prezentace!#REF!)","v":{"$error":"#REF!"}},{"$f":"IF(Prezentace!#REF!=0,\"\",Prezentace!#REF!)","v":{"$error":"#REF!"}},{"$f":"Prezentace!#REF!","v":{"$error":"#REF!"}},{"$f":"IF(Prezentace!#REF!=0,\"\",Prezentace!#REF!)","v":{"$error":"#REF!"}},{"$f":"IF(Prezentace!#REF!=0,\"\",Prezentace!#REF!)","v":{"$error":"#REF!"}},null,null,null,null,null,null,null,null,null,null,null,null,null,null,null,null,0]
[{"$f":"IF(Prezentace!#REF!=0,\"\",Prezentace!#REF!)","v":{"$error":"#REF!"}},{"$f":"IF(Prezentace!#REF!=0,\"\",Prezentace!#REF!)","v":{"$error":"#REF!"}},{"$f":"Prezentace!#REF!","v":{"$error":"#REF!"}},{"$f":"IF(Prezentace!#REF!=0,\"\",Prezentace!#REF!)","v":{"$error":"#REF!"}},{"$f":"IF(Prezentace!#REF!=0,\"\",Prezentace!#REF!)","v":{"$error":"#REF!"}},null,null,null,null,null,null,null,null,null,null,null,null,null,null,null,null,0]
[{"$f":"IF(Prezentace!#REF!=0,\"\",Prezentace!#REF!)","v":{"$error":"#REF!"}},{"$f":"IF(Prezentace!#REF!=0,\"\",Prezentace!#REF!)","v":{"$error":"#REF!"}},{"$f":"Prezentace!#REF!","v":{"$error":"#REF!"}},{"$f":"IF(Prezentace!#REF!=0,\"\",Prezentace!#REF!)","v":{"$error":"#REF!"}},{"$f":"IF(Prezentace!#REF!=0,\"\",Prezentace!#REF!)","v":{"$error":"#REF!"}},null,null,null,null,null,null,null,null,null,null,null,null,null,null,null,null,0]
[{"$f":"IF(Prezentace!#REF!=0,\"\",Prezentace!#REF!)","v":{"$error":"#REF!"}},{"$f":"IF(Prezentace!#REF!=0,\"\",Prezentace!#REF!)","v":{"$error":"#REF!"}},{"$f":"Prezentace!#REF!","v":{"$error":"#REF!"}},{"$f":"IF(Prezentace!#REF!=0,\"\",Prezentace!#REF!)","v":{"$error":"#REF!"}},{"$f":"IF(Prezentace!#REF!=0,\"\",Prezentace!#REF!)","v":{"$error":"#REF!"}},null,null,null,null,null,null,null,null,null,null,null,null,null,null,null,null,0]
[{"$f":"IF(Prezentace!#REF!=0,\"\",Prezentace!#REF!)","v":{"$error":"#REF!"}},{"$f":"IF(Prezentace!#REF!=0,\"\",Prezentace!#REF!)","v":{"$error":"#REF!"}},{"$f":"Prezentace!#REF!","v":{"$error":"#REF!"}},{"$f":"IF(Prezentace!#REF!=0,\"\",Prezentace!#REF!)","v":{"$error":"#REF!"}},{"$f":"IF(Prezentace!#REF!=0,\"\",Prezentace!#REF!)","v":{"$error":"#REF!"}},null,null,null,null,null,null,null,null,null,null,null,null,null,null,null,null,0]
[{"$f":"IF(Prezentace!#REF!=0,\"\",Prezentace!#REF!)","v":{"$error":"#REF!"}},{"$f":"IF(Prezentace!#REF!=0,\"\",Prezentace!#REF!)","v":{"$error":"#REF!"}},{"$f":"Prezentace!#REF!","v":{"$error":"#REF!"}},{"$f":"IF(Prezentace!#REF!=0,\"\",Prezentace!#REF!)","v":{"$error":"#REF!"}},{"$f":"IF(Prezentace!#REF!=0,\"\",Prezentace!#REF!)","v":{"$error":"#REF!"}},null,null,null,null,null,null,null,null,null,null,null,null,null,null,null,null,0]
[{"$f":"IF(Prezentace!#REF!=0,\"\",Prezentace!#REF!)","v":{"$error":"#REF!"}},{"$f":"IF(Prezentace!#REF!=0,\"\",Prezentace!#REF!)","v":{"$error":"#REF!"}},{"$f":"Prezentace!#REF!","v":{"$error":"#REF!"}},{"$f":"IF(Prezentace!#REF!=0,\"\",Prezentace!#REF!)","v":{"$error":"#REF!"}},{"$f":"IF(Prezentace!#REF!=0,\"\",Prezentace!#REF!)","v":{"$error":"#REF!"}},null,null,null,null,null,null,null,null,null,null,null,null,null,null,null,null,0]
[{"$f":"IF(Prezentace!#REF!=0,\"\",Prezentace!#REF!)","v":{"$error":"#REF!"}},{"$f":"IF(Prezentace!#REF!=0,\"\",Prezentace!#REF!)","v":{"$error":"#REF!"}},{"$f":"Prezentace!#REF!","v":{"$error":"#REF!"}},{"$f":"IF(Prezentace!#REF!=0,\"\",Prezentace!#REF!)","v":{"$error":"#REF!"}},{"$f":"IF(Prezentace!#REF!=0,\"\",Prezentace!#REF!)","v":{"$error":"#REF!"}},null,null,null,null,null,null,null,null,null,null,null,null,null,null,null,null,0]
[{"$f":"IF(Prezentace!#REF!=0,\"\",Prezentace!#REF!)","v":{"$error":"#REF!"}},{"$f":"IF(Prezentace!#REF!=0,\"\",Prezentace!#REF!)","v":{"$error":"#REF!"}},{"$f":"Prezentace!#REF!","v":{"$error":"#REF!"}},{"$f":"IF(Prezentace!#REF!=0,\"\",Prezentace!#REF!)","v":{"$error":"#REF!"}},{"$f":"IF(Prezentace!#REF!=0,\"\",Prezentace!#REF!)","v":{"$error":"#REF!"}},null,null,null,null,null,null,null,null,null,null,null,null,null,null,null,null,0]
[{"$f":"IF(Prezentace!#REF!=0,\"\",Prezentace!#REF!)","v":{"$error":"#REF!"}},{"$f":"IF(Prezentace!#REF!=0,\"\",Prezentace!#REF!)","v":{"$error":"#REF!"}},{"$f":"Prezentace!#REF!","v":{"$error":"#REF!"}},{"$f":"IF(Prezentace!#REF!=0,\"\",Prezentace!#REF!)","v":{"$error":"#REF!"}},{"$f":"IF(Prezentace!#REF!=0,\"\",Prezentace!#REF!)","v":{"$error":"#REF!"}},null,null,null,null,null,null,null,null,null,null,null,null,null,null,null,null,0]
[{"$f":"IF(Prezentace!#REF!=0,\"\",Prezentace!#REF!)","v":{"$error":"#REF!"}},{"$f":"IF(Prezentace!#REF!=0,\"\",Prezentace!#REF!)","v":{"$error":"#REF!"}},{"$f":"Prezentace!#REF!","v":{"$error":"#REF!"}},{"$f":"IF(Prezentace!#REF!=0,\"\",Prezentace!#REF!)","v":{"$error":"#REF!"}},{"$f":"IF(Prezentace!#REF!=0,\"\",Prezentace!#REF!)","v":{"$error":"#REF!"}},null,null,null,null,null,null,null,null,null,null,null,null,null,null,null,null,0]
[{"$f":"IF(Prezentace!#REF!=0,\"\",Prezentace!#REF!)","v":{"$error":"#REF!"}},{"$f":"IF(Prezentace!#REF!=0,\"\",Prezentace!#REF!)","v":{"$error":"#REF!"}},{"$f":"Prezentace!#REF!","v":{"$error":"#REF!"}},{"$f":"IF(Prezentace!#REF!=0,\"\",Prezentace!#REF!)","v":{"$error":"#REF!"}},{"$f":"IF(Prezentace!#REF!=0,\"\",Prezentace!#REF!)","v":{"$error":"#REF!"}},null,null,null,null,null,null,null,null,null,null,null,null,null,null,null,null,0]
[{"$f":"IF(Prezentace!#REF!=0,\"\",Prezentace!#REF!)","v":{"$error":"#REF!"}},{"$f":"IF(Prezentace!#REF!=0,\"\",Prezentace!#REF!)","v":{"$error":"#REF!"}},{"$f":"Prezentace!#REF!","v":{"$error":"#REF!"}},{"$f":"IF(Prezentace!#REF!=0,\"\",Prezentace!#REF!)","v":{"$error":"#REF!"}},{"$f":"IF(Prezentace!#REF!=0,\"\",Prezentace!#REF!)","v":{"$error":"#REF!"}},null,null,null,null,null,null,null,null,null,null,null,null,null,null,null,null,0]
[{"$f":"IF(Prezentace!#REF!=0,\"\",Prezentace!#REF!)","v":{"$error":"#REF!"}},{"$f":"IF(Prezentace!#REF!=0,\"\",Prezentace!#REF!)","v":{"$error":"#REF!"}},{"$f":"Prezentace!#REF!","v":{"$error":"#REF!"}},{"$f":"IF(Prezentace!#REF!=0,\"\",Prezentace!#REF!)","v":{"$error":"#REF!"}},{"$f":"IF(Prezentace!#REF!=0,\"\",Prezentace!#REF!)","v":{"$error":"#REF!"}},null,null,null,null,null,null,null,null,null,null,null,null,null,null,null,null,0]
[{"$f":"IF(Prezentace!#REF!=0,\"\",Prezentace!#REF!)","v":{"$error":"#REF!"}},{"$f":"IF(Prezentace!#REF!=0,\"\",Prezentace!#REF!)","v":{"$error":"#REF!"}},{"$f":"Prezentace!#REF!","v":{"$error":"#REF!"}},{"$f":"IF(Prezentace!#REF!=0,\"\",Prezentace!#REF!)","v":{"$error":"#REF!"}},{"$f":"IF(Prezentace!#REF!=0,\"\",Prezentace!#REF!)","v":{"$error":"#REF!"}},null,null,null,null,null,null,null,null,null,null,null,null,null,null,null,null,0]
[{"$f":"IF(Prezentace!#REF!=0,\"\",Prezentace!#REF!)","v":{"$error":"#REF!"}},{"$f":"IF(Prezentace!#REF!=0,\"\",Prezentace!#REF!)","v":{"$error":"#REF!"}},{"$f":"Prezentace!#REF!","v":{"$error":"#REF!"}},{"$f":"IF(Prezentace!#REF!=0,\"\",Prezentace!#REF!)","v":{"$error":"#REF!"}},{"$f":"IF(Prezentace!#REF!=0,\"\",Prezentace!#REF!)","v":{"$error":"#REF!"}},null,null,null,null,null,null,null,null,null,null,null,null,null,null,null,null,0]
[{"$f":"IF(Prezentace!A32=0,\"\",Prezentace!A32)","v":""},{"$f":"IF(Prezentace!B32=0,\"\",Prezentace!B32)","v":""},{"$f":"Prezentace!D32","v":"P"},{"$f":"IF(Prezentace!F32=0,\"\",Prezentace!F32)","v":""},{"$f":"IF(Prezentace!E32=0,\"\",Prezentace!E32)","v":""},null,null,null,null,null,null,null,null,null,null,null,null,null,null,null,null,0]
[{"$f":"IF(Prezentace!A33=0,\"\",Prezentace!A33)","v":""},{"$f":"IF(Prezentace!B33=0,\"\",Prezentace!B33)","v":""},{"$f":"Prezentace!D33","v":"P"},{"$f":"IF(Prezentace!F33=0,\"\",Prezentace!F33)","v":""},{"$f":"IF(Prezentace!E33=0,\"\",Prezentace!E33)","v":""},null,null,null,null,null,null,null,null,null,null,null,null,null,null,null,null,0]
[{"$f":"IF(Prezentace!A34=0,\"\",Prezentace!A34)","v":""},{"$f":"IF(Prezentace!B34=0,\"\",Prezentace!B34)","v":""},{"$f":"Prezentace!D34","v":"P"},{"$f":"IF(Prezentace!F34=0,\"\",Prezentace!F34)","v":""},{"$f":"IF(Prezentace!E34=0,\"\",Prezentace!E34)","v":""},null,null,null,null,null,null,null,null,null,null,null,null,null,null,null,null,0]
[{"$f":"IF(Prezentace!A35=0,\"\",Prezentace!A35)","v":""},{"$f":"IF(Prezentace!B35=0,\"\",Prezentace!B35)","v":""},{"$f":"Prezentace!D35","v":"P"},{"$f":"IF(Prezentace!F35=0,\"\",Prezentace!F35)","v":""},{"$f":"IF(Prezentace!E35=0,\"\",Prezentace!E35)","v":""},null,null,null,null,null,null,null,null,null,null,null,null,null,null,null,null,0]
[{"$f":"IF(Prezentace!A36=0,\"\",Prezentace!A36)","v":""},{"$f":"IF(Prezentace!B36=0,\"\",Prezentace!B36)","v":""},{"$f":"Prezentace!D36","v":"P"},{"$f":"IF(Prezentace!F36=0,\"\",Prezentace!F36)","v":""},{"$f":"IF(Prezentace!E36=0,\"\",Prezentace!E36)","v":""},null,null,null,null,null,null,null,null,null,null,null,null,null,null,null,null,0]
[{"$f":"IF(Prezentace!A37=0,\"\",Prezentace!A37)","v":""},{"$f":"IF(Prezentace!B37=0,\"\",Prezentace!B37)","v":""},{"$f":"Prezentace!D37","v":"P"},{"$f":"IF(Prezentace!F37=0,\"\",Prezentace!F37)","v":""},{"$f":"IF(Prezentace!E37=0,\"\",Prezentace!E37)","v":""},null,null,null,null,null,null,null,null,null,null,null,null,null,null,null,null,0]
[{"$f":"IF(Prezentace!A38=0,\"\",Prezentace!A38)","v":""},{"$f":"IF(Prezentace!B38=0,\"\",Prezentace!B38)","v":""},{"$f":"Prezentace!D38","v":"P"},{"$f":"IF(Prezentace!F38=0,\"\",Prezentace!F38)","v":""},{"$f":"IF(Prezentace!E38=0,\"\",Prezentace!E38)","v":""},null,null,null,null,null,null,null,null,null,null,null,null,null,null,null,null,0]
[{"$f":"IF(Prezentace!A39=0,\"\",Prezentace!A39)","v":""},{"$f":"IF(Prezentace!B39=0,\"\",Prezentace!B39)","v":""},{"$f":"Prezentace!D39","v":"P"},{"$f":"IF(Prezentace!F39=0,\"\",Prezentace!F39)","v":""},{"$f":"IF(Prezentace!E39=0,\"\",Prezentace!E39)","v":""},null,null,null,null,null,null,null,null,null,null,null,null,null,null,null,null,0]
[{"$f":"IF(Prezentace!A40=0,\"\",Prezentace!A40)","v":""},{"$f":"IF(Prezentace!B40=0,\"\",Prezentace!B40)","v":""},{"$f":"Prezentace!D40","v":"P"},{"$f":"IF(Prezentace!F40=0,\"\",Prezentace!F40)","v":""},{"$f":"IF(Prezentace!E40=0,\"\",Prezentace!E40)","v":""},null,null,null,null,null,null,null,null,null,null,null,null,null,null,null,null,0]
[{"$f":"IF(Prezentace!A41=0,\"\",Prezentace!A41)","v":""},{"$f":"IF(Prezentace!B41=0,\"\",Prezentace!B41)","v":""},{"$f":"Prezentace!D41","v":"P"},{"$f":"IF(Prezentace!F41=0,\"\",Prezentace!F41)","v":""},{"$f":"IF(Prezentace!E41=0,\"\",Prezentace!E41)","v":""},null,null,null,null,null,null,null,null,null,null,null,null,null,null,null,null,0]
[{"$f":"IF(Prezentace!A42=0,\"\",Prezentace!A42)","v":""},{"$f":"IF(Prezentace!B42=0,\"\",Prezentace!B42)","v":""},{"$f":"Prezentace!D42","v":"P"},{"$f":"IF(Prezentace!F42=0,\"\",Prezentace!F42)","v":""},{"$f":"IF(Prezentace!E42=0,\"\",Prezentace!E42)","v":""},null,null,null,null,null,null,null,null,null,null,null,null,null,null,null,null,0]
[{"$f":"IF(Prezentace!A43=0,\"\",Prezentace!A43)","v":""},{"$f":"IF(Prezentace!B43=0,\"\",Prezentace!B43)","v":""},{"$f":"Prezentace!D43","v":"P"},{"$f":"IF(Prezentace!F43=0,\"\",Prezentace!F43)","v":""},{"$f":"IF(Prezentace!E43=0,\"\",Prezentace!E43)","v":""},null,null,null,null,null,null,null,null,null,null,null,null,null,null,null,null,0]
[{"$f":"IF(Prezentace!A44=0,\"\",Prezentace!A44)","v":""},{"$f":"IF(Prezentace!B44=0,\"\",Prezentace!B44)","v":""},{"$f":"Prezentace!D44","v":"P"},{"$f":"IF(Prezentace!F44=0,\"\",Prezentace!F44)","v":""},{"$f":"IF(Prezentace!E44=0,\"\",Prezentace!E44)","v":""},null,null,null,null,null,null,null,null,null,null,null,null,null,null,null,null,0]
[{"$f":"IF(Prezentace!A45=0,\"\",Prezentace!A45)","v":""},{"$f":"IF(Prezentace!B45=0,\"\",Prezentace!B45)","v":""},{"$f":"Prezentace!D45","v":"P"},{"$f":"IF(Prezentace!F45=0,\"\",Prezentace!F45)","v":""},{"$f":"IF(Prezentace!E45=0,\"\",Prezentace!E45)","v":""},null,null,null,null,null,null,null,null,null,null,null,null,null,null,null,null,0]
[{"$f":"IF(Prezentace!A46=0,\"\",Prezentace!A46)","v":""},{"$f":"IF(Prezentace!B46=0,\"\",Prezentace!B46)","v":""},{"$f":"Prezentace!D46","v":"P"},{"$f":"IF(Prezentace!F46=0,\"\",Prezentace!F46)","v":""},{"$f":"IF(Prezentace!E46=0,\"\",Prezentace!E46)","v":""},null,null,null,null,null,null,null,null,null,null,null,null,null,null,null,null,0]
[{"$f":"IF(Prezentace!A47=0,\"\",Prezentace!A47)","v":""},{"$f":"IF(Prezentace!B47=0,\"\",Prezentace!B47)","v":""},{"$f":"Prezentace!D47","v":"P"},{"$f":"IF(Prezentace!F47=0,\"\",Prezentace!F47)","v":""},{"$f":"IF(Prezentace!E47=0,\"\",Prezentace!E47)","v":""},null,null,null,null,null,null,null,null,null,null,null,null,null,null,null,null,0]
[{"$f":"IF(Prezentace!A48=0,\"\",Prezentace!A48)","v":""},{"$f":"IF(Prezentace!B48=0,\"\",Prezentace!B48)","v":""},{"$f":"Prezentace!D48","v":"P"},{"$f":"IF(Prezentace!F48=0,\"\",Prezentace!F48)","v":""},{"$f":"IF(Prezentace!E48=0,\"\",Prezentace!E48)","v":""},null,null,null,null,null,null,null,null,null,null,null,null,null,null,null,null,0]
[{"$f":"IF(Prezentace!A49=0,\"\",Prezentace!A49)","v":""},{"$f":"IF(Prezentace!B49=0,\"\",Prezentace!B49)","v":""},{"$f":"Prezentace!D49","v":"P"},{"$f":"IF(Prezentace!F49=0,\"\",Prezentace!F49)","v":""},{"$f":"IF(Prezentace!E49=0,\"\",Prezentace!E49)","v":""},null,null,null,null,null,null,null,null,null,null,null,null,null,null,null,null,0]
[{"$f":"IF(Prezentace!A50=0,\"\",Prezentace!A50)","v":""},{"$f":"IF(Prezentace!B50=0,\"\",Prezentace!B50)","v":""},{"$f":"Prezentace!D50","v":"P"},{"$f":"IF(Prezentace!F50=0,\"\",Prezentace!F50)","v":""},{"$f":"IF(Prezentace!E50=0,\"\",Prezentace!E50)","v":""},null,null,null,null,null,null,null,null,null,null,null,null,null,null,null,null,0]
[{"$f":"IF(Prezentace!A51=0,\"\",Prezentace!A51)","v":""},{"$f":"IF(Prezentace!B51=0,\"\",Prezentace!B51)","v":""},{"$f":"Prezentace!D51","v":"P"},{"$f":"IF(Prezentace!F51=0,\"\",Prezentace!F51)","v":""},{"$f":"IF(Prezentace!E51=0,\"\",Prezentace!E51)","v":""},null,null,null,null,null,null,null,null,null,null,null,null,null,null,null,null,0]
[{"$f":"IF(Prezentace!A52=0,\"\",Prezentace!A52)","v":""},{"$f":"IF(Prezentace!B52=0,\"\",Prezentace!B52)","v":""},{"$f":"Prezentace!D52","v":"P"},{"$f":"IF(Prezentace!F52=0,\"\",Prezentace!F52)","v":""},{"$f":"IF(Prezentace!E52=0,\"\",Prezentace!E52)","v":""},null,null,null,null,null,null,null,null,null,null,null,null,null,null,null,null,0]
[{"$f":"IF(Prezentace!A53=0,\"\",Prezentace!A53)","v":""},{"$f":"IF(Prezentace!B53=0,\"\",Prezentace!B53)","v":""},{"$f":"Prezentace!D53","v":"P"},{"$f":"IF(Prezentace!F53=0,\"\",Prezentace!F53)","v":""},{"$f":"IF(Prezentace!E53=0,\"\",Prezentace!E53)","v":""},null,null,null,null,null,null,null,null,null,null,null,null,null,null,null,null,0]
[{"$f":"IF(Prezentace!A54=0,\"\",Prezentace!A54)","v":""},{"$f":"IF(Prezentace!B54=0,\"\",Prezentace!B54)","v":""},{"$f":"Prezentace!D54","v":"P"},{"$f":"IF(Prezentace!F54=0,\"\",Prezentace!F54)","v":""},{"$f":"IF(Prezentace!E54=0,\"\",Prezentace!E54)","v":""},null,null,null,null,null,null,null,null,null,null,null,null,null,null,null,null,0]
[{"$f":"IF(Prezentace!A55=0,\"\",Prezentace!A55)","v":""},{"$f":"IF(Prezentace!B55=0,\"\",Prezentace!B55)","v":""},{"$f":"Prezentace!D55","v":"P"},{"$f":"IF(Prezentace!F55=0,\"\",Prezentace!F55)","v":""},{"$f":"IF(Prezentace!E55=0,\"\",Prezentace!E55)","v":""},null,null,null,null,null,null,null,null,null,null,null,null,null,null,null,null,0]
[{"$f":"IF(Prezentace!A56=0,\"\",Prezentace!A56)","v":""},{"$f":"IF(Prezentace!B56=0,\"\",Prezentace!B56)","v":""},{"$f":"Prezentace!D56","v":"P"},{"$f":"IF(Prezentace!F56=0,\"\",Prezentace!F56)","v":""},{"$f":"IF(Prezentace!E56=0,\"\",Prezentace!E56)","v":""},null,null,null,null,null,null,null,null,null,null,null,null,null,null,null,null,0]
[{"$f":"IF(Prezentace!A57=0,\"\",Prezentace!A57)","v":""},{"$f":"IF(Prezentace!B57=0,\"\",Prezentace!B57)","v":""},{"$f":"Prezentace!D57","v":"P"},{"$f":"IF(Prezentace!F57=0,\"\",Prezentace!F57)","v":""},{"$f":"IF(Prezentace!E57=0,\"\",Prezentace!E57)","v":""},null,null,null,null,null,null,null,null,null,null,null,null,null,null,null,null,0]
[{"$f":"IF(Prezentace!A58=0,\"\",Prezentace!A58)","v":""},{"$f":"IF(Prezentace!B58=0,\"\",Prezentace!B58)","v":""},{"$f":"Prezentace!D58","v":"P"},{"$f":"IF(Prezentace!F58=0,\"\",Prezentace!F58)","v":""},{"$f":"IF(Prezentace!E58=0,\"\",Prezentace!E58)","v":""},null,null,null,null,null,null,null,null,null,null,null,null,null,null,null,null,0]
[{"$f":"IF(Prezentace!A59=0,\"\",Prezentace!A59)","v":""},{"$f":"IF(Prezentace!B59=0,\"\",Prezentace!B59)","v":""},{"$f":"Prezentace!D59","v":"P"},{"$f":"IF(Prezentace!F59=0,\"\",Prezentace!F59)","v":""},{"$f":"IF(Prezentace!E59=0,\"\",Prezentace!E59)","v":""},null,null,null,null,null,null,null,null,null,null,null,null,null,null,null,null,0]
[{"$f":"IF(Prezentace!A60=0,\"\",Prezentace!A60)","v":""},{"$f":"IF(Prezentace!B60=0,\"\",Prezentace!B60)","v":""},{"$f":"Prezentace!D60","v":"P"},{"$f":"IF(Prezentace!F60=0,\"\",Prezentace!F60)","v":""},{"$f":"IF(Prezentace!E60=0,\"\",Prezentace!E60)","v":""},null,null,null,null,null,null,null,null,null,null,null,null,null,null,null,null,0]
[{"$f":"IF(Prezentace!A61=0,\"\",Prezentace!A61)","v":""},{"$f":"IF(Prezentace!B61=0,\"\",Prezentace!B61)","v":""},{"$f":"Prezentace!D61","v":"P"},{"$f":"IF(Prezentace!F61=0,\"\",Prezentace!F61)","v":""},{"$f":"IF(Prezentace!E61=0,\"\",Prezentace!E61)","v":""},null,null,null,null,null,null,null,null,null,null,null,null,null,null,null,null,0]
[{"$f":"IF(Prezentace!A62=0,\"\",Prezentace!A62)","v":""},{"$f":"IF(Prezentace!B62=0,\"\",Prezentace!B62)","v":""},{"$f":"Prezentace!D62","v":"P"},{"$f":"IF(Prezentace!F62=0,\"\",Prezentace!F62)","v":""},{"$f":"IF(Prezentace!E62=0,\"\",Prezentace!E62)","v":""},null,null,null,null,null,null,null,null,null,null,null,null,null,null,null,null,0]
[{"$f":"IF(Prezentace!A63=0,\"\",Prezentace!A63)","v":""},{"$f":"IF(Prezentace!B63=0,\"\",Prezentace!B63)","v":""},{"$f":"Prezentace!D63","v":"P"},{"$f":"IF(Prezentace!F63=0,\"\",Prezentace!F63)","v":""},{"$f":"IF(Prezentace!E63=0,\"\",Prezentace!E63)","v":""},null,null,null,null,null,null,null,null,null,null,null,null,null,null,null,null,0]
[{"$f":"IF(Prezentace!A64=0,\"\",Prezentace!A64)","v":""},{"$f":"IF(Prezentace!B64=0,\"\",Prezentace!B64)","v":""},{"$f":"Prezentace!D64","v":"P"},{"$f":"IF(Prezentace!F64=0,\"\",Prezentace!F64)","v":""},{"$f":"IF(Prezentace!E64=0,\"\",Prezentace!E64)","v":""},null,null,null,null,null,null,null,null,null,null,null,null,null,null,null,null,0]
[{"$f":"IF(Prezentace!A65=0,\"\",Prezentace!A65)","v":""},{"$f":"IF(Prezentace!B65=0,\"\",Prezentace!B65)","v":""},{"$f":"Prezentace!D65","v":"P"},{"$f":"IF(Prezentace!F65=0,\"\",Prezentace!F65)","v":""},{"$f":"IF(Prezentace!E65=0,\"\",Prezentace!E65)","v":""},null,null,null,null,null,null,null,null,null,null,null,null,null,null,null,null,0]
[{"$f":"IF(Prezentace!A66=0,\"\",Prezentace!A66)","v":""},{"$f":"IF(Prezentace!B66=0,\"\",Prezentace!B66)","v":""},{"$f":"Prezentace!D66","v":"P"},{"$f":"IF(Prezentace!F66=0,\"\",Prezentace!F66)","v":""},{"$f":"IF(Prezentace!E66=0,\"\",Prezentace!E66)","v":""},null,null,null,null,null,null,null,null,null,null,null,null,null,null,null,null,0]
[{"$f":"IF(Prezentace!A67=0,\"\",Prezentace!A67)","v":""},{"$f":"IF(Prezentace!B67=0,\"\",Prezentace!B67)","v":""},{"$f":"Prezentace!D67","v":"P"},{"$f":"IF(Prezentace!F67=0,\"\",Prezentace!F67)","v":""},{"$f":"IF(Prezentace!E67=0,\"\",Prezentace!E67)","v":""},null,null,null,null,null,null,null,null,null,null,null,null,null,null,null,null,0]
[{"$f":"IF(Prezentace!A68=0,\"\",Prezentace!A68)","v":""},{"$f":"IF(Prezentace!B68=0,\"\",Prezentace!B68)","v":""},{"$f":"Prezentace!D68","v":"P"},{"$f":"IF(Prezentace!F68=0,\"\",Prezentace!F68)","v":""},{"$f":"IF(Prezentace!E68=0,\"\",Prezentace!E68)","v":""},null,null,null,null,null,null,null,null,null,null,null,null,null,null,null,null,0]
[{"$f":"IF(Prezentace!A69=0,\"\",Prezentace!A69)","v":""},{"$f":"IF(Prezentace!B69=0,\"\",Prezentace!B69)","v":""},{"$f":"Prezentace!D69","v":"P"},{"$f":"IF(Prezentace!F69=0,\"\",Prezentace!F69)","v":""},{"$f":"IF(Prezentace!E69=0,\"\",Prezentace!E69)","v":""},null,null,null,null,null,null,null,null,null,null,null,null,null,null,null,null,0]
[{"$f":"IF(Prezentace!A70=0,\"\",Prezentace!A70)","v":""},{"$f":"IF(Prezentace!B70=0,\"\",Prezentace!B70)","v":""},{"$f":"Prezentace!D70","v":"P"},{"$f":"IF(Prezentace!F70=0,\"\",Prezentace!F70)","v":""},{"$f":"IF(Prezentace!E70=0,\"\",Prezentace!E70)","v":""},null,null,null,null,null,null,null,null,null,null,null,null,null,null,null,null,0]
[{"$f":"IF(Prezentace!A71=0,\"\",Prezentace!A71)","v":""},{"$f":"IF(Prezentace!B71=0,\"\",Prezentace!B71)","v":""},{"$f":"Prezentace!D71","v":"P"},{"$f":"IF(Prezentace!F71=0,\"\",Prezentace!F71)","v":""},{"$f":"IF(Prezentace!E71=0,\"\",Prezentace!E71)","v":""},null,null,null,null,null,null,null,null,null,null,null,null,null,null,null,null,0]
[{"$f":"IF(Prezentace!A72=0,\"\",Prezentace!A72)","v":""},{"$f":"IF(Prezentace!B72=0,\"\",Prezentace!B72)","v":""},{"$f":"Prezentace!D72","v":"P"},{"$f":"IF(Prezentace!F72=0,\"\",Prezentace!F72)","v":""},{"$f":"IF(Prezentace!E72=0,\"\",Prezentace!E72)","v":""},null,null,null,null,null,null,null,null,null,null,null,null,null,null,null,null,0]
[{"$f":"IF(Prezentace!A73=0,\"\",Prezentace!A73)","v":""},{"$f":"IF(Prezentace!B73=0,\"\",Prezentace!B73)","v":""},{"$f":"Prezentace!D73","v":"P"},{"$f":"IF(Prezentace!F73=0,\"\",Prezentace!F73)","v":""},{"$f":"IF(Prezentace!E73=0,\"\",Prezentace!E73)","v":""},null,null,null,null,null,null,null,null,null,null,null,null,null,null,null,null,0]
[{"$f":"IF(Prezentace!A74=0,\"\",Prezentace!A74)","v":""},{"$f":"IF(Prezentace!B74=0,\"\",Prezentace!B74)","v":""},{"$f":"Prezentace!D74","v":"P"},{"$f":"IF(Prezentace!F74=0,\"\",Prezentace!F74)","v":""},{"$f":"IF(Prezentace!E74=0,\"\",Prezentace!E74)","v":""},null,null,null,null,null,null,null,null,null,null,null,null,null,null,null,null,0]
[{"$f":"IF(Prezentace!A75=0,\"\",Prezentace!A75)","v":""},{"$f":"IF(Prezentace!B75=0,\"\",Prezentace!B75)","v":""},{"$f":"Prezentace!D75","v":"P"},{"$f":"IF(Prezentace!F75=0,\"\",Prezentace!F75)","v":""},{"$f":"IF(Prezentace!E75=0,\"\",Prezentace!E75)","v":""},null,null,null,null,null,null,null,null,null,null,null,null,null,null,null,null,{"$f":"(SUM(F102:T102))-U102","v":0}]

{"sheet":"1(M)","index":3,"n_rows":101,"n_cols":20,"rows_kept":101,"cut":false,"hidden":false,"merged":[[0,3,0,18],[0,0,2,0],[0,1,2,1]]}
["Druž.","Kap.",null,"Disciplina 1"]
[]
[null,null,null,null,null,0,1,2,3,4,5,6,7,8,9,10,12,15,"Čas","Součet"]
[{"$f":"IF(Prezentace!A6=0,\"\",Prezentace!A6)","v":""},{"$f":"IF(Prezentace!B6=0,\"\",Prezentace!B6)","v":""},{"$f":"Prezentace!D6","v":"P"},{"$f":"IF(Prezentace!F6=0,\"\",Prezentace!F6)","v":"Milan"},{"$f":"IF(Prezentace!E6=0,\"\",Prezentace!E6)","v":"Matějka st."},null,1,1,1,null,2,null,5,4,null,null,null,null,null,{"$f":"(SUM(F4*$F$3,G4*$G$3,H4*$H$3,I4*$I$3,J4*$J$3,K4*$K$3,L4*$L$3,M4*$M$3,N4*$N$3,O4*$O$3,P4*$P$3,Q4*$Q$3,R4*$R$3))-S4","v":83}]
[{"$f":"IF(Prezentace!A7=0,\"\",Prezentace!A7)","v":""},{"$f":"IF(Prezentace!B7=0,\"\",Prezentace!B7)","v":""},{"$f":"Prezentace!D7","v":"P"},{"$f":"IF(Prezentace!F7=0,\"\",Prezentace!F7)","v":"Miroslav"},{"$f":"IF(Prezentace!E7=0,\"\",Prezentace!E7)","v":"Fiala  "},null,null,null,1,null,null,1,1,5,3,4,null,null,null,{"$f":"(SUM(F5*$F$3,G5*$G$3,H5*$H$3,I5*$I$3,J5*$J$3,K5*$K$3,L5*$L$3,M5*$M$3,N5*$N$3,O5*$O$3,P5*$P$3,Q5*$Q$3,R5*$R$3))-S5","v":123}]
[{"$f":"IF(Prezentace!A8=0,\"\",Prezentace!A8)","v":""},{"$f":"IF(Prezentace!B8=0,\"\",Prezentace!B8)","v":""},{"$f":"Prezentace!D8","v":"P"},{"$f":"IF(Prezentace!F8=0,\"\",Prezentace!F8)","v":"František"},{"$f":"IF(Prezentace!E8=0,\"\",Prezentace!E8)","v":"Toman "},null,null,null,1,null,1,null,2,2,4,5,null,null,null,124]
[{"$f":"IF(Prezentace!A9=0,\"\",Prezentace!A9)","v":""},{"$f":"IF(Prezentace!B9=0,\"\",Prezentace!B9)","v":""},{"$f":"Prezentace!D9","v":"P"},{"$f":"IF(Prezentace!F9=0,\"\",Prezentace!F9)","v":"Jiří"},{"$f":"IF(Prezentace!E9=0,\"\",Prezentace!E9)","v":"Švihálek "},null,null,null,null,null,null,1,null,3,8,3,null,null,null,132]
[{"$f":"IF(Prezentace!A10=0,\"\",Prezentace!A10)","v":""},{"$f":"IF(Prezentace!B10=0,\"\",Prezentace!B10)","v":""},{"$f":"Prezentace!D10","v":"R"},{"$f":"IF(Prezentace!F10=0,\"\",Prezentace!F10)","v":"Jiří"},{"$f":"IF(Prezentace!E10=0,\"\",Prezentace!E10)","v":"Švihálek "},null,null,null,null,1,null,2,2,5,4,1,null,null,null,116]
[{"$f":"IF(Prezentace!A11=0,\"\",Prezentace!A11)","v":""},{"$f":"IF(Prezentace!B11=0,\"\",Prezentace!B11)","v":""},{"$f":"Prezentace!D11","v":"P"},{"$f":"IF(Prezentace!F11=0,\"\",Prezentace!F11)","v":"Vladimír"},{"$f":"IF(Prezentace!E11=0,\"\",Prezentace!E11)","v":"VejslíK "},null,null,null,null,null,1,1,2,4,4,3,null,null,null,123]
[{"$f":"IF(Prezentace!A12=0,\"\",Prezentace!A12)","v":""},{"$f":"IF(Prezentace!B12=0,\"\",Prezentace!B12)","v":""},{"$f":"Prezentace!D12","v":"P"},{"$f":"IF(Prezentace!F12=0,\"\",Prezentace!F12)","v":"Milan"},{"$f":"IF(Prezentace!E12=0,\"\",Prezentace!E12)","v":"Kraus "},null,null,null,null,null,null,1,2,4,4,4,null,null,null,128]
[{"$f":"IF(Prezentace!A13=0,\"\",Prezentace!A13)","v":""},{"$f":"IF(Prezentace!B13=0,\"\",Prezentace!B13)","v":""},{"$f":"Prezentace!D13","v":"P"},{"$f":"IF(Prezentace!F13=0,\"\",Prezentace!F13)","v":"Vojtěch"},{"$f":"IF(Prezentace!E13=0,\"\",Prezentace!E13)","v":"Brejžek "},null,null,null,null,null,null,null,2,4,4,5,null,null,null,132]
[{"$f":"IF(Prezentace!A14=0,\"\",Prezentace!A14)","v":""},{"$f":"IF(Prezentace!B14=0,\"\",Prezentace!B14)","v":""},{"$f":"Prezentace!D14","v":"P"},{"$f":"IF(Prezentace!F14=0,\"\",Prezentace!F14)","v":"Karel"},{"$f":"IF(Prezentace!E14=0,\"\",Prezentace!E14)","v":"Získal "},null,null,null,null,null,null,1,3,6,4,1,null,null,null,121]
[{"$f":"IF(Prezentace!A15=0,\"\",Prezentace!A15)","v":""},{"$f":"IF(Prezentace!B15=0,\"\",Prezentace!B15)","v":""},{"$f":"Prezentace!D15","v":"R"},{"$f":"IF(Prezentace!F15=0,\"\",Prezentace!F15)","v":"Karel"},{"$f":"IF(Prezentace!E15=0,\"\",Prezentace!E15)","v":"Získal "},null,null,null,null,null,null,1,5,3,2,4,null,null,null,123]
[{"$f":"IF(Prezentace!A16=0,\"\",Prezentace!A16)","v":""},{"$f":"IF(Prezentace!B16=0,\"\",Prezentace!B16)","v":""},{"$f":"Prezentace!D16","v":"P"},{"$f":"IF(Prezentace!F16=0,\"\",Prezentace!F16)","v":"Marie"},{"$f":"IF(Prezentace!E16=0,\"\",Prezentace!E16)","v":"Žemličková"},null,null,null,null,2,1,3,3,4,1,1,null,null,null,103]
[{"$f":"IF(Prezentace!A17=0,\"\",Prezentace!A17)","v":""},{"$f":"IF(Prezentace!B17=0,\"\",Prezentace!B17)","v":""},{"$f":"Prezentace!D17","v":"P"},{"$f":"IF(Prezentace!F17=0,\"\",Prezentace!F17)","v":"Ladislav"},{"$f":"IF(Prezentace!E17=0,\"\",Prezentace!E17)","v":"Žemlička "},null,null,null,null,null,1,2,4,1,5,2,null,null,null,118]
[{"$f":"IF(Prezentace!A18=0,\"\",Prezentace!A18)","v":""},{"$f":"IF(Prezentace!B18=0,\"\",Prezentace!B18)","v":""},{"$f":"Prezentace!D18","v":"P"},{"$f":"IF(Prezentace!F18=0,\"\",Prezentace!F18)","v":"Jiří"},{"$f":"IF(Prezentace!E18=0,\"\",Prezentace!E18)","v":"Janovský "},4,1,null,1,5,null,2,1,null,1,null,null,null,null,52]
[{"$f":"IF(Prezentace!A19=0,\"\",Prezentace!A19)","v":""},{"$f":"IF(Prezentace!B19=0,\"\",Prezentace!B19)","v":""},{"$f":"Prezentace!D19","v":"P"},{"$f":"IF(Prezentace!F19=0,\"\",Prezentace!F19)","v":"Mojmír"},{"$f":"IF(Prezentace!E19=0,\"\",Prezentace!E19)","v":"Janovský "},null,null,null,null,null,1,4,2,4,4,null,null,null,null,111]
[{"$f":"IF(Prezentace!A20=0,\"\",Prezentace!A20)","v":""},{"$f":"IF(Prezentace!B20=0,\"\",Prezentace!B20)","v":""},{"$f":"Prezentace!D20","v":"P"},{"$f":"IF(Prezentace!F20=0,\"\",Prezentace!F20)","v":"Bohumil"},{"$f":"IF(Prezentace!E20=0,\"\",Prezentace!E20)","v":"Herceg"},null,null,null,null,null,1,1,4,2,6,1,null,null,null,119]
[{"$f":"IF(Prezentace!A21=0,\"\",Prezentace!A21)","v":""},{"$f":"IF(Prezentace!B21=0,\"\",Prezentace!B21)","v":""},{"$f":"Prezentace!D21","v":"P"},{"$f":"IF(Prezentace!F21=0,\"\",Prezentace!F21)","v":"Michal"},{"$f":"IF(Prezentace!E21=0,\"\",Prezentace!E21)","v":"Svoboda"},null,null,null,null,1,null,null,4,6,2,2,null,null,null,118]
[{"$f":"IF(Prezentace!A22=0,\"\",Prezentace!A22)","v":""},{"$f":"IF(Prezentace!B22=0,\"\",Prezentace!B22)","v":""},{"$f":"Prezentace!D22","v":"P"},{"$f":"IF(Prezentace!F22=0,\"\",Prezentace!F22)","v":"Viktor"},{"$f":"IF(Prezentace!E22=0,\"\",Prezentace!E22)","v":"Fuksa  "},null,null,null,null,null,null,1,null,4,8,2,null,null,null,130]
[{"$f":"IF(Prezentace!A23=0,\"\",Prezentace!A23)","v":""},{"$f":"IF(Prezentace!B23=0,\"\",Prezentace!B23)","v":""},{"$f":"Prezentace!D23","v":"P"},{"$f":"IF(Prezentace!F23=0,\"\",Prezentace!F23)","v":"Miroslav"},{"$f":"IF(Prezentace!E23=0,\"\",Prezentace!E23)","v":"Koch   ml."},null,null,null,null,null,null,null,1,4,8,2,null,null,null,131]
[{"$f":"IF(Prezentace!A24=0,\"\",Prezentace!A24)","v":""},{"$f":"IF(Prezentace!B24=0,\"\",Prezentace!B24)","v":""},{"$f":"Prezentace!D24","v":"P"},{"$f":"IF(Prezentace!F24=0,\"\",Prezentace!F24)","v":"Miroslav"},{"$f":"IF(Prezentace!E24=0,\"\",Prezentace!E24)","v":"Koch  st. "},null,null,null,null,null,null,null,1,4,6,4,null,null,null,133]
[{"$f":"IF(Prezentace!A25=0,\"\",Prezentace!A25)","v":""},{"$f":"IF(Prezentace!B25=0,\"\",Prezentace!B25)","v":""},{"$f":"Prezentace!D25","v":"P"},{"$f":"IF(Prezentace!F25=0,\"\",Prezentace!F25)","v":"Jaroslav"},{"$f":"IF(Prezentace!E25=0,\"\",Prezentace!E25)","v":"Kostříž "},null,null,null,null,null,null,2,2,7,2,2,null,null,null,120]
[{"$f":"IF(Prezentace!A26=0,\"\",Prezentace!A26)","v":""},{"$f":"IF(Prezentace!B26=0,\"\",Prezentace!B26)","v":""},{"$f":"Prezentace!D26","v":"P"},{"$f":"IF(Prezentace!F26=0,\"\",Prezentace!F26)","v":"Josef"},{"$f":"IF(Prezentace!E26=0,\"\",Prezentace!E26)","v":"Čekal "},null,null,null,null,1,null,3,4,4,2,1,null,null,null,110]
[{"$f":"IF(Prezentace!A27=0,\"\",Prezentace!A27)","v":""},{"$f":"IF(Prezentace!B27=0,\"\",Prezentace!B27)","v":""},{"$f":"Prezentace!D27","v":"P"},{"$f":"IF(Prezentace!F27=0,\"\",Prezentace!F27)","v":"Miloslav"},{"$f":"IF(Prezentace!E27=0,\"\",Prezentace!E27)","v":"Petržílka"},null,null,null,null,null,null,3,2,5,2,3,null,null,null,120]
[{"$f":"IF(Prezentace!A28=0,\"\",Prezentace!A28)","v":""},{"$f":"IF(Prezentace!B28=0,\"\",Prezentace!B28)","v":""},{"$f":"Prezentace!D28","v":"P"},{"$f":"IF(Prezentace!F28=0,\"\",Prezentace!F28)","v":"Václav"},{"$f":"IF(Prezentace!E28=0,\"\",Prezentace!E28)","v":"Landkammer"},null,null,null,null,null,1,3,3,4,1,3,null,null,null,115]
[{"$f":"IF(Prezentace!A29=0,\"\",Prezentace!A29)","v":""},{"$f":"IF(Prezentace!B29=0,\"\",Prezentace!B29)","v":""},{"$f":"Prezentace!D29","v":"P"},{"$f":"IF(Prezentace!F29=0,\"\",Prezentace!F29)","v":"Albert"},{"$f":"IF(Prezentace!E29=0,\"\",Prezentace!E29)","v":"Wrzecionko"},2,null,null,null,1,null,1,2,4,3,2,null,null,null,103]
[{"$f":"IF(Prezentace!A30=0,\"\",Prezentace!A30)","v":""},{"$f":"IF(Prezentace!B30=0,\"\",Prezentace!B30)","v":""},{"$f":"Prezentace!D30","v":"P"},{"$f":"IF(Prezentace!F30=0,\"\",Prezentace!F30)","v":"Michaela"},{"$f":"IF(Prezentace!E30=0,\"\",Prezentace!E30)","v":"Reisnerová"},null,null,3,2,1,3,3,null,null,null,null,null,null,null,49]
[{"$f":"IF(Prezentace!A31=0,\"\",Prezentace!A31)","v":""},{"$f":"IF(Prezentace!B31=0,\"\",Prezentace!B31)","v":""},{"$f":"Prezentace!D31","v":"P"},{"$f":"IF(Prezentace!F31=0,\"\",Prezentace!F31)","v":"Antonín"},{"$f":"IF(Prezentace!E31=0,\"\",Prezentace!E31)","v":"Urbanec  "},null,2,null,1,2,1,2,3,3,null,1,null,null,null,85]
[{"$f":"IF(Prezentace!#REF!=0,\"\",Prezentace!#REF!)","v":{"$error":"#REF!"}},{"$f":"IF(Prezentace!#REF!=0,\"\",Prezentace!#REF!)","v":{"$error":"#REF!"}},{"$f":"Prezentace!#REF!","v":{"$error":"#REF!"}},{"$f":"IF(Prezentace!#REF!=0,\"\",Prezentace!#REF!)","v":{"$error":"#REF!"}},{"$f":"IF(Prezentace!#REF!=0,\"\",Prezentace!#REF!)","v":{"$error":"#REF!"}},null,null,null,null,null,null,null,null,null,null,null,null,null,null,0]
[{"$f":"IF(Prezentace!#REF!=0,\"\",Prezentace!#REF!)","v":{"$error":"#REF!"}},{"$f":"IF(Prezentace!#REF!=0,\"\",Prezentace!#REF!)","v":{"$error":"#REF!"}},{"$f":"Prezentace!#REF!","v":{"$error":"#REF!"}},{"$f":"IF(Prezentace!#REF!=0,\"\",Prezentace!#REF!)","v":{"$error":"#REF!"}},{"$f":"IF(Prezentace!#REF!=0,\"\",Prezentace!#REF!)","v":{"$error":"#REF!"}},null,null,null,null,null,null,null,null,null,null,null,null,null,null,0]
[{"$f":"IF(Prezentace!#REF!=0,\"\",Prezentace!#REF!)","v":{"$error":"#REF!"}},{"$f":"IF(Prezentace!#REF!=0,\"\",Prezentace!#REF!)","v":{"$error":"#REF!"}},{"$f":"Prezentace!#REF!","v":{"$error":"#REF!"}},{"$f":"IF(Prezentace!#REF!=0,\"\",Prezentace!#REF!)","v":{"$error":"#REF!"}},{"$f":"IF(Prezentace!#REF!=0,\"\",Prezentace!#REF!)","v":{"$error":"#REF!"}},null,null,null,null,null,null,null,null,null,null,null,null,null,null,0]
[{"$f":"IF(Prezentace!#REF!=0,\"\",Prezentace!#REF!)","v":{"$error":"#REF!"}},{"$f":"IF(Prezentace!#REF!=0,\"\",Prezentace!#REF!)","v":{"$error":"#REF!"}},{"$f":"Prezentace!#REF!","v":{"$error":"#REF!"}},{"$f":"IF(Prezentace!#REF!=0,\"\",Prezentace!#REF!)","v":{"$error":"#REF!"}},{"$f":"IF(Prezentace!#REF!=0,\"\",Prezentace!#REF!)","v":{"$error":"#REF!"}},null,null,null,null,null,null,null,null,null,null,null,null,null,null,0]
[{"$f":"IF(Prezentace!#REF!=0,\"\",Prezentace!#REF!)","v":{"$error":"#REF!"}},{"$f":"IF(Prezentace!#REF!=0,\"\",Prezentace!#REF!)","v":{"$error":"#REF!"}},{"$f":"Prezentace!#REF!","v":{"$error":"#REF!"}},{"$f":"IF(Prezentace!#REF!=0,\"\",Prezentace!#REF!)","v":{"$error":"#REF!"}},{"$f":"IF(Prezentace!#REF!=0,\"\",Prezentace!#REF!)","v":{"$error":"#REF!"}},null,null,null,null,null,null,null,null,null,null,null,null,null,null,0]
[{"$f":"IF(Prezentace!#REF!=0,\"\",Prezentace!#REF!)","v":{"$error":"#REF!"}},{"$f":"IF(Prezentace!#REF!=0,\"\",Prezentace!#REF!)","v":{"$error":"#REF!"}},{"$f":"Prezentace!#REF!","v":{"$error":"#REF!"}},{"$f":"IF(Prezentace!#REF!=0,\"\",Prezentace!#REF!)","v":{"$error":"#REF!"}},{"$f":"IF(Prezentace!#REF!=0,\"\",Prezentace!#REF!)","v":{"$error":"#REF!"}},null,null,null,null,null,null,null,null,null,null,null,null,null,null,0]
[{"$f":"IF(Prezentace!#REF!=0,\"\",Prezentace!#REF!)","v":{"$error":"#REF!"}},{"$f":"IF(Prezentace!#REF!=0,\"\",Prezentace!#REF!)","v":{"$error":"#REF!"}},{"$f":"Prezentace!#REF!","v":{"$error":"#REF!"}},{"$f":"IF(Prezentace!#REF!=0,\"\",Prezentace!#REF!)","v":{"$error":"#REF!"}},{"$f":"IF(Prezentace!#REF!=0,\"\",Prezentace!#REF!)","v":{"$error":"#REF!"}},null,null,null,null,null,null,null,null,null,null,null,null,null,null,0]
[{"$f":"IF(Prezentace!#REF!=0,\"\",Prezentace!#REF!)","v":{"$error":"#REF!"}},{"$f":"IF(Prezentace!#REF!=0,\"\",Prezentace!#REF!)","v":{"$error":"#REF!"}},{"$f":"Prezentace!#REF!","v":{"$error":"#REF!"}},{"$f":"IF(Prezentace!#REF!=0,\"\",Prezentace!#REF!)","v":{"$error":"#REF!"}},{"$f":"IF(Prezentace!#REF!=0,\"\",Prezentace!#REF!)","v":{"$error":"#REF!"}},null,null,null,null,null,null,null,null,null,null,null,null,null,null,{"$f":"(SUM(F37*$F$3,G37*$G$3,H37*$H$3,I37*$I$3,J37*$J$3,K37*$K$3,L37*$L$3,M37*$M$3,N37*$N$3,O37*$O$3,P37*$P$3,Q37*$Q$3,R37*$R$3))-S37","v":0}]
[{"$f":"IF(Prezentace!#REF!=0,\"\",Prezentace!#REF!)","v":{"$error":"#REF!"}},{"$f":"IF(Prezentace!#REF!=0,\"\",Prezentace!#REF!)","v":{"$error":"#REF!"}},{"$f":"Prezentace!#REF!","v":{"$error":"#REF!"}},{"$f":"IF(Prezentace!#REF!=0,\"\",Prezentace!#REF!)","v":{"$error":"#REF!"}},{"$f":"IF(Prezentace!#REF!=0,\"\",Prezentace!#REF!)","v":{"$error":"#REF!"}},null,null,null,null,null,null,null,null,null,null,null,null,null,null,0]
[{"$f":"IF(Prezentace!#REF!=0,\"\",Prezentace!#REF!)","v":{"$error":"#REF!"}},{"$f":"IF(Prezentace!#REF!=0,\"\",Prezentace!#REF!)","v":{"$error":"#REF!"}},{"$f":"Prezentace!#REF!","v":{"$error":"#REF!"}},{"$f":"IF(Prezentace!#REF!=0,\"\",Prezentace!#REF!)","v":{"$error":"#REF!"}},{"$f":"IF(Prezentace!#REF!=0,\"\",Prezentace!#REF!)","v":{"$error":"#REF!"}},null,null,null,null,null,null,null,null,null,null,null,null,null,null,0]
[{"$f":"IF(Prezentace!#REF!=0,\"\",Prezentace!#REF!)","v":{"$error":"#REF!"}},{"$f":"IF(Prezentace!#REF!=0,\"\",Prezentace!#REF!)","v":{"$error":"#REF!"}},{"$f":"Prezentace!#REF!","v":{"$error":"#REF!"}},{"$f":"IF(Prezentace!#REF!=0,\"\",Prezentace!#REF!)","v":{"$error":"#REF!"}},{"$f":"IF(Prezentace!#REF!=0,\"\",Prezentace!#REF!)","v":{"$error":"#REF!"}},null,null,null,null,null,null,null,null,null,null,null,null,null,null,0]
[{"$f":"IF(Prezentace!#REF!=0,\"\",Prezentace!#REF!)","v":{"$error":"#REF!"}},{"$f":"IF(Prezentace!#REF!=0,\"\",Prezentace!#REF!)","v":{"$error":"#REF!"}},{"$f":"Prezentace!#REF!","v":{"$error":"#REF!"}},{"$f":"IF(Prezentace!#REF!=0,\"\",Prezentace!#REF!)","v":{"$error":"#REF!"}},{"$f":"IF(Prezentace!#REF!=0,\"\",Prezentace!#REF!)","v":{"$error":"#REF!"}},null,null,null,null,null,null,null,null,null,null,null,null,null,null,0]
[{"$f":"IF(Prezentace!#REF!=0,\"\",Prezentace!#REF!)","v":{"$error":"#REF!"}},{"$f":"IF(Prezentace!#REF!=0,\"\",Prezentace!#REF!)","v":{"$error":"#REF!"}},{"$f":"Prezentace!#REF!","v":{"$error":"#REF!"}},{"$f":"IF(Prezentace!#REF!=0,\"\",Prezentace!#REF!)","v":{"$error":"#REF!"}},{"$f":"IF(Prezentace!#REF!=0,\"\",Prezentace!#REF!)","v":{"$error":"#REF!"}},null,null,null,null,null,null,null,null,null,null,null,null,null,null,0]
[{"$f":"IF(Prezentace!#REF!=0,\"\",Prezentace!#REF!)","v":{"$error":"#REF!"}},{"$f":"IF(Prezentace!#REF!=0,\"\",Prezentace!#REF!)","v":{"$error":"#REF!"}},{"$f":"Prezentace!#REF!","v":{"$error":"#REF!"}},{"$f":"IF(Prezentace!#REF!=0,\"\",Prezentace!#REF!)","v":{"$error":"#REF!"}},{"$f":"IF(Prezentace!#REF!=0,\"\",Prezentace!#REF!)","v":{"$error":"#REF!"}},null,null,null,null,null,null,null,null,null,null,null,null,null,null,0]
[{"$f":"IF(Prezentace!#REF!=0,\"\",Prezentace!#REF!)","v":{"$error":"#REF!"}},{"$f":"IF(Prezentace!#REF!=0,\"\",Prezentace!#REF!)","v":{"$error":"#REF!"}},{"$f":"Prezentace!#REF!","v":{"$error":"#REF!"}},{"$f":"IF(Prezentace!#REF!=0,\"\",Prezentace!#REF!)","v":{"$error":"#REF!"}},{"$f":"IF(Prezentace!#REF!=0,\"\",Prezentace!#REF!)","v":{"$error":"#REF!"}},null,null,null,null,null,null,null,null,null,null,null,null,null,null,0]
[{"$f":"IF(Prezentace!#REF!=0,\"\",Prezentace!#REF!)","v":{"$error":"#REF!"}},{"$f":"IF(Prezentace!#REF!=0,\"\",Prezentace!#REF!)","v":{"$error":"#REF!"}},{"$f":"Prezentace!#REF!","v":{"$error":"#REF!"}},{"$f":"IF(Prezentace!#REF!=0,\"\",Prezentace!#REF!)","v":{"$error":"#REF!"}},{"$f":"IF(Prezentace!#REF!=0,\"\",Prezentace!#REF!)","v":{"$error":"#REF!"}},null,null,null,null,null,null,null,null,null,null,null,null,null,null,0]
[{"$f":"IF(Prezentace!#REF!=0,\"\",Prezentace!#REF!)","v":{"$error":"#REF!"}},{"$f":"IF(Prezentace!#REF!=0,\"\",Prezentace!#REF!)","v":{"$error":"#REF!"}},{"$f":"Prezentace!#REF!","v":{"$error":"#REF!"}},{"$f":"IF(Prezentace!#REF!=0,\"\",Prezentace!#REF!)","v":{"$error":"#REF!"}},{"$f":"IF(Prezentace!#REF!=0,\"\",Prezentace!#REF!)","v":{"$error":"#REF!"}},null,null,null,null,null,null,null,null,null,null,null,null,null,null,0]
[{"$f":"IF(Prezentace!#REF!=0,\"\",Prezentace!#REF!)","v":{"$error":"#REF!"}},{"$f":"IF(Prezentace!#REF!=0,\"\",Prezentace!#REF!)","v":{"$error":"#REF!"}},{"$f":"Prezentace!#REF!","v":{"$error":"#REF!"}},{"$f":"IF(Prezentace!#REF!=0,\"\",Prezentace!#REF!)","v":{"$error":"#REF!"}},{"$f":"IF(Prezentace!#REF!=0,\"\",Prezentace!#REF!)","v":{"$error":"#REF!"}},null,null,null,null,null,null,null,null,null,null,null,null,null,null,0]
[{"$f":"IF(Prezentace!#REF!=0,\"\",Prezentace!#REF!)","v":{"$error":"#REF!"}},{"$f":"IF(Prezentace!#REF!=0,\"\",Prezentace!#REF!)","v":{"$error":"#REF!"}},{"$f":"Prezentace!#REF!","v":{"$error":"#REF!"}},{"$f":"IF(Prezentace!#REF!=0,\"\",Prezentace!#REF!)","v":{"$error":"#REF!"}},{"$f":"IF(Prezentace!#REF!=0,\"\",Prezentace!#REF!)","v":{"$error":"#REF!"}},null,null,null,null,null,null,null,null,null,null,null,null,null,null,0]
[{"$f":"IF(Prezentace!#REF!=0,\"\",Prezentace!#REF!)","v":{"$error":"#REF!"}},{"$f":"IF(Prezentace!#REF!=0,\"\",Prezentace!#REF!)","v":{"$error":"#REF!"}},{"$f":"Prezentace!#REF!","v":{"$error":"#REF!"}},{"$f":"IF(Prezentace!#REF!=0,\"\",Prezentace!#REF!)","v":{"$error":"#REF!"}},{"$f":"IF(Prezentace!#REF!=0,\"\",Prezentace!#REF!)","v":{"$error":"#REF!"}},null,null,null,null,null,null,null,null,null,null,null,null,null,null,0]
[{"$f":"IF(Prezentace!#REF!=0,\"\",Prezentace!#REF!)","v":{"$error":"#REF!"}},{"$f":"IF(Prezentace!#REF!=0,\"\",Prezentace!#REF!)","v":{"$error":"#REF!"}},{"$f":"Prezentace!#REF!","v":{"$error":"#REF!"}},{"$f":"IF(Prezentace!#REF!=0,\"\",Prezentace!#REF!)","v":{"$error":"#REF!"}},{"$f":"IF(Prezentace!#REF!=0,\"\",Prezentace!#REF!)","v":{"$error":"#REF!"}},null,null,null,null,null,null,null,null,null,null,null,null,null,null,0]
[{"$f":"IF(Prezentace!#REF!=0,\"\",Prezentace!#REF!)","v":{"$error":"#REF!"}},{"$f":"IF(Prezentace!#REF!=0,\"\",Prezentace!#REF!)","v":{"$error":"#REF!"}},{"$f":"Prezentace!#REF!","v":{"$error":"#REF!"}},{"$f":"IF(Prezentace!#REF!=0,\"\",Prezentace!#REF!)","v":{"$error":"#REF!"}},{"$f":"IF(Prezentace!#REF!=0,\"\",Prezentace!#REF!)","v":{"$error":"#REF!"}},null,null,null,null,null,null,null,null,null,null,null,null,null,null,0]
[{"$f":"IF(Prezentace!#REF!=0,\"\",Prezentace!#REF!)","v":{"$error":"#REF!"}},{"$f":"IF(Prezentace!#REF!=0,\"\",Prezentace!#REF!)","v":{"$error":"#REF!"}},{"$f":"Prezentace!#REF!","v":{"$error":"#REF!"}},{"$f":"IF(Prezentace!#REF!=0,\"\",Prezentace!#REF!)","v":{"$error":"#REF!"}},{"$f":"IF(Prezentace!#REF!=0,\"\",Prezentace!#REF!)","v":{"$error":"#REF!"}},null,null,null,null,null,null,null,null,null,null,null,null,null,null,0]
[{"$f":"IF(Prezentace!#REF!=0,\"\",Prezentace!#REF!)","v":{"$error":"#REF!"}},{"$f":"IF(Prezentace!#REF!=0,\"\",Prezentace!#REF!)","v":{"$error":"#REF!"}},{"$f":"Prezentace!#REF!","v":{"$error":"#REF!"}},{"$f":"IF(Prezentace!#REF!=0,\"\",Prezentace!#REF!)","v":{"$error":"#REF!"}},{"$f":"IF(Prezentace!#REF!=0,\"\",Prezentace!#REF!)","v":{"$error":"#REF!"}},null,null,null,null,null,null,null,null,null,null,null,null,null,null,0]
[{"$f":"IF(Prezentace!#REF!=0,\"\",Prezentace!#REF!)","v":{"$error":"#REF!"}},{"$f":"IF(Prezentace!#REF!=0,\"\",Prezentace!#REF!)","v":{"$error":"#REF!"}},{"$f":"Prezentace!#REF!","v":{"$error":"#REF!"}},{"$f":"IF(Prezentace!#REF!=0,\"\",Prezentace!#REF!)","v":{"$error":"#REF!"}},{"$f":"IF(Prezentace!#REF!=0,\"\",Prezentace!#REF!)","v":{"$error":"#REF!"}},null,null,null,null,null,null,null,null,null,null,null,null,null,null,0]
[{"$f":"IF(Prezentace!#REF!=0,\"\",Prezentace!#REF!)","v":{"$error":"#REF!"}},{"$f":"IF(Prezentace!#REF!=0,\"\",Prezentace!#REF!)","v":{"$error":"#REF!"}},{"$f":"Prezentace!#REF!","v":{"$error":"#REF!"}},{"$f":"IF(Prezentace!#REF!=0,\"\",Prezentace!#REF!)","v":{"$error":"#REF!"}},{"$f":"IF(Prezentace!#REF!=0,\"\",Prezentace!#REF!)","v":{"$error":"#REF!"}},null,null,null,null,null,null,null,null,null,null,null,null,null,null,0]
[{"$f":"IF(Prezentace!#REF!=0,\"\",Prezentace!#REF!)","v":{"$error":"#REF!"}},{"$f":"IF(Prezentace!#REF!=0,\"\",Prezentace!#REF!)","v":{"$error":"#REF!"}},{"$f":"Prezentace!#REF!","v":{"$error":"#REF!"}},{"$f":"IF(Prezentace!#REF!=0,\"\",Prezentace!#REF!)","v":{"$error":"#REF!"}},{"$f":"IF(Prezentace!#REF!=0,\"\",Prezentace!#REF!)","v":{"$error":"#REF!"}},null,null,null,null,null,null,null,null,null,null,null,null,null,null,0]
[{"$f":"IF(Prezentace!#REF!=0,\"\",Prezentace!#REF!)","v":{"$error":"#REF!"}},{"$f":"IF(Prezentace!#REF!=0,\"\",Prezentace!#REF!)","v":{"$error":"#REF!"}},{"$f":"Prezentace!#REF!","v":{"$error":"#REF!"}},{"$f":"IF(Prezentace!#REF!=0,\"\",Prezentace!#REF!)","v":{"$error":"#REF!"}},{"$f":"IF(Prezentace!#REF!=0,\"\",Prezentace!#REF!)","v":{"$error":"#REF!"}},null,null,null,null,null,null,null,null,null,null,null,null,null,null,0]
[{"$f":"IF(Prezentace!A32=0,\"\",Prezentace!A32)","v":""},{"$f":"IF(Prezentace!B32=0,\"\",Prezentace!B32)","v":""},{"$f":"Prezentace!D32","v":"P"},{"$f":"IF(Prezentace!F32=0,\"\",Prezentace!F32)","v":""},{"$f":"IF(Prezentace!E32=0,\"\",Prezentace!E32)","v":""},null,null,null,null,null,null,null,null,null,null,null,null,null,null,0]
[{"$f":"IF(Prezentace!A33=0,\"\",Prezentace!A33)","v":""},{"$f":"IF(Prezentace!B33=0,\"\",Prezentace!B33)","v":""},{"$f":"Prezentace!D33","v":"P"},{"$f":"IF(Prezentace!F33=0,\"\",Prezentace!F33)","v":""},{"$f":"IF(Prezentace!E33=0,\"\",Prezentace!E33)","v":""},null,null,null,null,null,null,null,null,null,null,null,null,null,null,0]
[{"$f":"IF(Prezentace!A34=0,\"\",Prezentace!A34)","v":""},{"$f":"IF(Prezentace!B34=0,\"\",Prezentace!B34)","v":""},{"$f":"Prezentace!D34","v":"P"},{"$f":"IF(Prezentace!F34=0,\"\",Prezentace!F34)","v":""},{"$f":"IF(Prezentace!E34=0,\"\",Prezentace!E34)","v":""},null,null,null,null,null,null,null,null,null,null,null,null,null,null,0]
[{"$f":"IF(Prezentace!A35=0,\"\",Prezentace!A35)","v":""},{"$f":"IF(Prezentace!B35=0,\"\",Prezentace!B35)","v":""},{"$f":"Prezentace!D35","v":"P"},{"$f":"IF(Prezentace!F35=0,\"\",Prezentace!F35)","v":""},{"$f":"IF(Prezentace!E35=0,\"\",Prezentace!E35)","v":""},null,null,null,null,null,null,null,null,null,null,null,null,null,null,0]
[{"$f":"IF(Prezentace!A36=0,\"\",Prezentace!A36)","v":""},{"$f":"IF(Prezentace!B36=0,\"\",Prezentace!B36)","v":""},{"$f":"Prezentace!D36","v":"P"},{"$f":"IF(Prezentace!F36=0,\"\",Prezentace!F36)","v":""},{"$f":"IF(Prezentace!E36=0,\"\",Prezentace!E36)","v":""},null,null,null,null,null,null,null,null,null,null,null,null,null,null,0]
[{"$f":"IF(Prezentace!A37=0,\"\",Prezentace!A37)","v":""},{"$f":"IF(Prezentace!B37=0,\"\",Prezentace!B37)","v":""},{"$f":"Prezentace!D37","v":"P"},{"$f":"IF(Prezentace!F37=0,\"\",Prezentace!F37)","v":""},{"$f":"IF(Prezentace!E37=0,\"\",Prezentace!E37)","v":""},null,null,null,null,null,null,null,null,null,null,null,null,null,null,0]
[{"$f":"IF(Prezentace!A38=0,\"\",Prezentace!A38)","v":""},{"$f":"IF(Prezentace!B38=0,\"\",Prezentace!B38)","v":""},{"$f":"Prezentace!D38","v":"P"},{"$f":"IF(Prezentace!F38=0,\"\",Prezentace!F38)","v":""},{"$f":"IF(Prezentace!E38=0,\"\",Prezentace!E38)","v":""},null,null,null,null,null,null,null,null,null,null,null,null,null,null,0]
[{"$f":"IF(Prezentace!A39=0,\"\",Prezentace!A39)","v":""},{"$f":"IF(Prezentace!B39=0,\"\",Prezentace!B39)","v":""},{"$f":"Prezentace!D39","v":"P"},{"$f":"IF(Prezentace!F39=0,\"\",Prezentace!F39)","v":""},{"$f":"IF(Prezentace!E39=0,\"\",Prezentace!E39)","v":""},null,null,null,null,null,null,null,null,null,null,null,null,null,null,0]
[{"$f":"IF(Prezentace!A40=0,\"\",Prezentace!A40)","v":""},{"$f":"IF(Prezentace!B40=0,\"\",Prezentace!B40)","v":""},{"$f":"Prezentace!D40","v":"P"},{"$f":"IF(Prezentace!F40=0,\"\",Prezentace!F40)","v":""},{"$f":"IF(Prezentace!E40=0,\"\",Prezentace!E40)","v":""},null,null,null,null,null,null,null,null,null,null,null,null,null,null,0]
[{"$f":"IF(Prezentace!A41=0,\"\",Prezentace!A41)","v":""},{"$f":"IF(Prezentace!B41=0,\"\",Prezentace!B41)","v":""},{"$f":"Prezentace!D41","v":"P"},{"$f":"IF(Prezentace!F41=0,\"\",Prezentace!F41)","v":""},{"$f":"IF(Prezentace!E41=0,\"\",Prezentace!E41)","v":""},null,null,null,null,null,null,null,null,null,null,null,null,null,null,0]
[{"$f":"IF(Prezentace!A42=0,\"\",Prezentace!A42)","v":""},{"$f":"IF(Prezentace!B42=0,\"\",Prezentace!B42)","v":""},{"$f":"Prezentace!D42","v":"P"},{"$f":"IF(Prezentace!F42=0,\"\",Prezentace!F42)","v":""},{"$f":"IF(Prezentace!E42=0,\"\",Prezentace!E42)","v":""},null,null,null,null,null,null,null,null,null,null,null,null,null,null,0]
[{"$f":"IF(Prezentace!A43=0,\"\",Prezentace!A43)","v":""},{"$f":"IF(Prezentace!B43=0,\"\",Prezentace!B43)","v":""},{"$f":"Prezentace!D43","v":"P"},{"$f":"IF(Prezentace!F43=0,\"\",Prezentace!F43)","v":""},{"$f":"IF(Prezentace!E43=0,\"\",Prezentace!E43)","v":""},null,null,null,null,null,null,null,null,null,null,null,null,null,null,0]
[{"$f":"IF(Prezentace!A44=0,\"\",Prezentace!A44)","v":""},{"$f":"IF(Prezentace!B44=0,\"\",Prezentace!B44)","v":""},{"$f":"Prezentace!D44","v":"P"},{"$f":"IF(Prezentace!F44=0,\"\",Prezentace!F44)","v":""},{"$f":"IF(Prezentace!E44=0,\"\",Prezentace!E44)","v":""},null,null,null,null,null,null,null,null,null,null,null,null,null,null,0]
[{"$f":"IF(Prezentace!A45=0,\"\",Prezentace!A45)","v":""},{"$f":"IF(Prezentace!B45=0,\"\",Prezentace!B45)","v":""},{"$f":"Prezentace!D45","v":"P"},{"$f":"IF(Prezentace!F45=0,\"\",Prezentace!F45)","v":""},{"$f":"IF(Prezentace!E45=0,\"\",Prezentace!E45)","v":""},null,null,null,null,null,null,null,null,null,null,null,null,null,null,0]
[{"$f":"IF(Prezentace!A46=0,\"\",Prezentace!A46)","v":""},{"$f":"IF(Prezentace!B46=0,\"\",Prezentace!B46)","v":""},{"$f":"Prezentace!D46","v":"P"},{"$f":"IF(Prezentace!F46=0,\"\",Prezentace!F46)","v":""},{"$f":"IF(Prezentace!E46=0,\"\",Prezentace!E46)","v":""},null,null,null,null,null,null,null,null,null,null,null,null,null,null,0]
[{"$f":"IF(Prezentace!A47=0,\"\",Prezentace!A47)","v":""},{"$f":"IF(Prezentace!B47=0,\"\",Prezentace!B47)","v":""},{"$f":"Prezentace!D47","v":"P"},{"$f":"IF(Prezentace!F47=0,\"\",Prezentace!F47)","v":""},{"$f":"IF(Prezentace!E47=0,\"\",Prezentace!E47)","v":""},null,null,null,null,null,null,null,null,null,null,null,null,null,null,0]
[{"$f":"IF(Prezentace!A48=0,\"\",Prezentace!A48)","v":""},{"$f":"IF(Prezentace!B48=0,\"\",Prezentace!B48)","v":""},{"$f":"Prezentace!D48","v":"P"},{"$f":"IF(Prezentace!F48=0,\"\",Prezentace!F48)","v":""},{"$f":"IF(Prezentace!E48=0,\"\",Prezentace!E48)","v":""},null,null,null,null,null,null,null,null,null,null,null,null,null,null,0]
[{"$f":"IF(Prezentace!A49=0,\"\",Prezentace!A49)","v":""},{"$f":"IF(Prezentace!B49=0,\"\",Prezentace!B49)","v":""},{"$f":"Prezentace!D49","v":"P"},{"$f":"IF(Prezentace!F49=0,\"\",Prezentace!F49)","v":""},{"$f":"IF(Prezentace!E49=0,\"\",Prezentace!E49)","v":""},null,null,null,null,null,null,null,null,null,null,null,null,null,null,0]
[{"$f":"IF(Prezentace!A50=0,\"\",Prezentace!A50)","v":""},{"$f":"IF(Prezentace!B50=0,\"\",Prezentace!B50)","v":""},{"$f":"Prezentace!D50","v":"P"},{"$f":"IF(Prezentace!F50=0,\"\",Prezentace!F50)","v":""},{"$f":"IF(Prezentace!E50=0,\"\",Prezentace!E50)","v":""},null,null,null,null,null,null,null,null,null,null,null,null,null,null,0]
[{"$f":"IF(Prezentace!A51=0,\"\",Prezentace!A51)","v":""},{"$f":"IF(Prezentace!B51=0,\"\",Prezentace!B51)","v":""},{"$f":"Prezentace!D51","v":"P"},{"$f":"IF(Prezentace!F51=0,\"\",Prezentace!F51)","v":""},{"$f":"IF(Prezentace!E51=0,\"\",Prezentace!E51)","v":""},null,null,null,null,null,null,null,null,null,null,null,null,null,null,0]
[{"$f":"IF(Prezentace!A52=0,\"\",Prezentace!A52)","v":""},{"$f":"IF(Prezentace!B52=0,\"\",Prezentace!B52)","v":""},{"$f":"Prezentace!D52","v":"P"},{"$f":"IF(Prezentace!F52=0,\"\",Prezentace!F52)","v":""},{"$f":"IF(Prezentace!E52=0,\"\",Prezentace!E52)","v":""},null,null,null,null,null,null,null,null,null,null,null,null,null,null,0]
[{"$f":"IF(Prezentace!A53=0,\"\",Prezentace!A53)","v":""},{"$f":"IF(Prezentace!B53=0,\"\",Prezentace!B53)","v":""},{"$f":"Prezentace!D53","v":"P"},{"$f":"IF(Prezentace!F53=0,\"\",Prezentace!F53)","v":""},{"$f":"IF(Prezentace!E53=0,\"\",Prezentace!E53)","v":""},null,null,null,null,null,null,null,null,null,null,null,null,null,null,0]
[{"$f":"IF(Prezentace!A54=0,\"\",Prezentace!A54)","v":""},{"$f":"IF(Prezentace!B54=0,\"\",Prezentace!B54)","v":""},{"$f":"Prezentace!D54","v":"P"},{"$f":"IF(Prezentace!F54=0,\"\",Prezentace!F54)","v":""},{"$f":"IF(Prezentace!E54=0,\"\",Prezentace!E54)","v":""},null,null,null,null,null,null,null,null,null,null,null,null,null,null,0]
[{"$f":"IF(Prezentace!A55=0,\"\",Prezentace!A55)","v":""},{"$f":"IF(Prezentace!B55=0,\"\",Prezentace!B55)","v":""},{"$f":"Prezentace!D55","v":"P"},{"$f":"IF(Prezentace!F55=0,\"\",Prezentace!F55)","v":""},{"$f":"IF(Prezentace!E55=0,\"\",Prezentace!E55)","v":""},null,null,null,null,null,null,null,null,null,null,null,null,null,null,0]
[{"$f":"IF(Prezentace!A56=0,\"\",Prezentace!A56)","v":""},{"$f":"IF(Prezentace!B56=0,\"\",Prezentace!B56)","v":""},{"$f":"Prezentace!D56","v":"P"},{"$f":"IF(Prezentace!F56=0,\"\",Prezentace!F56)","v":""},{"$f":"IF(Prezentace!E56=0,\"\",Prezentace!E56)","v":""},null,null,null,null,null,null,null,null,null,null,null,null,null,null,0]
[{"$f":"IF(Prezentace!A57=0,\"\",Prezentace!A57)","v":""},{"$f":"IF(Prezentace!B57=0,\"\",Prezentace!B57)","v":""},{"$f":"Prezentace!D57","v":"P"},{"$f":"IF(Prezentace!F57=0,\"\",Prezentace!F57)","v":""},{"$f":"IF(Prezentace!E57=0,\"\",Prezentace!E57)","v":""},null,null,null,null,null,null,null,null,null,null,null,null,null,null,0]
[{"$f":"IF(Prezentace!A58=0,\"\",Prezentace!A58)","v":""},{"$f":"IF(Prezentace!B58=0,\"\",Prezentace!B58)","v":""},{"$f":"Prezentace!D58","v":"P"},{"$f":"IF(Prezentace!F58=0,\"\",Prezentace!F58)","v":""},{"$f":"IF(Prezentace!E58=0,\"\",Prezentace!E58)","v":""},null,null,null,null,null,null,null,null,null,null,null,null,null,null,0]
[{"$f":"IF(Prezentace!A59=0,\"\",Prezentace!A59)","v":""},{"$f":"IF(Prezentace!B59=0,\"\",Prezentace!B59)","v":""},{"$f":"Prezentace!D59","v":"P"},{"$f":"IF(Prezentace!F59=0,\"\",Prezentace!F59)","v":""},{"$f":"IF(Prezentace!E59=0,\"\",Prezentace!E59)","v":""},null,null,null,null,null,null,null,null,null,null,null,null,null,null,0]
[{"$f":"IF(Prezentace!A60=0,\"\",Prezentace!A60)","v":""},{"$f":"IF(Prezentace!B60=0,\"\",Prezentace!B60)","v":""},{"$f":"Prezentace!D60","v":"P"},{"$f":"IF(Prezentace!F60=0,\"\",Prezentace!F60)","v":""},{"$f":"IF(Prezentace!E60=0,\"\",Prezentace!E60)","v":""},null,null,null,null,null,null,null,null,null,null,null,null,null,null,0]
[{"$f":"IF(Prezentace!A61=0,\"\",Prezentace!A61)","v":""},{"$f":"IF(Prezentace!B61=0,\"\",Prezentace!B61)","v":""},{"$f":"Prezentace!D61","v":"P"},{"$f":"IF(Prezentace!F61=0,\"\",Prezentace!F61)","v":""},{"$f":"IF(Prezentace!E61=0,\"\",Prezentace!E61)","v":""},null,null,null,null,null,null,null,null,null,null,null,null,null,null,0]
[{"$f":"IF(Prezentace!A62=0,\"\",Prezentace!A62)","v":""},{"$f":"IF(Prezentace!B62=0,\"\",Prezentace!B62)","v":""},{"$f":"Prezentace!D62","v":"P"},{"$f":"IF(Prezentace!F62=0,\"\",Prezentace!F62)","v":""},{"$f":"IF(Prezentace!E62=0,\"\",Prezentace!E62)","v":""},null,null,null,null,null,null,null,null,null,null,null,null,null,null,0]
[{"$f":"IF(Prezentace!A63=0,\"\",Prezentace!A63)","v":""},{"$f":"IF(Prezentace!B63=0,\"\",Prezentace!B63)","v":""},{"$f":"Prezentace!D63","v":"P"},{"$f":"IF(Prezentace!F63=0,\"\",Prezentace!F63)","v":""},{"$f":"IF(Prezentace!E63=0,\"\",Prezentace!E63)","v":""},null,null,null,null,null,null,null,null,null,null,null,null,null,null,0]
[{"$f":"IF(Prezentace!A64=0,\"\",Prezentace!A64)","v":""},{"$f":"IF(Prezentace!B64=0,\"\",Prezentace!B64)","v":""},{"$f":"Prezentace!D64","v":"P"},{"$f":"IF(Prezentace!F64=0,\"\",Prezentace!F64)","v":""},{"$f":"IF(Prezentace!E64=0,\"\",Prezentace!E64)","v":""},null,null,null,null,null,null,null,null,null,null,null,null,null,null,0]
[{"$f":"IF(Prezentace!A65=0,\"\",Prezentace!A65)","v":""},{"$f":"IF(Prezentace!B65=0,\"\",Prezentace!B65)","v":""},{"$f":"Prezentace!D65","v":"P"},{"$f":"IF(Prezentace!F65=0,\"\",Prezentace!F65)","v":""},{"$f":"IF(Prezentace!E65=0,\"\",Prezentace!E65)","v":""},null,null,null,null,null,null,null,null,null,null,null,null,null,null,0]
[{"$f":"IF(Prezentace!A66=0,\"\",Prezentace!A66)","v":""},{"$f":"IF(Prezentace!B66=0,\"\",Prezentace!B66)","v":""},{"$f":"Prezentace!D66","v":"P"},{"$f":"IF(Prezentace!F66=0,\"\",Prezentace!F66)","v":""},{"$f":"IF(Prezentace!E66=0,\"\",Prezentace!E66)","v":""},null,null,null,null,null,null,null,null,null,null,null,null,null,null,0]
[{"$f":"IF(Prezentace!A67=0,\"\",Prezentace!A67)","v":""},{"$f":"IF(Prezentace!B67=0,\"\",Prezentace!B67)","v":""},{"$f":"Prezentace!D67","v":"P"},{"$f":"IF(Prezentace!F67=0,\"\",Prezentace!F67)","v":""},{"$f":"IF(Prezentace!E67=0,\"\",Prezentace!E67)","v":""},null,null,null,null,null,null,null,null,null,null,null,null,null,null,0]
[{"$f":"IF(Prezentace!A68=0,\"\",Prezentace!A68)","v":""},{"$f":"IF(Prezentace!B68=0,\"\",Prezentace!B68)","v":""},{"$f":"Prezentace!D68","v":"P"},{"$f":"IF(Prezentace!F68=0,\"\",Prezentace!F68)","v":""},{"$f":"IF(Prezentace!E68=0,\"\",Prezentace!E68)","v":""},null,null,null,null,null,null,null,null,null,null,null,null,null,null,0]
[{"$f":"IF(Prezentace!A69=0,\"\",Prezentace!A69)","v":""},{"$f":"IF(Prezentace!B69=0,\"\",Prezentace!B69)","v":""},{"$f":"Prezentace!D69","v":"P"},{"$f":"IF(Prezentace!F69=0,\"\",Prezentace!F69)","v":""},{"$f":"IF(Prezentace!E69=0,\"\",Prezentace!E69)","v":""},null,null,null,null,null,null,null,null,null,null,null,null,null,null,0]
[{"$f":"IF(Prezentace!A70=0,\"\",Prezentace!A70)","v":""},{"$f":"IF(Prezentace!B70=0,\"\",Prezentace!B70)","v":""},{"$f":"Prezentace!D70","v":"P"},{"$f":"IF(Prezentace!F70=0,\"\",Prezentace!F70)","v":""},{"$f":"IF(Prezentace!E70=0,\"\",Prezentace!E70)","v":""},null,null,null,null,null,null,null,null,null,null,null,null,null,null,0]
[{"$f":"IF(Prezentace!A71=0,\"\",Prezentace!A71)","v":""},{"$f":"IF(Prezentace!B71=0,\"\",Prezentace!B71)","v":""},"P",{"$f":"IF(Prezentace!F71=0,\"\",Prezentace!F71)","v":""},{"$f":"IF(Prezentace!E71=0,\"\",Prezentace!E71)","v":""},null,null,null,null,null,null,null,null,null,null,null,null,null,null,0]
[{"$f":"IF(Prezentace!A72=0,\"\",Prezentace!A72)","v":""},{"$f":"IF(Prezentace!B72=0,\"\",Prezentace!B72)","v":""},{"$f":"Prezentace!D72","v":"P"},{"$f":"IF(Prezentace!F72=0,\"\",Prezentace!F72)","v":""},{"$f":"IF(Prezentace!E72=0,\"\",Prezentace!E72)","v":""},null,null,null,null,null,null,null,null,null,null,null,null,null,null,0]
[{"$f":"IF(Prezentace!A73=0,\"\",Prezentace!A73)","v":""},{"$f":"IF(Prezentace!B73=0,\"\",Prezentace!B73)","v":""},{"$f":"Prezentace!D73","v":"P"},{"$f":"IF(Prezentace!F73=0,\"\",Prezentace!F73)","v":""},{"$f":"IF(Prezentace!E73=0,\"\",Prezentace!E73)","v":""},null,null,null,null,null,null,null,null,null,null,null,null,null,null,0]
[{"$f":"IF(Prezentace!A74=0,\"\",Prezentace!A74)","v":""},{"$f":"IF(Prezentace!B74=0,\"\",Prezentace!B74)","v":""},{"$f":"Prezentace!D74","v":"P"},{"$f":"IF(Prezentace!F74=0,\"\",Prezentace!F74)","v":""},{"$f":"IF(Prezentace!E74=0,\"\",Prezentace!E74)","v":""},null,null,null,null,null,null,null,null,null,null,null,null,null,null,0]
[{"$f":"IF(Prezentace!A75=0,\"\",Prezentace!A75)","v":""},{"$f":"IF(Prezentace!B75=0,\"\",Prezentace!B75)","v":""},"P",{"$f":"IF(Prezentace!F75=0,\"\",Prezentace!F75)","v":""},{"$f":"IF(Prezentace!E75=0,\"\",Prezentace!E75)","v":""},null,null,null,null,null,null,null,null,null,null,null,null,null,null,{"$f":"(SUM(F101*$F$3,G101*$G$3,H101*$H$3,I101*$I$3,J101*$J$3,K101*$K$3,L101*$L$3,M101*$M$3,N101*$N$3,O101*$O$3,P101*$P$3,Q101*$Q$3,R101*$R$3))-S101","v":0}]

{"sheet":"2","index":4,"n_rows":101,"n_cols":22,"rows_kept":101,"cut":false,"hidden":false,"merged":[[0,3,0,20],[0,0,2,0],[0,1,2,1]]}
["Druž.","Kap.",null,"Disciplina 2"]
[]
[null,null,null,null,null,"K","M",1,2,3,4,5,6,7,8,9,10,11,12,"TB","Čas","Součet"]
[{"$f":"IF(Prezentace!A6=0,\"\",Prezentace!A6)","v":""},{"$f":"IF(Prezentace!B6=0,\"\",Prezentace!B6)","v":""},{"$f":"Prezentace!D6","v":"P"},{"$f":"IF(Prezentace!F6=0,\"\",Prezentace!F6)","v":"Milan"},{"$f":"IF(Prezentace!E6=0,\"\",Prezentace!E6)","v":"Matějka st."},null,null,8,7,7,6,6,0,0,0,0,0,null,null,null,17.809999999999999,{"$f":"(SUM(F4:T4))-U4","v":16.190000000000001}]
[{"$f":"IF(Prezentace!A7=0,\"\",Prezentace!A7)","v":""},{"$f":"IF(Prezentace!B7=0,\"\",Prezentace!B7)","v":""},{"$f":"Prezentace!D7","v":"P"},{"$f":"IF(Prezentace!F7=0,\"\",Prezentace!F7)","v":"Miroslav"},{"$f":"IF(Prezentace!E7=0,\"\",Prezentace!E7)","v":"Fiala  "},null,null,10,10,8,8,8,8,7,7,5,0,null,null,null,14.86,{"$f":"(SUM(F5:T5))-U5","v":56.14}]
[{"$f":"IF(Prezentace!A8=0,\"\",Prezentace!A8)","v":""},{"$f":"IF(Prezentace!B8=0,\"\",Prezentace!B8)","v":""},{"$f":"Prezentace!D8","v":"P"},{"$f":"IF(Prezentace!F8=0,\"\",Prezentace!F8)","v":"František"},{"$f":"IF(Prezentace!E8=0,\"\",Prezentace!E8)","v":"Toman "},null,null,10,9,9,8,8,8,8,8,7,0,null,null,null,10.95,64.05]
[{"$f":"IF(Prezentace!A9=0,\"\",Prezentace!A9)","v":""},{"$f":"IF(Prezentace!B9=0,\"\",Prezentace!B9)","v":""},{"$f":"Prezentace!D9","v":"P"},{"$f":"IF(Prezentace!F9=0,\"\",Prezentace!F9)","v":"Jiří"},{"$f":"IF(Prezentace!E9=0,\"\",Prezentace!E9)","v":"Švihálek "},null,null,10,10,9,9,9,8,7,7,5,0,null,null,null,14.46,59.54]
[{"$f":"IF(Prezentace!A10=0,\"\",Prezentace!A10)","v":""},{"$f":"IF(Prezentace!B10=0,\"\",Prezentace!B10)","v":""},{"$f":"Prezentace!D10","v":"R"},{"$f":"IF(Prezentace!F10=0,\"\",Prezentace!F10)","v":"Jiří"},{"$f":"IF(Prezentace!E10=0,\"\",Prezentace!E10)","v":"Švihálek "},null,null,10,10,10,9,9,8,8,7,6,0,null,null,null,26.49,50.510000000000005]
[{"$f":"IF(Prezentace!A11=0,\"\",Prezentace!A11)","v":""},{"$f":"IF(Prezentace!B11=0,\"\",Prezentace!B11)","v":""},{"$f":"Prezentace!D11","v":"P"},{"$f":"IF(Prezentace!F11=0,\"\",Prezentace!F11)","v":"Vladimír"},{"$f":"IF(Prezentace!E11=0,\"\",Prezentace!E11)","v":"VejslíK "},null,null,10,10,9,9,9,8,8,8,7,7,null,null,null,14.59,70.41]
[{"$f":"IF(Prezentace!A12=0,\"\",Prezentace!A12)","v":""},{"$f":"IF(Prezentace!B12=0,\"\",Prezentace!B12)","v":""},{"$f":"Prezentace!D12","v":"P"},{"$f":"IF(Prezentace!F12=0,\"\",Prezentace!F12)","v":"Milan"},{"$f":"IF(Prezentace!E12=0,\"\",Prezentace!E12)","v":"Kraus "},null,null,10,10,10,9,9,8,8,8,7,7,null,null,null,13.79,72.210000000000008]
[{"$f":"IF(Prezentace!A13=0,\"\",Prezentace!A13)","v":""},{"$f":"IF(Prezentace!B13=0,\"\",Prezentace!B13)","v":""},{"$f":"Prezentace!D13","v":"P"},{"$f":"IF(Prezentace!F13=0,\"\",Prezentace!F13)","v":"Vojtěch"},{"$f":"IF(Prezentace!E13=0,\"\",Prezentace!E13)","v":"Brejžek "},null,null,10,9,9,9,9,9,8,8,7,6,null,null,null,14.99,69.010000000000005]
[{"$f":"IF(Prezentace!A14=0,\"\",Prezentace!A14)","v":""},{"$f":"IF(Prezentace!B14=0,\"\",Prezentace!B14)","v":""},{"$f":"Prezentace!D14","v":"P"},{"$f":"IF(Prezentace!F14=0,\"\",Prezentace!F14)","v":"Karel"},{"$f":"IF(Prezentace!E14=0,\"\",Prezentace!E14)","v":"Získal "},null,null,10,10,9,9,9,8,8,8,8,7,null,null,null,17.12,68.88]
[{"$f":"IF(Prezentace!A15=0,\"\",Prezentace!A15)","v":""},{"$f":"IF(Prezentace!B15=0,\"\",Prezentace!B15)","v":""},{"$f":"Prezentace!D15","v":"R"},{"$f":"IF(Prezentace!F15=0,\"\",Prezentace!F15)","v":"Karel"},{"$f":"IF(Prezentace!E15=0,\"\",Prezentace!E15)","v":"Získal "},null,null,10,10,10,10,9,9,8,8,7,0,null,null,null,26.91,54.09]
[{"$f":"IF(Prezentace!A16=0,\"\",Prezentace!A16)","v":""},{"$f":"IF(Prezentace!B16=0,\"\",Prezentace!B16)","v":""},{"$f":"Prezentace!D16","v":"P"},{"$f":"IF(Prezentace!F16=0,\"\",Prezentace!F16)","v":"Marie"},{"$f":"IF(Prezentace!E16=0,\"\",Prezentace!E16)","v":"Žemličková"},null,null,10,10,9,9,9,9,8,8,8,0,null,null,null,15.53,64.47]
[{"$f":"IF(Prezentace!A17=0,\"\",Prezentace!A17)","v":""},{"$f":"IF(Prezentace!B17=0,\"\",Prezentace!B17)","v":""},{"$f":"Prezentace!D17","v":"P"},{"$f":"IF(Prezentace!F17=0,\"\",Prezentace!F17)","v":"Ladislav"},{"$f":"IF(Prezentace!E17=0,\"\",Prezentace!E17)","v":"Žemlička "},null,null,9,8,8,8,8,8,8,7,7,7,null,null,null,13.17,64.83]
[{"$f":"IF(Prezentace!A18=0,\"\",Prezentace!A18)","v":""},{"$f":"IF(Prezentace!B18=0,\"\",Prezentace!B18)","v":""},{"$f":"Prezentace!D18","v":"P"},{"$f":"IF(Prezentace!F18=0,\"\",Prezentace!F18)","v":"Jiří"},{"$f":"IF(Prezentace!E18=0,\"\",Prezentace!E18)","v":"Janovský "},null,null,9,9,9,9,7,7,6,6,5,0,null,null,null,25.83,41.17]
[{"$f":"IF(Prezentace!A19=0,\"\",Prezentace!A19)","v":""},{"$f":"IF(Prezentace!B19=0,\"\",Prezentace!B19)","v":""},{"$f":"Prezentace!D19","v":"P"},{"$f":"IF(Prezentace!F19=0,\"\",Prezentace!F19)","v":"Mojmír"},{"$f":"IF(Prezentace!E19=0,\"\",Prezentace!E19)","v":"Janovský "},null,null,10,10,9,9,8,8,8,7,7,6,null,null,null,20.350000000000001,61.65]
[{"$f":"IF(Prezentace!A20=0,\"\",Prezentace!A20)","v":""},{"$f":"IF(Prezentace!B20=0,\"\",Prezentace!B20)","v":""},{"$f":"Prezentace!D20","v":"P"},{"$f":"IF(Prezentace!F20=0,\"\",Prezentace!F20)","v":"Bohumil"},{"$f":"IF(Prezentace!E20=0,\"\",Prezentace!E20)","v":"Herceg"},null,null,10,8,8,8,7,6,6,5,6,5,null,null,null,17.149999999999999,51.85]
[{"$f":"IF(Prezentace!A21=0,\"\",Prezentace!A21)","v":""},{"$f":"IF(Prezentace!B21=0,\"\",Prezentace!B21)","v":""},{"$f":"Prezentace!D21","v":"P"},{"$f":"IF(Prezentace!F21=0,\"\",Prezentace!F21)","v":"Michal"},{"$f":"IF(Prezentace!E21=0,\"\",Prezentace!E21)","v":"Svoboda"},null,null,10,10,9,9,9,9,8,8,7,0,null,null,null,10.28,68.72]
[{"$f":"IF(Prezentace!A22=0,\"\",Prezentace!A22)","v":""},{"$f":"IF(Prezentace!B22=0,\"\",Prezentace!B22)","v":""},{"$f":"Prezentace!D22","v":"P"},{"$f":"IF(Prezentace!F22=0,\"\",Prezentace!F22)","v":"Viktor"},{"$f":"IF(Prezentace!E22=0,\"\",Prezentace!E22)","v":"Fuksa  "},null,null,10,10,9,9,9,9,9,9,9,8,null,null,null,19.649999999999999,71.349999999999994]
[{"$f":"IF(Prezentace!A23=0,\"\",Prezentace!A23)","v":""},{"$f":"IF(Prezentace!B23=0,\"\",Prezentace!B23)","v":""},{"$f":"Prezentace!D23","v":"P"},{"$f":"IF(Prezentace!F23=0,\"\",Prezentace!F23)","v":"Miroslav"},{"$f":"IF(Prezentace!E23=0,\"\",Prezentace!E23)","v":"Koch   ml."},null,null,10,10,10,8,7,7,7,7,6,0,null,null,null,14.52,57.480000000000004]
[{"$f":"IF(Prezentace!A24=0,\"\",Prezentace!A24)","v":""},{"$f":"IF(Prezentace!B24=0,\"\",Prezentace!B24)","v":""},{"$f":"Prezentace!D24","v":"P"},{"$f":"IF(Prezentace!F24=0,\"\",Prezentace!F24)","v":"Miroslav"},{"$f":"IF(Prezentace!E24=0,\"\",Prezentace!E24)","v":"Koch  st. "},null,null,10,10,10,9,9,9,8,8,8,6,null,null,null,15.31,71.69]
[{"$f":"IF(Prezentace!A25=0,\"\",Prezentace!A25)","v":""},{"$f":"IF(Prezentace!B25=0,\"\",Prezentace!B25)","v":""},{"$f":"Prezentace!D25","v":"P"},{"$f":"IF(Prezentace!F25=0,\"\",Prezentace!F25)","v":"Jaroslav"},{"$f":"IF(Prezentace!E25=0,\"\",Prezentace!E25)","v":"Kostříž "},null,null,10,10,9,9,9,8,8,8,8,6,null,null,null,13.77,71.23]
[{"$f":"IF(Prezentace!A26=0,\"\",Prezentace!A26)","v":""},{"$f":"IF(Prezentace!B26=0,\"\",Prezentace!B26)","v":""},{"$f":"Prezentace!D26","v":"P"},{"$f":"IF(Prezentace!F26=0,\"\",Prezentace!F26)","v":"Josef"},{"$f":"IF(Prezentace!E26=0,\"\",Prezentace!E26)","v":"Čekal "},null,null,10,9,9,8,7,7,6,6,0,0,null,null,null,14.46,47.54]
[{"$f":"IF(Prezentace!A27=0,\"\",Prezentace!A27)","v":""},{"$f":"IF(Prezentace!B27=0,\"\",Prezentace!B27)","v":""},{"$f":"Prezentace!D27","v":"P"},{"$f":"IF(Prezentace!F27=0,\"\",Prezentace!F27)","v":"Miloslav"},{"$f":"IF(Prezentace!E27=0,\"\",Prezentace!E27)","v":"Petržílka"},null,null,10,9,8,8,8,8,7,7,7,6,null,null,null,14.17,63.83]
[{"$f":"IF(Prezentace!A28=0,\"\",Prezentace!A28)","v":""},{"$f":"IF(Prezentace!B28=0,\"\",Prezentace!B28)","v":""},{"$f":"Prezentace!D28","v":"P"},{"$f":"IF(Prezentace!F28=0,\"\",Prezentace!F28)","v":"Václav"},{"$f":"IF(Prezentace!E28=0,\"\",Prezentace!E28)","v":"Landkammer"},null,null,10,9,9,9,9,9,9,8,9,0,null,null,null,13.65,67.349999999999994]
[{"$f":"IF(Prezentace!A29=0,\"\",Prezentace!A29)","v":""},{"$f":"IF(Prezentace!B29=0,\"\",Prezentace!B29)","v":""},{"$f":"Prezentace!D29","v":"P"},{"$f":"IF(Prezentace!F29=0,\"\",Prezentace!F29)","v":"Albert"},{"$f":"IF(Prezentace!E29=0,\"\",Prezentace!E29)","v":"Wrzecionko"},null,null,9,9,9,8,7,7,6,6,6,0,null,null,null,20.02,46.980000000000004]
[{"$f":"IF(Prezentace!A30=0,\"\",Prezentace!A30)","v":""},{"$f":"IF(Prezentace!B30=0,\"\",Prezentace!B30)","v":""},{"$f":"Prezentace!D30","v":"P"},{"$f":"IF(Prezentace!F30=0,\"\",Prezentace!F30)","v":"Michaela"},{"$f":"IF(Prezentace!E30=0,\"\",Prezentace!E30)","v":"Reisnerová"},null,null,10,10,9,8,8,7,7,7,0,0,null,null,null,17.489999999999998,48.510000000000005]
[{"$f":"IF(Prezentace!A31=0,\"\",Prezentace!A31)","v":""},{"$f":"IF(Prezentace!B31=0,\"\",Prezentace!B31)","v":""},{"$f":"Prezentace!D31","v":"P"},{"$f":"IF(Prezentace!F31=0,\"\",Prezentace!F31)","v":"Antonín"},{"$f":"IF(Prezentace!E31=0,\"\",Prezentace!E31)","v":"Urbanec  "},null,null,10,9,8,8,6,6,6,6,0,0,null,null,null,17.149999999999999,41.85]
[{"$f":"IF(Prezentace!#REF!=0,\"\",Prezentace!#REF!)","v":{"$error":"#REF!"}},{"$f":"IF(Prezentace!#REF!=0,\"\",Prezentace!#REF!)","v":{"$error":"#REF!"}},{"$f":"Prezentace!#REF!","v":{"$error":"#REF!"}},{"$f":"IF(Prezentace!#REF!=0,\"\",Prezentace!#REF!)","v":{"$error":"#REF!"}},{"$f":"IF(Prezentace!#REF!=0,\"\",Prezentace!#REF!)","v":{"$error":"#REF!"}},null,null,null,null,null,null,null,null,null,null,null,null,null,null,null,null,0]
[{"$f":"IF(Prezentace!#REF!=0,\"\",Prezentace!#REF!)","v":{"$error":"#REF!"}},{"$f":"IF(Prezentace!#REF!=0,\"\",Prezentace!#REF!)","v":{"$error":"#REF!"}},{"$f":"Prezentace!#REF!","v":{"$error":"#REF!"}},{"$f":"IF(Prezentace!#REF!=0,\"\",Prezentace!#REF!)","v":{"$error":"#REF!"}},{"$f":"IF(Prezentace!#REF!=0,\"\",Prezentace!#REF!)","v":{"$error":"#REF!"}},null,null,null,null,null,null,null,null,null,null,null,null,null,null,null,null,0]
[{"$f":"IF(Prezentace!#REF!=0,\"\",Prezentace!#REF!)","v":{"$error":"#REF!"}},{"$f":"IF(Prezentace!#REF!=0,\"\",Prezentace!#REF!)","v":{"$error":"#REF!"}},{"$f":"Prezentace!#REF!","v":{"$error":"#REF!"}},{"$f":"IF(Prezentace!#REF!=0,\"\",Prezentace!#REF!)","v":{"$error":"#REF!"}},{"$f":"IF(Prezentace!#REF!=0,\"\",Prezentace!#REF!)","v":{"$error":"#REF!"}},null,null,null,null,null,null,null,null,null,null,null,null,null,null,null,null,0]
[{"$f":"IF(Prezentace!#REF!=0,\"\",Prezentace!#REF!)","v":{"$error":"#REF!"}},{"$f":"IF(Prezentace!#REF!=0,\"\",Prezentace!#REF!)","v":{"$error":"#REF!"}},{"$f":"Prezentace!#REF!","v":{"$error":"#REF!"}},{"$f":"IF(Prezentace!#REF!=0,\"\",Prezentace!#REF!)","v":{"$error":"#REF!"}},{"$f":"IF(Prezentace!#REF!=0,\"\",Prezentace!#REF!)","v":{"$error":"#REF!"}},null,null,null,null,null,null,null,null,null,null,null,null,null,null,null,null,0]
[{"$f":"IF(Prezentace!#REF!=0,\"\",Prezentace!#REF!)","v":{"$error":"#REF!"}},{"$f":"IF(Prezentace!#REF!=0,\"\",Prezentace!#REF!)","v":{"$error":"#REF!"}},{"$f":"Prezentace!#REF!","v":{"$error":"#REF!"}},{"$f":"IF(Prezentace!#REF!=0,\"\",Prezentace!#REF!)","v":{"$error":"#REF!"}},{"$f":"IF(Prezentace!#REF!=0,\"\",Prezentace!#REF!)","v":{"$error":"#REF!"}},null,null,null,null,null,null,null,null,null,null,null,null,null,null,null,null,0]
[{"$f":"IF(Prezentace!#REF!=0,\"\",Prezentace!#REF!)","v":{"$error":"#REF!"}},{"$f":"IF(Prezentace!#REF!=0,\"\",Prezentace!#REF!)","v":{"$error":"#REF!"}},{"$f":"Prezentace!#REF!","v":{"$error":"#REF!"}},{"$f":"IF(Prezentace!#REF!=0,\"\",Prezentace!#REF!)","v":{"$error":"#REF!"}},{"$f":"IF(Prezentace!#REF!=0,\"\",Prezentace!#REF!)","v":{"$error":"#REF!"}},null,null,null,null,null,null,null,null,null,null,null,null,null,null,null,null,0]
[{"$f":"IF(Prezentace!#REF!=0,\"\",Prezentace!#REF!)","v":{"$error":"#REF!"}},{"$f":"IF(Prezentace!#REF!=0,\"\",Prezentace!#REF!)","v":{"$error":"#REF!"}},{"$f":"Prezentace!#REF!","v":{"$error":"#REF!"}},{"$f":"IF(Prezentace!#REF!=0,\"\",Prezentace!#REF!)","v":{"$error":"#REF!"}},{"$f":"IF(Prezentace!#REF!=0,\"\",Prezentace!#REF!)","v":{"$error":"#REF!"}},null,null,null,null,null,null,null,null,null,null,null,null,null,null,null,null,0]
[{"$f":"IF(Prezentace!#REF!=0,\"\",Prezentace!#REF!)","v":{"$error":"#REF!"}},{"$f":"IF(Prezentace!#REF!=0,\"\",Prezentace!#REF!)","v":{"$error":"#REF!"}},{"$f":"Prezentace!#REF!","v":{"$error":"#REF!"}},{"$f":"IF(Prezentace!#REF!=0,\"\",Prezentace!#REF!)","v":{"$error":"#REF!"}},{"$f":"IF(Prezentace!#REF!=0,\"\",Prezentace!#REF!)","v":{"$error":"#REF!"}},null,null,null,null,null,null,null,null,null,null,null,null,null,null,null,null,{"$f":"(SUM(F37:T37))-U37","v":0}]
[{"$f":"IF(Prezentace!#REF!=0,\"\",Prezentace!#REF!)","v":{"$error":"#REF!"}},{"$f":"IF(Prezentace!#REF!=0,\"\",Prezentace!#REF!)","v":{"$error":"#REF!"}},{"$f":"Prezentace!#REF!","v":{"$error":"#REF!"}},{"$f":"IF(Prezentace!#REF!=0,\"\",Prezentace!#REF!)","v":{"$error":"#REF!"}},{"$f":"IF(Prezentace!#REF!=0,\"\",Prezentace!#REF!)","v":{"$error":"#REF!"}},null,null,null,null,null,null,null,null,null,null,null,null,null,null,null,null,0]
[{"$f":"IF(Prezentace!#REF!=0,\"\",Prezentace!#REF!)","v":{"$error":"#REF!"}},{"$f":"IF(Prezentace!#REF!=0,\"\",Prezentace!#REF!)","v":{"$error":"#REF!"}},{"$f":"Prezentace!#REF!","v":{"$error":"#REF!"}},{"$f":"IF(Prezentace!#REF!=0,\"\",Prezentace!#REF!)","v":{"$error":"#REF!"}},{"$f":"IF(Prezentace!#REF!=0,\"\",Prezentace!#REF!)","v":{"$error":"#REF!"}},null,null,null,null,null,null,null,null,null,null,null,null,null,null,null,null,0]
[{"$f":"IF(Prezentace!#REF!=0,\"\",Prezentace!#REF!)","v":{"$error":"#REF!"}},{"$f":"IF(Prezentace!#REF!=0,\"\",Prezentace!#REF!)","v":{"$error":"#REF!"}},{"$f":"Prezentace!#REF!","v":{"$error":"#REF!"}},{"$f":"IF(Prezentace!#REF!=0,\"\",Prezentace!#REF!)","v":{"$error":"#REF!"}},{"$f":"IF(Prezentace!#REF!=0,\"\",Prezentace!#REF!)","v":{"$error":"#REF!"}},null,null,null,null,null,null,null,null,null,null,null,null,null,null,null,null,0]
[{"$f":"IF(Prezentace!#REF!=0,\"\",Prezentace!#REF!)","v":{"$error":"#REF!"}},{"$f":"IF(Prezentace!#REF!=0,\"\",Prezentace!#REF!)","v":{"$error":"#REF!"}},{"$f":"Prezentace!#REF!","v":{"$error":"#REF!"}},{"$f":"IF(Prezentace!#REF!=0,\"\",Prezentace!#REF!)","v":{"$error":"#REF!"}},{"$f":"IF(Prezentace!#REF!=0,\"\",Prezentace!#REF!)","v":{"$error":"#REF!"}},null,null,null,null,null,null,null,null,null,null,null,null,null,null,null,null,0]
[{"$f":"IF(Prezentace!#REF!=0,\"\",Prezentace!#REF!)","v":{"$error":"#REF!"}},{"$f":"IF(Prezentace!#REF!=0,\"\",Prezentace!#REF!)","v":{"$error":"#REF!"}},{"$f":"Prezentace!#REF!","v":{"$error":"#REF!"}},{"$f":"IF(Prezentace!#REF!=0,\"\",Prezentace!#REF!)","v":{"$error":"#REF!"}},{"$f":"IF(Prezentace!#REF!=0,\"\",Prezentace!#REF!)","v":{"$error":"#REF!"}},null,null,null,null,null,null,null,null,null,null,null,null,null,null,null,null,0]
[{"$f":"IF(Prezentace!#REF!=0,\"\",Prezentace!#REF!)","v":{"$error":"#REF!"}},{"$f":"IF(Prezentace!#REF!=0,\"\",Prezentace!#REF!)","v":{"$error":"#REF!"}},{"$f":"Prezentace!#REF!","v":{"$error":"#REF!"}},{"$f":"IF(Prezentace!#REF!=0,\"\",Prezentace!#REF!)","v":{"$error":"#REF!"}},{"$f":"IF(Prezentace!#REF!=0,\"\",Prezentace!#REF!)","v":{"$error":"#REF!"}},null,null,null,null,null,null,null,null,null,null,null,null,null,null,null,null,0]
[{"$f":"IF(Prezentace!#REF!=0,\"\",Prezentace!#REF!)","v":{"$error":"#REF!"}},{"$f":"IF(Prezentace!#REF!=0,\"\",Prezentace!#REF!)","v":{"$error":"#REF!"}},{"$f":"Prezentace!#REF!","v":{"$error":"#REF!"}},{"$f":"IF(Prezentace!#REF!=0,\"\",Prezentace!#REF!)","v":{"$error":"#REF!"}},{"$f":"IF(Prezentace!#REF!=0,\"\",Prezentace!#REF!)","v":{"$error":"#REF!"}},null,null,null,null,null,null,null,null,null,null,null,null,null,null,null,null,0]
[{"$f":"IF(Prezentace!#REF!=0,\"\",Prezentace!#REF!)","v":{"$error":"#REF!"}},{"$f":"IF(Prezentace!#REF!=0,\"\",Prezentace!#REF!)","v":{"$error":"#REF!"}},{"$f":"Prezentace!#REF!","v":{"$error":"#REF!"}},{"$f":"IF(Prezentace!#REF!=0,\"\",Prezentace!#REF!)","v":{"$error":"#REF!"}},{"$f":"IF(Prezentace!#REF!=0,\"\",Prezentace!#REF!)","v":{"$error":"#REF!"}},null,null,null,null,null,null,null,null,null,null,null,null,null,null,null,null,0]
[{"$f":"IF(Prezentace!#REF!=0,\"\",Prezentace!#REF!)","v":{"$error":"#REF!"}},{"$f":"IF(Prezentace!#REF!=0,\"\",Prezentace!#REF!)","v":{"$error":"#REF!"}},{"$f":"Prezentace!#REF!","v":{"$error":"#REF!"}},{"$f":"IF(Prezentace!#REF!=0,\"\",Prezentace!#REF!)","v":{"$error":"#REF!"}},{"$f":"IF(Prezentace!#REF!=0,\"\",Prezentace!#REF!)","v":{"$error":"#REF!"}},null,null,null,null,null,null,null,null,null,null,null,null,null,null,null,null,0]
[{"$f":"IF(Prezentace!#REF!=0,\"\",Prezentace!#REF!)","v":{"$error":"#REF!"}},{"$f":"IF(Prezentace!#REF!=0,\"\",Prezentace!#REF!)","v":{"$error":"#REF!"}},{"$f":"Prezentace!#REF!","v":{"$error":"#REF!"}},{"$f":"IF(Prezentace!#REF!=0,\"\",Prezentace!#REF!)","v":{"$error":"#REF!"}},{"$f":"IF(Prezentace!#REF!=0,\"\",Prezentace!#REF!)","v":{"$error":"#REF!"}},null,null,null,null,null,null,null,null,null,null,null,null,null,null,null,null,0]
[{"$f":"IF(Prezentace!#REF!=0,\"\",Prezentace!#REF!)","v":{"$error":"#REF!"}},{"$f":"IF(Prezentace!#REF!=0,\"\",Prezentace!#REF!)","v":{"$error":"#REF!"}},{"$f":"Prezentace!#REF!","v":{"$error":"#REF!"}},{"$f":"IF(Prezentace!#REF!=0,\"\",Prezentace!#REF!)","v":{"$error":"#REF!"}},{"$f":"IF(Prezentace!#REF!=0,\"\",Prezentace!#REF!)","v":{"$error":"#REF!"}},null,null,null,null,null,null,null,null,null,null,null,null,null,null,null,null,0]
[{"$f":"IF(Prezentace!#REF!=0,\"\",Prezentace!#REF!)","v":{"$error":"#REF!"}},{"$f":"IF(Prezentace!#REF!=0,\"\",Prezentace!#REF!)","v":{"$error":"#REF!"}},{"$f":"Prezentace!#REF!","v":{"$error":"#REF!"}},{"$f":"IF(Prezentace!#REF!=0,\"\",Prezentace!#REF!)","v":{"$error":"#REF!"}},{"$f":"IF(Prezentace!#REF!=0,\"\",Prezentace!#REF!)","v":{"$error":"#REF!"}},null,null,null,null,null,null,null,null,null,null,null,null,null,null,null,null,0]
[{"$f":"IF(Prezentace!#REF!=0,\"\",Prezentace!#REF!)","v":{"$error":"#REF!"}},{"$f":"IF(Prezentace!#REF!=0,\"\",Prezentace!#REF!)","v":{"$error":"#REF!"}},{"$f":"Prezentace!#REF!","v":{"$error":"#REF!"}},{"$f":"IF(Prezentace!#REF!=0,\"\",Prezentace!#REF!)","v":{"$error":"#REF!"}},{"$f":"IF(Prezentace!#REF!=0,\"\",Prezentace!#REF!)","v":{"$error":"#REF!"}},null,null,null,null,null,null,null,null,null,null,null,null,null,null,null,null,0]
[{"$f":"IF(Prezentace!#REF!=0,\"\",Prezentace!#REF!)","v":{"$error":"#REF!"}},{"$f":"IF(Prezentace!#REF!=0,\"\",Prezentace!#REF!)","v":{"$error":"#REF!"}},{"$f":"Prezentace!#REF!","v":{"$error":"#REF!"}},{"$f":"IF(Prezentace!#REF!=0,\"\",Prezentace!#REF!)","v":{"$error":"#REF!"}},{"$f":"IF(Prezentace!#REF!=0,\"\",Prezentace!#REF!)","v":{"$error":"#REF!"}},null,null,null,null,null,null,null,null,null,null,null,null,null,null,null,null,0]
[{"$f":"IF(Prezentace!#REF!=0,\"\",Prezentace!#REF!)","v":{"$error":"#REF!"}},{"$f":"IF(Prezentace!#REF!=0,\"\",Prezentace!#REF!)","v":{"$error":"#REF!"}},{"$f":"Prezentace!#REF!","v":{"$error":"#REF!"}},{"$f":"IF(Prezentace!#REF!=0,\"\",Prezentace!#REF!)","v":{"$error":"#REF!"}},{"$f":"IF(Prezentace!#REF!=0,\"\",Prezentace!#REF!)","v":{"$error":"#REF!"}},null,null,null,null,null,null,null,null,null,null,null,null,null,null,null,null,0]
[{"$f":"IF(Prezentace!#REF!=0,\"\",Prezentace!#REF!)","v":{"$error":"#REF!"}},{"$f":"IF(Prezentace!#REF!=0,\"\",Prezentace!#REF!)","v":{"$error":"#REF!"}},{"$f":"Prezentace!#REF!","v":{"$error":"#REF!"}},{"$f":"IF(Prezentace!#REF!=0,\"\",Prezentace!#REF!)","v":{"$error":"#REF!"}},{"$f":"IF(Prezentace!#REF!=0,\"\",Prezentace!#REF!)","v":{"$error":"#REF!"}},null,null,null,null,null,null,null,null,null,null,null,null,null,null,null,null,0]
[{"$f":"IF(Prezentace!#REF!=0,\"\",Prezentace!#REF!)","v":{"$error":"#REF!"}},{"$f":"IF(Prezentace!#REF!=0,\"\",Prezentace!#REF!)","v":{"$error":"#REF!"}},{"$f":"Prezentace!#REF!","v":{"$error":"#REF!"}},{"$f":"IF(Prezentace!#REF!=0,\"\",Prezentace!#REF!)","v":{"$error":"#REF!"}},{"$f":"IF(Prezentace!#REF!=0,\"\",Prezentace!#REF!)","v":{"$error":"#REF!"}},null,null,null,null,null,null,null,null,null,null,null,null,null,null,null,null,0]
[{"$f":"IF(Prezentace!#REF!=0,\"\",Prezentace!#REF!)","v":{"$error":"#REF!"}},{"$f":"IF(Prezentace!#REF!=0,\"\",Prezentace!#REF!)","v":{"$error":"#REF!"}},{"$f":"Prezentace!#REF!","v":{"$error":"#REF!"}},{"$f":"IF(Prezentace!#REF!=0,\"\",Prezentace!#REF!)","v":{"$error":"#REF!"}},{"$f":"IF(Prezentace!#REF!=0,\"\",Prezentace!#REF!)","v":{"$error":"#REF!"}},null,null,null,null,null,null,null,null,null,null,null,null,null,null,null,null,0]
[{"$f":"IF(Prezentace!#REF!=0,\"\",Prezentace!#REF!)","v":{"$error":"#REF!"}},{"$f":"IF(Prezentace!#REF!=0,\"\",Prezentace!#REF!)","v":{"$error":"#REF!"}},{"$f":"Prezentace!#REF!","v":{"$error":"#REF!"}},{"$f":"IF(Prezentace!#REF!=0,\"\",Prezentace!#REF!)","v":{"$error":"#REF!"}},{"$f":"IF(Prezentace!#REF!=0,\"\",Prezentace!#REF!)","v":{"$error":"#REF!"}},null,null,null,null,null,null,null,null,null,null,null,null,null,null,null,null,0]
[{"$f":"IF(Prezentace!#REF!=0,\"\",Prezentace!#REF!)","v":{"$error":"#REF!"}},{"$f":"IF(Prezentace!#REF!=0,\"\",Prezentace!#REF!)","v":{"$error":"#REF!"}},{"$f":"Prezentace!#REF!","v":{"$error":"#REF!"}},{"$f":"IF(Prezentace!#REF!=0,\"\",Prezentace!#REF!)","v":{"$error":"#REF!"}},{"$f":"IF(Prezentace!#REF!=0,\"\",Prezentace!#REF!)","v":{"$error":"#REF!"}},null,null,null,null,null,null,null,null,null,null,null,null,null,null,null,null,0]
[{"$f":"IF(Prezentace!A32=0,\"\",Prezentace!A32)","v":""},{"$f":"IF(Prezentace!B32=0,\"\",Prezentace!B32)","v":""},{"$f":"Prezentace!D32","v":"P"},{"$f":"IF(Prezentace!F32=0,\"\",Prezentace!F32)","v":""},{"$f":"IF(Prezentace!E32=0,\"\",Prezentace!E32)","v":""},null,null,null,null,null,null,null,null,null,null,null,null,null,null,null,null,0]
[{"$f":"IF(Prezentace!A33=0,\"\",Prezentace!A33)","v":""},{"$f":"IF(Prezentace!B33=0,\"\",Prezentace!B33)","v":""},{"$f":"Prezentace!D33","v":"P"},{"$f":"IF(Prezentace!F33=0,\"\",Prezentace!F33)","v":""},{"$f":"IF(Prezentace!E33=0,\"\",Prezentace!E33)","v":""},null,null,null,null,null,null,null,null,null,null,null,null,null,null,null,null,0]
[{"$f":"IF(Prezentace!A34=0,\"\",Prezentace!A34)","v":""},{"$f":"IF(Prezentace!B34=0,\"\",Prezentace!B34)","v":""},{"$f":"Prezentace!D34","v":"P"},{"$f":"IF(Prezentace!F34=0,\"\",Prezentace!F34)","v":""},{"$f":"IF(Prezentace!E34=0,\"\",Prezentace!E34)","v":""},null,null,null,null,null,null,null,null,null,null,null,null,null,null,null,null,0]
[{"$f":"IF(Prezentace!A35=0,\"\",Prezentace!A35)","v":""},{"$f":"IF(Prezentace!B35=0,\"\",Prezentace!B35)","v":""},{"$f":"Prezentace!D35","v":"P"},{"$f":"IF(Prezentace!F35=0,\"\",Prezentace!F35)","v":""},{"$f":"IF(Prezentace!E35=0,\"\",Prezentace!E35)","v":""},null,null,null,null,null,null,null,null,null,null,null,null,null,null,null,null,0]
[{"$f":"IF(Prezentace!A36=0,\"\",Prezentace!A36)","v":""},{"$f":"IF(Prezentace!B36=0,\"\",Prezentace!B36)","v":""},{"$f":"Prezentace!D36","v":"P"},{"$f":"IF(Prezentace!F36=0,\"\",Prezentace!F36)","v":""},{"$f":"IF(Prezentace!E36=0,\"\",Prezentace!E36)","v":""},null,null,null,null,null,null,null,null,null,null,null,null,null,null,null,null,0]
[{"$f":"IF(Prezentace!A37=0,\"\",Prezentace!A37)","v":""},{"$f":"IF(Prezentace!B37=0,\"\",Prezentace!B37)","v":""},{"$f":"Prezentace!D37","v":"P"},{"$f":"IF(Prezentace!F37=0,\"\",Prezentace!F37)","v":""},{"$f":"IF(Prezentace!E37=0,\"\",Prezentace!E37)","v":""},null,null,null,null,null,null,null,null,null,null,null,null,null,null,null,null,0]
[{"$f":"IF(Prezentace!A38=0,\"\",Prezentace!A38)","v":""},{"$f":"IF(Prezentace!B38=0,\"\",Prezentace!B38)","v":""},{"$f":"Prezentace!D38","v":"P"},{"$f":"IF(Prezentace!F38=0,\"\",Prezentace!F38)","v":""},{"$f":"IF(Prezentace!E38=0,\"\",Prezentace!E38)","v":""},null,null,null,null,null,null,null,null,null,null,null,null,null,null,null,null,0]
[{"$f":"IF(Prezentace!A39=0,\"\",Prezentace!A39)","v":""},{"$f":"IF(Prezentace!B39=0,\"\",Prezentace!B39)","v":""},{"$f":"Prezentace!D39","v":"P"},{"$f":"IF(Prezentace!F39=0,\"\",Prezentace!F39)","v":""},{"$f":"IF(Prezentace!E39=0,\"\",Prezentace!E39)","v":""},null,null,null,null,null,null,null,null,null,null,null,null,null,null,null,null,0]
[{"$f":"IF(Prezentace!A40=0,\"\",Prezentace!A40)","v":""},{"$f":"IF(Prezentace!B40=0,\"\",Prezentace!B40)","v":""},{"$f":"Prezentace!D40","v":"P"},{"$f":"IF(Prezentace!F40=0,\"\",Prezentace!F40)","v":""},{"$f":"IF(Prezentace!E40=0,\"\",Prezentace!E40)","v":""},null,null,null,null,null,null,null,null,null,null,null,null,null,null,null,null,0]
[{"$f":"IF(Prezentace!A41=0,\"\",Prezentace!A41)","v":""},{"$f":"IF(Prezentace!B41=0,\"\",Prezentace!B41)","v":""},{"$f":"Prezentace!D41","v":"P"},{"$f":"IF(Prezentace!F41=0,\"\",Prezentace!F41)","v":""},{"$f":"IF(Prezentace!E41=0,\"\",Prezentace!E41)","v":""},null,null,null,null,null,null,null,null,null,null,null,null,null,null,null,null,0]
[{"$f":"IF(Prezentace!A42=0,\"\",Prezentace!A42)","v":""},{"$f":"IF(Prezentace!B42=0,\"\",Prezentace!B42)","v":""},{"$f":"Prezentace!D42","v":"P"},{"$f":"IF(Prezentace!F42=0,\"\",Prezentace!F42)","v":""},{"$f":"IF(Prezentace!E42=0,\"\",Prezentace!E42)","v":""},null,null,null,null,null,null,null,null,null,null,null,null,null,null,null,null,0]
[{"$f":"IF(Prezentace!A43=0,\"\",Prezentace!A43)","v":""},{"$f":"IF(Prezentace!B43=0,\"\",Prezentace!B43)","v":""},{"$f":"Prezentace!D43","v":"P"},{"$f":"IF(Prezentace!F43=0,\"\",Prezentace!F43)","v":""},{"$f":"IF(Prezentace!E43=0,\"\",Prezentace!E43)","v":""},null,null,null,null,null,null,null,null,null,null,null,null,null,null,null,null,0]
[{"$f":"IF(Prezentace!A44=0,\"\",Prezentace!A44)","v":""},{"$f":"IF(Prezentace!B44=0,\"\",Prezentace!B44)","v":""},{"$f":"Prezentace!D44","v":"P"},{"$f":"IF(Prezentace!F44=0,\"\",Prezentace!F44)","v":""},{"$f":"IF(Prezentace!E44=0,\"\",Prezentace!E44)","v":""},null,null,null,null,null,null,null,null,null,null,null,null,null,null,null,null,0]
[{"$f":"IF(Prezentace!A45=0,\"\",Prezentace!A45)","v":""},{"$f":"IF(Prezentace!B45=0,\"\",Prezentace!B45)","v":""},{"$f":"Prezentace!D45","v":"P"},{"$f":"IF(Prezentace!F45=0,\"\",Prezentace!F45)","v":""},{"$f":"IF(Prezentace!E45=0,\"\",Prezentace!E45)","v":""},null,null,null,null,null,null,null,null,null,null,null,null,null,null,null,null,0]
[{"$f":"IF(Prezentace!A46=0,\"\",Prezentace!A46)","v":""},{"$f":"IF(Prezentace!B46=0,\"\",Prezentace!B46)","v":""},{"$f":"Prezentace!D46","v":"P"},{"$f":"IF(Prezentace!F46=0,\"\",Prezentace!F46)","v":""},{"$f":"IF(Prezentace!E46=0,\"\",Prezentace!E46)","v":""},null,null,null,null,null,null,null,null,null,null,null,null,null,null,null,null,0]
[{"$f":"IF(Prezentace!A47=0,\"\",Prezentace!A47)","v":""},{"$f":"IF(Prezentace!B47=0,\"\",Prezentace!B47)","v":""},{"$f":"Prezentace!D47","v":"P"},{"$f":"IF(Prezentace!F47=0,\"\",Prezentace!F47)","v":""},{"$f":"IF(Prezentace!E47=0,\"\",Prezentace!E47)","v":""},null,null,null,null,null,null,null,null,null,null,null,null,null,null,null,null,0]
[{"$f":"IF(Prezentace!A48=0,\"\",Prezentace!A48)","v":""},{"$f":"IF(Prezentace!B48=0,\"\",Prezentace!B48)","v":""},{"$f":"Prezentace!D48","v":"P"},{"$f":"IF(Prezentace!F48=0,\"\",Prezentace!F48)","v":""},{"$f":"IF(Prezentace!E48=0,\"\",Prezentace!E48)","v":""},null,null,null,null,null,null,null,null,null,null,null,null,null,null,null,null,0]
[{"$f":"IF(Prezentace!A49=0,\"\",Prezentace!A49)","v":""},{"$f":"IF(Prezentace!B49=0,\"\",Prezentace!B49)","v":""},{"$f":"Prezentace!D49","v":"P"},{"$f":"IF(Prezentace!F49=0,\"\",Prezentace!F49)","v":""},{"$f":"IF(Prezentace!E49=0,\"\",Prezentace!E49)","v":""},null,null,null,null,null,null,null,null,null,null,null,null,null,null,null,null,0]
[{"$f":"IF(Prezentace!A50=0,\"\",Prezentace!A50)","v":""},{"$f":"IF(Prezentace!B50=0,\"\",Prezentace!B50)","v":""},{"$f":"Prezentace!D50","v":"P"},{"$f":"IF(Prezentace!F50=0,\"\",Prezentace!F50)","v":""},{"$f":"IF(Prezentace!E50=0,\"\",Prezentace!E50)","v":""},null,null,null,null,null,null,null,null,null,null,null,null,null,null,null,null,0]
[{"$f":"IF(Prezentace!A51=0,\"\",Prezentace!A51)","v":""},{"$f":"IF(Prezentace!B51=0,\"\",Prezentace!B51)","v":""},{"$f":"Prezentace!D51","v":"P"},{"$f":"IF(Prezentace!F51=0,\"\",Prezentace!F51)","v":""},{"$f":"IF(Prezentace!E51=0,\"\",Prezentace!E51)","v":""},null,null,null,null,null,null,null,null,null,null,null,null,null,null,null,null,0]
[{"$f":"IF(Prezentace!A52=0,\"\",Prezentace!A52)","v":""},{"$f":"IF(Prezentace!B52=0,\"\",Prezentace!B52)","v":""},{"$f":"Prezentace!D52","v":"P"},{"$f":"IF(Prezentace!F52=0,\"\",Prezentace!F52)","v":""},{"$f":"IF(Prezentace!E52=0,\"\",Prezentace!E52)","v":""},null,null,null,null,null,null,null,null,null,null,null,null,null,null,null,null,0]
[{"$f":"IF(Prezentace!A53=0,\"\",Prezentace!A53)","v":""},{"$f":"IF(Prezentace!B53=0,\"\",Prezentace!B53)","v":""},{"$f":"Prezentace!D53","v":"P"},{"$f":"IF(Prezentace!F53=0,\"\",Prezentace!F53)","v":""},{"$f":"IF(Prezentace!E53=0,\"\",Prezentace!E53)","v":""},null,null,null,null,null,null,null,null,null,null,null,null,null,null,null,null,0]
[{"$f":"IF(Prezentace!A54=0,\"\",Prezentace!A54)","v":""},{"$f":"IF(Prezentace!B54=0,\"\",Prezentace!B54)","v":""},{"$f":"Prezentace!D54","v":"P"},{"$f":"IF(Prezentace!F54=0,\"\",Prezentace!F54)","v":""},{"$f":"IF(Prezentace!E54=0,\"\",Prezentace!E54)","v":""},null,null,null,null,null,null,null,null,null,null,null,null,null,null,null,null,0]
[{"$f":"IF(Prezentace!A55=0,\"\",Prezentace!A55)","v":""},{"$f":"IF(Prezentace!B55=0,\"\",Prezentace!B55)","v":""},{"$f":"Prezentace!D55","v":"P"},{"$f":"IF(Prezentace!F55=0,\"\",Prezentace!F55)","v":""},{"$f":"IF(Prezentace!E55=0,\"\",Prezentace!E55)","v":""},null,null,null,null,null,null,null,null,null,null,null,null,null,null,null,null,0]
[{"$f":"IF(Prezentace!A56=0,\"\",Prezentace!A56)","v":""},{"$f":"IF(Prezentace!B56=0,\"\",Prezentace!B56)","v":""},{"$f":"Prezentace!D56","v":"P"},{"$f":"IF(Prezentace!F56=0,\"\",Prezentace!F56)","v":""},{"$f":"IF(Prezentace!E56=0,\"\",Prezentace!E56)","v":""},null,null,null,null,null,null,null,null,null,null,null,null,null,null,null,null,0]
[{"$f":"IF(Prezentace!A57=0,\"\",Prezentace!A57)","v":""},{"$f":"IF(Prezentace!B57=0,\"\",Prezentace!B57)","v":""},{"$f":"Prezentace!D57","v":"P"},{"$f":"IF(Prezentace!F57=0,\"\",Prezentace!F57)","v":""},{"$f":"IF(Prezentace!E57=0,\"\",Prezentace!E57)","v":""},null,null,null,null,null,null,null,null,null,null,null,null,null,null,null,null,0]
[{"$f":"IF(Prezentace!A58=0,\"\",Prezentace!A58)","v":""},{"$f":"IF(Prezentace!B58=0,\"\",Prezentace!B58)","v":""},{"$f":"Prezentace!D58","v":"P"},{"$f":"IF(Prezentace!F58=0,\"\",Prezentace!F58)","v":""},{"$f":"IF(Prezentace!E58=0,\"\",Prezentace!E58)","v":""},null,null,null,null,null,null,null,null,null,null,null,null,null,null,null,null,0]
[{"$f":"IF(Prezentace!A59=0,\"\",Prezentace!A59)","v":""},{"$f":"IF(Prezentace!B59=0,\"\",Prezentace!B59)","v":""},{"$f":"Prezentace!D59","v":"P"},{"$f":"IF(Prezentace!F59=0,\"\",Prezentace!F59)","v":""},{"$f":"IF(Prezentace!E59=0,\"\",Prezentace!E59)","v":""},null,null,null,null,null,null,null,null,null,null,null,null,null,null,null,null,0]
[{"$f":"IF(Prezentace!A60=0,\"\",Prezentace!A60)","v":""},{"$f":"IF(Prezentace!B60=0,\"\",Prezentace!B60)","v":""},{"$f":"Prezentace!D60","v":"P"},{"$f":"IF(Prezentace!F60=0,\"\",Prezentace!F60)","v":""},{"$f":"IF(Prezentace!E60=0,\"\",Prezentace!E60)","v":""},null,null,null,null,null,null,null,null,null,null,null,null,null,null,null,null,0]
[{"$f":"IF(Prezentace!A61=0,\"\",Prezentace!A61)","v":""},{"$f":"IF(Prezentace!B61=0,\"\",Prezentace!B61)","v":""},{"$f":"Prezentace!D61","v":"P"},{"$f":"IF(Prezentace!F61=0,\"\",Prezentace!F61)","v":""},{"$f":"IF(Prezentace!E61=0,\"\",Prezentace!E61)","v":""},null,null,null,null,null,null,null,null,null,null,null,null,null,null,null,null,0]
[{"$f":"IF(Prezentace!A62=0,\"\",Prezentace!A62)","v":""},{"$f":"IF(Prezentace!B62=0,\"\",Prezentace!B62)","v":""},{"$f":"Prezentace!D62","v":"P"},{"$f":"IF(Prezentace!F62=0,\"\",Prezentace!F62)","v":""},{"$f":"IF(Prezentace!E62=0,\"\",Prezentace!E62)","v":""},null,null,null,null,null,null,null,null,null,null,null,null,null,null,null,null,0]
[{"$f":"IF(Prezentace!A63=0,\"\",Prezentace!A63)","v":""},{"$f":"IF(Prezentace!B63=0,\"\",Prezentace!B63)","v":""},{"$f":"Prezentace!D63","v":"P"},{"$f":"IF(Prezentace!F63=0,\"\",Prezentace!F63)","v":""},{"$f":"IF(Prezentace!E63=0,\"\",Prezentace!E63)","v":""},null,null,null,null,null,null,null,null,null,null,null,null,null,null,null,null,0]
[{"$f":"IF(Prezentace!A64=0,\"\",Prezentace!A64)","v":""},{"$f":"IF(Prezentace!B64=0,\"\",Prezentace!B64)","v":""},{"$f":"Prezentace!D64","v":"P"},{"$f":"IF(Prezentace!F64=0,\"\",Prezentace!F64)","v":""},{"$f":"IF(Prezentace!E64=0,\"\",Prezentace!E64)","v":""},null,null,null,null,null,null,null,null,null,null,null,null,null,null,null,null,0]
[{"$f":"IF(Prezentace!A65=0,\"\",Prezentace!A65)","v":""},{"$f":"IF(Prezentace!B65=0,\"\",Prezentace!B65)","v":""},{"$f":"Prezentace!D65","v":"P"},{"$f":"IF(Prezentace!F65=0,\"\",Prezentace!F65)","v":""},{"$f":"IF(Prezentace!E65=0,\"\",Prezentace!E65)","v":""},null,null,null,null,null,null,null,null,null,null,null,null,null,null,null,null,0]
[{"$f":"IF(Prezentace!A66=0,\"\",Prezentace!A66)","v":""},{"$f":"IF(Prezentace!B66=0,\"\",Prezentace!B66)","v":""},{"$f":"Prezentace!D66","v":"P"},{"$f":"IF(Prezentace!F66=0,\"\",Prezentace!F66)","v":""},{"$f":"IF(Prezentace!E66=0,\"\",Prezentace!E66)","v":""},null,null,null,null,null,null,null,null,null,null,null,null,null,null,null,null,0]
[{"$f":"IF(Prezentace!A67=0,\"\",Prezentace!A67)","v":""},{"$f":"IF(Prezentace!B67=0,\"\",Prezentace!B67)","v":""},{"$f":"Prezentace!D67","v":"P"},{"$f":"IF(Prezentace!F67=0,\"\",Prezentace!F67)","v":""},{"$f":"IF(Prezentace!E67=0,\"\",Prezentace!E67)","v":""},null,null,null,null,null,null,null,null,null,null,null,null,null,null,null,null,0]
[{"$f":"IF(Prezentace!A68=0,\"\",Prezentace!A68)","v":""},{"$f":"IF(Prezentace!B68=0,\"\",Prezentace!B68)","v":""},{"$f":"Prezentace!D68","v":"P"},{"$f":"IF(Prezentace!F68=0,\"\",Prezentace!F68)","v":""},{"$f":"IF(Prezentace!E68=0,\"\",Prezentace!E68)","v":""},null,null,null,null,null,null,null,null,null,null,null,null,null,null,null,null,0]
[{"$f":"IF(Prezentace!A69=0,\"\",Prezentace!A69)","v":""},{"$f":"IF(Prezentace!B69=0,\"\",Prezentace!B69)","v":""},{"$f":"Prezentace!D69","v":"P"},{"$f":"IF(Prezentace!F69=0,\"\",Prezentace!F69)","v":""},{"$f":"IF(Prezentace!E69=0,\"\",Prezentace!E69)","v":""},null,null,null,null,null,null,null,null,null,null,null,null,null,null,null,null,0]
[{"$f":"IF(Prezentace!A70=0,\"\",Prezentace!A70)","v":""},{"$f":"IF(Prezentace!B70=0,\"\",Prezentace!B70)","v":""},{"$f":"Prezentace!D70","v":"P"},{"$f":"IF(Prezentace!F70=0,\"\",Prezentace!F70)","v":""},{"$f":"IF(Prezentace!E70=0,\"\",Prezentace!E70)","v":""},null,null,null,null,null,null,null,null,null,null,null,null,null,null,null,null,0]
[{"$f":"IF(Prezentace!A71=0,\"\",Prezentace!A71)","v":""},{"$f":"IF(Prezentace!B71=0,\"\",Prezentace!B71)","v":""},{"$f":"Prezentace!D71","v":"P"},{"$f":"IF(Prezentace!F71=0,\"\",Prezentace!F71)","v":""},{"$f":"IF(Prezentace!E71=0,\"\",Prezentace!E71)","v":""},null,null,null,null,null,null,null,null,null,null,null,null,null,null,null,null,0]
[{"$f":"IF(Prezentace!A72=0,\"\",Prezentace!A72)","v":""},{"$f":"IF(Prezentace!B72=0,\"\",Prezentace!B72)","v":""},{"$f":"Prezentace!D72","v":"P"},{"$f":"IF(Prezentace!F72=0,\"\",Prezentace!F72)","v":""},{"$f":"IF(Prezentace!E72=0,\"\",Prezentace!E72)","v":""},null,null,null,null,null,null,null,null,null,null,null,null,null,null,null,null,0]
[{"$f":"IF(Prezentace!A73=0,\"\",Prezentace!A73)","v":""},{"$f":"IF(Prezentace!B73=0,\"\",Prezentace!B73)","v":""},{"$f":"Prezentace!D73","v":"P"},{"$f":"IF(Prezentace!F73=0,\"\",Prezentace!F73)","v":""},{"$f":"IF(Prezentace!E73=0,\"\",Prezentace!E73)","v":""},null,null,null,null,null,null,null,null,null,null,null,null,null,null,null,null,0]
[{"$f":"IF(Prezentace!A74=0,\"\",Prezentace!A74)","v":""},{"$f":"IF(Prezentace!B74=0,\"\",Prezentace!B74)","v":""},{"$f":"Prezentace!D74","v":"P"},{"$f":"IF(Prezentace!F74=0,\"\",Prezentace!F74)","v":""},{"$f":"IF(Prezentace!E74=0,\"\",Prezentace!E74)","v":""},null,null,null,null,null,null,null,null,null,null,null,null,null,null,null,null,0]
[{"$f":"IF(Prezentace!A75=0,\"\",Prezentace!A75)","v":""},{"$f":"IF(Prezentace!B75=0,\"\",Prezentace!B75)","v":""},{"$f":"Prezentace!D75","v":"P"},{"$f":"IF(Prezentace!F75=0,\"\",Prezentace!F75)","v":""},{"$f":"IF(Prezentace!E75=0,\"\",Prezentace!E75)","v":""},null,null,null,null,null,null,null,null,null,null,null,null,null,null,null,null,{"$f":"(SUM(F101:T101))-U101","v":0}]

{"sheet":"2(M)","index":5,"n_rows":102,"n_cols":20,"rows_kept":102,"cut":false,"hidden":true,"merged":[[0,3,0,18],[0,0,2,0],[0,1,2,1]]}
["Druž.","Kap.",null,"Disciplina 2"]
[]
[null,null,null,null,null,0,1,2,3,4,5,6,7,8,9,10,12,15,"Čas","Součet"]
[{"$f":"IF(Prezentace!A6=0,\"\",Prezentace!A6)","v":""},{"$f":"IF(Prezentace!B6=0,\"\",Prezentace!B6)","v":""},{"$f":"Prezentace!D6","v":"P"},{"$f":"IF(Prezentace!F6=0,\"\",Prezentace!F6)","v":"Milan"},{"$f":"IF(Prezentace!E6=0,\"\",Prezentace!E6)","v":"Matějka st."},null,null,null,null,null,null,null,null,null,null,null,null,null,null,{"$f":"(SUM(F4*$F$3,G4*$G$3,H4*$H$3,I4*$I$3,J4*$J$3,K4*$K$3,L4*$L$3,M4*$M$3,N4*$N$3,O4*$O$3,P4*$P$3,Q4*$Q$3,R4*$R$3))-S4","v":0}]
[{"$f":"IF(Prezentace!A7=0,\"\",Prezentace!A7)","v":""},{"$f":"IF(Prezentace!B7=0,\"\",Prezentace!B7)","v":""},{"$f":"Prezentace!D7","v":"P"},{"$f":"IF(Prezentace!F7=0,\"\",Prezentace!F7)","v":"Miroslav"},{"$f":"IF(Prezentace!E7=0,\"\",Prezentace!E7)","v":"Fiala  "},null,null,null,null,null,null,null,null,null,null,null,null,null,null,{"$f":"(SUM(F5*$F$3,G5*$G$3,H5*$H$3,I5*$I$3,J5*$J$3,K5*$K$3,L5*$L$3,M5*$M$3,N5*$N$3,O5*$O$3,P5*$P$3,Q5*$Q$3,R5*$R$3))-S5","v":0}]
[{"$f":"IF(Prezentace!A8=0,\"\",Prezentace!A8)","v":""},{"$f":"IF(Prezentace!B8=0,\"\",Prezentace!B8)","v":""},{"$f":"Prezentace!D8","v":"P"},{"$f":"IF(Prezentace!F8=0,\"\",Prezentace!F8)","v":"František"},{"$f":"IF(Prezentace!E8=0,\"\",Prezentace!E8)","v":"Toman "},null,null,null,null,null,null,null,null,null,null,null,null,null,null,0]
[{"$f":"IF(Prezentace!A9=0,\"\",Prezentace!A9)","v":""},{"$f":"IF(Prezentace!B9=0,\"\",Prezentace!B9)","v":""},{"$f":"Prezentace!D9","v":"P"},{"$f":"IF(Prezentace!F9=0,\"\",Prezentace!F9)","v":"Jiří"},{"$f":"IF(Prezentace!E9=0,\"\",Prezentace!E9)","v":"Švihálek "},null,null,null,null,null,null,null,null,null,null,null,null,null,null,0]
[{"$f":"IF(Prezentace!A10=0,\"\",Prezentace!A10)","v":""},{"$f":"IF(Prezentace!B10=0,\"\",Prezentace!B10)","v":""},{"$f":"Prezentace!D10","v":"R"},{"$f":"IF(Prezentace!F10=0,\"\",Prezentace!F10)","v":"Jiří"},{"$f":"IF(Prezentace!E10=0,\"\",Prezentace!E10)","v":"Švihálek "},null,null,null,null,null,null,null,null,null,null,null,null,null,null,0]
[{"$f":"IF(Prezentace!A11=0,\"\",Prezentace!A11)","v":""},{"$f":"IF(Prezentace!B11=0,\"\",Prezentace!B11)","v":""},{"$f":"Prezentace!D11","v":"P"},{"$f":"IF(Prezentace!F11=0,\"\",Prezentace!F11)","v":"Vladimír"},{"$f":"IF(Prezentace!E11=0,\"\",Prezentace!E11)","v":"VejslíK "},null,null,null,null,null,null,null,null,null,null,null,null,null,null,0]
[{"$f":"IF(Prezentace!A12=0,\"\",Prezentace!A12)","v":""},{"$f":"IF(Prezentace!B12=0,\"\",Prezentace!B12)","v":""},{"$f":"Prezentace!D12","v":"P"},{"$f":"IF(Prezentace!F12=0,\"\",Prezentace!F12)","v":"Milan"},{"$f":"IF(Prezentace!E12=0,\"\",Prezentace!E12)","v":"Kraus "},null,null,null,null,null,null,null,null,null,null,null,null,null,null,0]
[{"$f":"IF(Prezentace!#REF!=0,\"\",Prezentace!#REF!)","v":{"$error":"#REF!"}},{"$f":"IF(Prezentace!#REF!=0,\"\",Prezentace!#REF!)","v":{"$error":"#REF!"}},{"$f":"Prezentace!#REF!","v":{"$error":"#REF!"}},{"$f":"IF(Prezentace!#REF!=0,\"\",Prezentace!#REF!)","v":{"$error":"#REF!"}},{"$f":"IF(Prezentace!#REF!=0,\"\",Prezentace!#REF!)","v":{"$error":"#REF!"}},null,null,null,null,null,null,null,null,null,null,null,null,null,null,0]
[{"$f":"IF(Prezentace!A13=0,\"\",Prezentace!A13)","v":""},{"$f":"IF(Prezentace!B13=0,\"\",Prezentace!B13)","v":""},{"$f":"Prezentace!D13","v":"P"},{"$f":"IF(Prezentace!F13=0,\"\",Prezentace!F13)","v":"Vojtěch"},{"$f":"IF(Prezentace!E13=0,\"\",Prezentace!E13)","v":"Brejžek "},null,null,null,null,null,null,null,null,null,null,null,null,null,null,0]
[{"$f":"IF(Prezentace!A14=0,\"\",Prezentace!A14)","v":""},{"$f":"IF(Prezentace!B14=0,\"\",Prezentace!B14)","v":""},{"$f":"Prezentace!D14","v":"P"},{"$f":"IF(Prezentace!F14=0,\"\",Prezentace!F14)","v":"Karel"},{"$f":"IF(Prezentace!E14=0,\"\",Prezentace!E14)","v":"Získal "},null,null,null,null,null,null,null,null,null,null,null,null,null,null,0]
[{"$f":"IF(Prezentace!A15=0,\"\",Prezentace!A15)","v":""},{"$f":"IF(Prezentace!B15=0,\"\",Prezentace!B15)","v":""},{"$f":"Prezentace!D15","v":"R"},{"$f":"IF(Prezentace!F15=0,\"\",Prezentace!F15)","v":"Karel"},{"$f":"IF(Prezentace!E15=0,\"\",Prezentace!E15)","v":"Získal "},null,null,null,null,null,null,null,null,null,null,null,null,null,null,0]
[{"$f":"IF(Prezentace!A16=0,\"\",Prezentace!A16)","v":""},{"$f":"IF(Prezentace!B16=0,\"\",Prezentace!B16)","v":""},{"$f":"Prezentace!D16","v":"P"},{"$f":"IF(Prezentace!F16=0,\"\",Prezentace!F16)","v":"Marie"},{"$f":"IF(Prezentace!E16=0,\"\",Prezentace!E16)","v":"Žemličková"},null,null,null,null,null,null,null,null,null,null,null,null,null,null,0]
[{"$f":"IF(Prezentace!A17=0,\"\",Prezentace!A17)","v":""},{"$f":"IF(Prezentace!B17=0,\"\",Prezentace!B17)","v":""},{"$f":"Prezentace!D17","v":"P"},{"$f":"IF(Prezentace!F17=0,\"\",Prezentace!F17)","v":"Ladislav"},{"$f":"IF(Prezentace!E17=0,\"\",Prezentace!E17)","v":"Žemlička "},null,null,null,null,null,null,null,null,null,null,null,null,null,null,0]
[{"$f":"IF(Prezentace!A18=0,\"\",Prezentace!A18)","v":""},{"$f":"IF(Prezentace!B18=0,\"\",Prezentace!B18)","v":""},{"$f":"Prezentace!D18","v":"P"},{"$f":"IF(Prezentace!F18=0,\"\",Prezentace!F18)","v":"Jiří"},{"$f":"IF(Prezentace!E18=0,\"\",Prezentace!E18)","v":"Janovský "},null,null,null,null,null,null,null,null,null,null,null,null,null,null,0]
[{"$f":"IF(Prezentace!A19=0,\"\",Prezentace!A19)","v":""},{"$f":"IF(Prezentace!B19=0,\"\",Prezentace!B19)","v":""},{"$f":"Prezentace!D19","v":"P"},{"$f":"IF(Prezentace!F19=0,\"\",Prezentace!F19)","v":"Mojmír"},{"$f":"IF(Prezentace!E19=0,\"\",Prezentace!E19)","v":"Janovský "},null,null,null,null,null,null,null,null,null,null,null,null,null,null,0]
[{"$f":"IF(Prezentace!A20=0,\"\",Prezentace!A20)","v":""},{"$f":"IF(Prezentace!B20=0,\"\",Prezentace!B20)","v":""},{"$f":"Prezentace!D20","v":"P"},{"$f":"IF(Prezentace!F20=0,\"\",Prezentace!F20)","v":"Bohumil"},{"$f":"IF(Prezentace!E20=0,\"\",Prezentace!E20)","v":"Herceg"},null,null,null,null,null,null,null,null,null,null,null,null,null,null,0]
[{"$f":"IF(Prezentace!A21=0,\"\",Prezentace!A21)","v":""},{"$f":"IF(Prezentace!B21=0,\"\",Prezentace!B21)","v":""},{"$f":"Prezentace!D21","v":"P"},{"$f":"IF(Prezentace!F21=0,\"\",Prezentace!F21)","v":"Michal"},{"$f":"IF(Prezentace!E21=0,\"\",Prezentace!E21)","v":"Svoboda"},null,null,null,null,null,null,null,null,null,null,null,null,null,null,0]
[{"$f":"IF(Prezentace!A22=0,\"\",Prezentace!A22)","v":""},{"$f":"IF(Prezentace!B22=0,\"\",Prezentace!B22)","v":""},{"$f":"Prezentace!D22","v":"P"},{"$f":"IF(Prezentace!F22=0,\"\",Prezentace!F22)","v":"Viktor"},{"$f":"IF(Prezentace!E22=0,\"\",Prezentace!E22)","v":"Fuksa  "},null,null,null,null,null,null,null,null,null,null,null,null,null,null,0]
[{"$f":"IF(Prezentace!A23=0,\"\",Prezentace!A23)","v":""},{"$f":"IF(Prezentace!B23=0,\"\",Prezentace!B23)","v":""},{"$f":"Prezentace!D23","v":"P"},{"$f":"IF(Prezentace!F23=0,\"\",Prezentace!F23)","v":"Miroslav"},{"$f":"IF(Prezentace!E23=0,\"\",Prezentace!E23)","v":"Koch   ml."},null,null,null,null,null,null,null,null,null,null,null,null,null,null,0]
[{"$f":"IF(Prezentace!A24=0,\"\",Prezentace!A24)","v":""},{"$f":"IF(Prezentace!B24=0,\"\",Prezentace!B24)","v":""},{"$f":"Prezentace!D24","v":"P"},{"$f":"IF(Prezentace!F24=0,\"\",Prezentace!F24)","v":"Miroslav"},{"$f":"IF(Prezentace!E24=0,\"\",Prezentace!E24)","v":"Koch  st. "},null,null,null,null,null,null,null,null,null,null,null,null,null,null,0]
[{"$f":"IF(Prezentace!A25=0,\"\",Prezentace!A25)","v":""},{"$f":"IF(Prezentace!B25=0,\"\",Prezentace!B25)","v":""},{"$f":"Prezentace!D25","v":"P"},{"$f":"IF(Prezentace!F25=0,\"\",Prezentace!F25)","v":"Jaroslav"},{"$f":"IF(Prezentace!E25=0,\"\",Prezentace!E25)","v":"Kostříž "},null,null,null,null,null,null,null,null,null,null,null,null,null,null,0]
[{"$f":"IF(Prezentace!A26=0,\"\",Prezentace!A26)","v":""},{"$f":"IF(Prezentace!B26=0,\"\",Prezentace!B26)","v":""},{"$f":"Prezentace!D26","v":"P"},{"$f":"IF(Prezentace!F26=0,\"\",Prezentace!F26)","v":"Josef"},{"$f":"IF(Prezentace!E26=0,\"\",Prezentace!E26)","v":"Čekal "},null,null,null,null,null,null,null,null,null,null,null,null,null,null,0]
[{"$f":"IF(Prezentace!A27=0,\"\",Prezentace!A27)","v":""},{"$f":"IF(Prezentace!B27=0,\"\",Prezentace!B27)","v":""},{"$f":"Prezentace!D27","v":"P"},{"$f":"IF(Prezentace!F27=0,\"\",Prezentace!F27)","v":"Miloslav"},{"$f":"IF(Prezentace!E27=0,\"\",Prezentace!E27)","v":"Petržílka"},null,null,null,null,null,null,null,null,null,null,null,null,null,null,0]
[{"$f":"IF(Prezentace!A28=0,\"\",Prezentace!A28)","v":""},{"$f":"IF(Prezentace!B28=0,\"\",Prezentace!B28)","v":""},{"$f":"Prezentace!D28","v":"P"},{"$f":"IF(Prezentace!F28=0,\"\",Prezentace!F28)","v":"Václav"},{"$f":"IF(Prezentace!E28=0,\"\",Prezentace!E28)","v":"Landkammer"},null,null,null,null,null,null,null,null,null,null,null,null,null,null,0]
[{"$f":"IF(Prezentace!A29=0,\"\",Prezentace!A29)","v":""},{"$f":"IF(Prezentace!B29=0,\"\",Prezentace!B29)","v":""},{"$f":"Prezentace!D29","v":"P"},{"$f":"IF(Prezentace!F29=0,\"\",Prezentace!F29)","v":"Albert"},{"$f":"IF(Prezentace!E29=0,\"\",Prezentace!E29)","v":"Wrzecionko"},null,null,null,null,null,null,null,null,null,null,null,null,null,null,0]
[{"$f":"IF(Prezentace!A30=0,\"\",Prezentace!A30)","v":""},{"$f":"IF(Prezentace!B30=0,\"\",Prezentace!B30)","v":""},{"$f":"Prezentace!D30","v":"P"},{"$f":"IF(Prezentace!F30=0,\"\",Prezentace!F30)","v":"Michaela"},{"$f":"IF(Prezentace!E30=0,\"\",Prezentace!E30)","v":"Reisnerová"},null,null,null,null,null,null,null,null,null,null,null,null,null,null,0]
[{"$f":"IF(Prezentace!A31=0,\"\",Prezentace!A31)","v":""},{"$f":"IF(Prezentace!B31=0,\"\",Prezentace!B31)","v":""},{"$f":"Prezentace!D31","v":"P"},{"$f":"IF(Prezentace!F31=0,\"\",Prezentace!F31)","v":"Antonín"},{"$f":"IF(Prezentace!E31=0,\"\",Prezentace!E31)","v":"Urbanec  "},null,null,null,null,null,null,null,null,null,null,null,null,null,null,0]
[{"$f":"IF(Prezentace!#REF!=0,\"\",Prezentace!#REF!)","v":{"$error":"#REF!"}},{"$f":"IF(Prezentace!#REF!=0,\"\",Prezentace!#REF!)","v":{"$error":"#REF!"}},{"$f":"Prezentace!#REF!","v":{"$error":"#REF!"}},{"$f":"IF(Prezentace!#REF!=0,\"\",Prezentace!#REF!)","v":{"$error":"#REF!"}},{"$f":"IF(Prezentace!#REF!=0,\"\",Prezentace!#REF!)","v":{"$error":"#REF!"}},null,null,null,null,null,null,null,null,null,null,null,null,null,null,0]
[{"$f":"IF(Prezentace!#REF!=0,\"\",Prezentace!#REF!)","v":{"$error":"#REF!"}},{"$f":"IF(Prezentace!#REF!=0,\"\",Prezentace!#REF!)","v":{"$error":"#REF!"}},{"$f":"Prezentace!#REF!","v":{"$error":"#REF!"}},{"$f":"IF(Prezentace!#REF!=0,\"\",Prezentace!#REF!)","v":{"$error":"#REF!"}},{"$f":"IF(Prezentace!#REF!=0,\"\",Prezentace!#REF!)","v":{"$error":"#REF!"}},null,null,null,null,null,null,null,null,null,null,null,null,null,null,0]
[{"$f":"IF(Prezentace!#REF!=0,\"\",Prezentace!#REF!)","v":{"$error":"#REF!"}},{"$f":"IF(Prezentace!#REF!=0,\"\",Prezentace!#REF!)","v":{"$error":"#REF!"}},{"$f":"Prezentace!#REF!","v":{"$error":"#REF!"}},{"$f":"IF(Prezentace!#REF!=0,\"\",Prezentace!#REF!)","v":{"$error":"#REF!"}},{"$f":"IF(Prezentace!#REF!=0,\"\",Prezentace!#REF!)","v":{"$error":"#REF!"}},null,null,null,null,null,null,null,null,null,null,null,null,null,null,0]
[{"$f":"IF(Prezentace!#REF!=0,\"\",Prezentace!#REF!)","v":{"$error":"#REF!"}},{"$f":"IF(Prezentace!#REF!=0,\"\",Prezentace!#REF!)","v":{"$error":"#REF!"}},{"$f":"Prezentace!#REF!","v":{"$error":"#REF!"}},{"$f":"IF(Prezentace!#REF!=0,\"\",Prezentace!#REF!)","v":{"$error":"#REF!"}},{"$f":"IF(Prezentace!#REF!=0,\"\",Prezentace!#REF!)","v":{"$error":"#REF!"}},null,null,null,null,null,null,null,null,null,null,null,null,null,null,0]
[{"$f":"IF(Prezentace!#REF!=0,\"\",Prezentace!#REF!)","v":{"$error":"#REF!"}},{"$f":"IF(Prezentace!#REF!=0,\"\",Prezentace!#REF!)","v":{"$error":"#REF!"}},{"$f":"Prezentace!#REF!","v":{"$error":"#REF!"}},{"$f":"IF(Prezentace!#REF!=0,\"\",Prezentace!#REF!)","v":{"$error":"#REF!"}},{"$f":"IF(Prezentace!#REF!=0,\"\",Prezentace!#REF!)","v":{"$error":"#REF!"}},null,null,null,null,null,null,null,null,null,null,null,null,null,null,0]
[{"$f":"IF(Prezentace!#REF!=0,\"\",Prezentace!#REF!)","v":{"$error":"#REF!"}},{"$f":"IF(Prezentace!#REF!=0,\"\",Prezentace!#REF!)","v":{"$error":"#REF!"}},{"$f":"Prezentace!#REF!","v":{"$error":"#REF!"}},{"$f":"IF(Prezentace!#REF!=0,\"\",Prezentace!#REF!)","v":{"$error":"#REF!"}},{"$f":"IF(Prezentace!#REF!=0,\"\",Prezentace!#REF!)","v":{"$error":"#REF!"}},null,null,null,null,null,null,null,null,null,null,null,null,null,null,0]
[{"$f":"IF(Prezentace!#REF!=0,\"\",Prezentace!#REF!)","v":{"$error":"#REF!"}},{"$f":"IF(Prezentace!#REF!=0,\"\",Prezentace!#REF!)","v":{"$error":"#REF!"}},{"$f":"Prezentace!#REF!","v":{"$error":"#REF!"}},{"$f":"IF(Prezentace!#REF!=0,\"\",Prezentace!#REF!)","v":{"$error":"#REF!"}},{"$f":"IF(Prezentace!#REF!=0,\"\",Prezentace!#REF!)","v":{"$error":"#REF!"}},null,null,null,null,null,null,null,null,null,null,null,null,null,null,0]
[{"$f":"IF(Prezentace!#REF!=0,\"\",Prezentace!#REF!)","v":{"$error":"#REF!"}},{"$f":"IF(Prezentace!#REF!=0,\"\",Prezentace!#REF!)","v":{"$error":"#REF!"}},{"$f":"Prezentace!#REF!","v":{"$error":"#REF!"}},{"$f":"IF(Prezentace!#REF!=0,\"\",Prezentace!#REF!)","v":{"$error":"#REF!"}},{"$f":"IF(Prezentace!#REF!=0,\"\",Prezentace!#REF!)","v":{"$error":"#REF!"}},null,null,null,null,null,null,null,null,null,null,null,null,null,null,{"$f":"(SUM(F38*$F$3,G38*$G$3,H38*$H$3,I38*$I$3,J38*$J$3,K38*$K$3,L38*$L$3,M38*$M$3,N38*$N$3,O38*$O$3,P38*$P$3,Q38*$Q$3,R38*$R$3))-S38","v":0}]
[{"$f":"IF(Prezentace!#REF!=0,\"\",Prezentace!#REF!)","v":{"$error":"#REF!"}},{"$f":"IF(Prezentace!#REF!=0,\"\",Prezentace!#REF!)","v":{"$error":"#REF!"}},{"$f":"Prezentace!#REF!","v":{"$error":"#REF!"}},{"$f":"IF(Prezentace!#REF!=0,\"\",Prezentace!#REF!)","v":{"$error":"#REF!"}},{"$f":"IF(Prezentace!#REF!=0,\"\",Prezentace!#REF!)","v":{"$error":"#REF!"}},null,null,null,null,null,null,null,null,null,null,null,null,null,null,0]
[{"$f":"IF(Prezentace!#REF!=0,\"\",Prezentace!#REF!)","v":{"$error":"#REF!"}},{"$f":"IF(Prezentace!#REF!=0,\"\",Prezentace!#REF!)","v":{"$error":"#REF!"}},{"$f":"Prezentace!#REF!","v":{"$error":"#REF!"}},{"$f":"IF(Prezentace!#REF!=0,\"\",Prezentace!#REF!)","v":{"$error":"#REF!"}},{"$f":"IF(Prezentace!#REF!=0,\"\",Prezentace!#REF!)","v":{"$error":"#REF!"}},null,null,null,null,null,null,null,null,null,null,null,null,null,null,0]
[{"$f":"IF(Prezentace!#REF!=0,\"\",Prezentace!#REF!)","v":{"$error":"#REF!"}},{"$f":"IF(Prezentace!#REF!=0,\"\",Prezentace!#REF!)","v":{"$error":"#REF!"}},{"$f":"Prezentace!#REF!","v":{"$error":"#REF!"}},{"$f":"IF(Prezentace!#REF!=0,\"\",Prezentace!#REF!)","v":{"$error":"#REF!"}},{"$f":"IF(Prezentace!#REF!=0,\"\",Prezentace!#REF!)","v":{"$error":"#REF!"}},null,null,null,null,null,null,null,null,null,null,null,null,null,null,0]
[{"$f":"IF(Prezentace!#REF!=0,\"\",Prezentace!#REF!)","v":{"$error":"#REF!"}},{"$f":"IF(Prezentace!#REF!=0,\"\",Prezentace!#REF!)","v":{"$error":"#REF!"}},{"$f":"Prezentace!#REF!","v":{"$error":"#REF!"}},{"$f":"IF(Prezentace!#REF!=0,\"\",Prezentace!#REF!)","v":{"$error":"#REF!"}},{"$f":"IF(Prezentace!#REF!=0,\"\",Prezentace!#REF!)","v":{"$error":"#REF!"}},null,null,null,null,null,null,null,null,null,null,null,null,null,null,0]
[{"$f":"IF(Prezentace!#REF!=0,\"\",Prezentace!#REF!)","v":{"$error":"#REF!"}},{"$f":"IF(Prezentace!#REF!=0,\"\",Prezentace!#REF!)","v":{"$error":"#REF!"}},{"$f":"Prezentace!#REF!","v":{"$error":"#REF!"}},{"$f":"IF(Prezentace!#REF!=0,\"\",Prezentace!#REF!)","v":{"$error":"#REF!"}},{"$f":"IF(Prezentace!#REF!=0,\"\",Prezentace!#REF!)","v":{"$error":"#REF!"}},null,null,null,null,null,null,null,null,null,null,null,null,null,null,0]
[{"$f":"IF(Prezentace!#REF!=0,\"\",Prezentace!#REF!)","v":{"$error":"#REF!"}},{"$f":"IF(Prezentace!#REF!=0,\"\",Prezentace!#REF!)","v":{"$error":"#REF!"}},{"$f":"Prezentace!#REF!","v":{"$error":"#REF!"}},{"$f":"IF(Prezentace!#REF!=0,\"\",Prezentace!#REF!)","v":{"$error":"#REF!"}},{"$f":"IF(Prezentace!#REF!=0,\"\",Prezentace!#REF!)","v":{"$error":"#REF!"}},null,null,null,null,null,null,null,null,null,null,null,null,null,null,0]
[{"$f":"IF(Prezentace!#REF!=0,\"\",Prezentace!#REF!)","v":{"$error":"#REF!"}},{"$f":"IF(Prezentace!#REF!=0,\"\",Prezentace!#REF!)","v":{"$error":"#REF!"}},{"$f":"Prezentace!#REF!","v":{"$error":"#REF!"}},{"$f":"IF(Prezentace!#REF!=0,\"\",Prezentace!#REF!)","v":{"$error":"#REF!"}},{"$f":"IF(Prezentace!#REF!=0,\"\",Prezentace!#REF!)","v":{"$error":"#REF!"}},null,null,null,null,null,null,null,null,null,null,null,null,null,null,0]
[{"$f":"IF(Prezentace!#REF!=0,\"\",Prezentace!#REF!)","v":{"$error":"#REF!"}},{"$f":"IF(Prezentace!#REF!=0,\"\",Prezentace!#REF!)","v":{"$error":"#REF!"}},{"$f":"Prezentace!#REF!","v":{"$error":"#REF!"}},{"$f":"IF(Prezentace!#REF!=0,\"\",Prezentace!#REF!)","v":{"$error":"#REF!"}},{"$f":"IF(Prezentace!#REF!=0,\"\",Prezentace!#REF!)","v":{"$error":"#REF!"}},null,null,null,null,null,null,null,null,null,null,null,null,null,null,0]
[{"$f":"IF(Prezentace!#REF!=0,\"\",Prezentace!#REF!)","v":{"$error":"#REF!"}},{"$f":"IF(Prezentace!#REF!=0,\"\",Prezentace!#REF!)","v":{"$error":"#REF!"}},{"$f":"Prezentace!#REF!","v":{"$error":"#REF!"}},{"$f":"IF(Prezentace!#REF!=0,\"\",Prezentace!#REF!)","v":{"$error":"#REF!"}},{"$f":"IF(Prezentace!#REF!=0,\"\",Prezentace!#REF!)","v":{"$error":"#REF!"}},null,null,null,null,null,null,null,null,null,null,null,null,null,null,0]
[{"$f":"IF(Prezentace!#REF!=0,\"\",Prezentace!#REF!)","v":{"$error":"#REF!"}},{"$f":"IF(Prezentace!#REF!=0,\"\",Prezentace!#REF!)","v":{"$error":"#REF!"}},{"$f":"Prezentace!#REF!","v":{"$error":"#REF!"}},{"$f":"IF(Prezentace!#REF!=0,\"\",Prezentace!#REF!)","v":{"$error":"#REF!"}},{"$f":"IF(Prezentace!#REF!=0,\"\",Prezentace!#REF!)","v":{"$error":"#REF!"}},null,null,null,null,null,null,null,null,null,null,null,null,null,null,0]
[{"$f":"IF(Prezentace!#REF!=0,\"\",Prezentace!#REF!)","v":{"$error":"#REF!"}},{"$f":"IF(Prezentace!#REF!=0,\"\",Prezentace!#REF!)","v":{"$error":"#REF!"}},{"$f":"Prezentace!#REF!","v":{"$error":"#REF!"}},{"$f":"IF(Prezentace!#REF!=0,\"\",Prezentace!#REF!)","v":{"$error":"#REF!"}},{"$f":"IF(Prezentace!#REF!=0,\"\",Prezentace!#REF!)","v":{"$error":"#REF!"}},null,null,null,null,null,null,null,null,null,null,null,null,null,null,0]
[{"$f":"IF(Prezentace!#REF!=0,\"\",Prezentace!#REF!)","v":{"$error":"#REF!"}},{"$f":"IF(Prezentace!#REF!=0,\"\",Prezentace!#REF!)","v":{"$error":"#REF!"}},{"$f":"Prezentace!#REF!","v":{"$error":"#REF!"}},{"$f":"IF(Prezentace!#REF!=0,\"\",Prezentace!#REF!)","v":{"$error":"#REF!"}},{"$f":"IF(Prezentace!#REF!=0,\"\",Prezentace!#REF!)","v":{"$error":"#REF!"}},null,null,null,null,null,null,null,null,null,null,null,null,null,null,0]
[{"$f":"IF(Prezentace!#REF!=0,\"\",Prezentace!#REF!)","v":{"$error":"#REF!"}},{"$f":"IF(Prezentace!#REF!=0,\"\",Prezentace!#REF!)","v":{"$error":"#REF!"}},{"$f":"Prezentace!#REF!","v":{"$error":"#REF!"}},{"$f":"IF(Prezentace!#REF!=0,\"\",Prezentace!#REF!)","v":{"$error":"#REF!"}},{"$f":"IF(Prezentace!#REF!=0,\"\",Prezentace!#REF!)","v":{"$error":"#REF!"}},null,null,null,null,null,null,null,null,null,null,null,null,null,null,0]
[{"$f":"IF(Prezentace!#REF!=0,\"\",Prezentace!#REF!)","v":{"$error":"#REF!"}},{"$f":"IF(Prezentace!#REF!=0,\"\",Prezentace!#REF!)","v":{"$error":"#REF!"}},{"$f":"Prezentace!#REF!","v":{"$error":"#REF!"}},{"$f":"IF(Prezentace!#REF!=0,\"\",Prezentace!#REF!)","v":{"$error":"#REF!"}},{"$f":"IF(Prezentace!#REF!=0,\"\",Prezentace!#REF!)","v":{"$error":"#REF!"}},null,null,null,null,null,null,null,null,null,null,null,null,null,null,0]
[{"$f":"IF(Prezentace!#REF!=0,\"\",Prezentace!#REF!)","v":{"$error":"#REF!"}},{"$f":"IF(Prezentace!#REF!=0,\"\",Prezentace!#REF!)","v":{"$error":"#REF!"}},{"$f":"Prezentace!#REF!","v":{"$error":"#REF!"}},{"$f":"IF(Prezentace!#REF!=0,\"\",Prezentace!#REF!)","v":{"$error":"#REF!"}},{"$f":"IF(Prezentace!#REF!=0,\"\",Prezentace!#REF!)","v":{"$error":"#REF!"}},null,null,null,null,null,null,null,null,null,null,null,null,null,null,0]
[{"$f":"IF(Prezentace!#REF!=0,\"\",Prezentace!#REF!)","v":{"$error":"#REF!"}},{"$f":"IF(Prezentace!#REF!=0,\"\",Prezentace!#REF!)","v":{"$error":"#REF!"}},{"$f":"Prezentace!#REF!","v":{"$error":"#REF!"}},{"$f":"IF(Prezentace!#REF!=0,\"\",Prezentace!#REF!)","v":{"$error":"#REF!"}},{"$f":"IF(Prezentace!#REF!=0,\"\",Prezentace!#REF!)","v":{"$error":"#REF!"}},null,null,null,null,null,null,null,null,null,null,null,null,null,null,0]
[{"$f":"IF(Prezentace!#REF!=0,\"\",Prezentace!#REF!)","v":{"$error":"#REF!"}},{"$f":"IF(Prezentace!#REF!=0,\"\",Prezentace!#REF!)","v":{"$error":"#REF!"}},{"$f":"Prezentace!#REF!","v":{"$error":"#REF!"}},{"$f":"IF(Prezentace!#REF!=0,\"\",Prezentace!#REF!)","v":{"$error":"#REF!"}},{"$f":"IF(Prezentace!#REF!=0,\"\",Prezentace!#REF!)","v":{"$error":"#REF!"}},null,null,null,null,null,null,null,null,null,null,null,null,null,null,0]
[{"$f":"IF(Prezentace!#REF!=0,\"\",Prezentace!#REF!)","v":{"$error":"#REF!"}},{"$f":"IF(Prezentace!#REF!=0,\"\",Prezentace!#REF!)","v":{"$error":"#REF!"}},{"$f":"Prezentace!#REF!","v":{"$error":"#REF!"}},{"$f":"IF(Prezentace!#REF!=0,\"\",Prezentace!#REF!)","v":{"$error":"#REF!"}},{"$f":"IF(Prezentace!#REF!=0,\"\",Prezentace!#REF!)","v":{"$error":"#REF!"}},null,null,null,null,null,null,null,null,null,null,null,null,null,null,0]
[{"$f":"IF(Prezentace!#REF!=0,\"\",Prezentace!#REF!)","v":{"$error":"#REF!"}},{"$f":"IF(Prezentace!#REF!=0,\"\",Prezentace!#REF!)","v":{"$error":"#REF!"}},{"$f":"Prezentace!#REF!","v":{"$error":"#REF!"}},{"$f":"IF(Prezentace!#REF!=0,\"\",Prezentace!#REF!)","v":{"$error":"#REF!"}},{"$f":"IF(Prezentace!#REF!=0,\"\",Prezentace!#REF!)","v":{"$error":"#REF!"}},null,null,null,null,null,null,null,null,null,null,null,null,null,null,0]
[{"$f":"IF(Prezentace!#REF!=0,\"\",Prezentace!#REF!)","v":{"$error":"#REF!"}},{"$f":"IF(Prezentace!#REF!=0,\"\",Prezentace!#REF!)","v":{"$error":"#REF!"}},{"$f":"Prezentace!#REF!","v":{"$error":"#REF!"}},{"$f":"IF(Prezentace!#REF!=0,\"\",Prezentace!#REF!)","v":{"$error":"#REF!"}},{"$f":"IF(Prezentace!#REF!=0,\"\",Prezentace!#REF!)","v":{"$error":"#REF!"}},null,null,null,null,null,null,null,null,null,null,null,null,null,null,0]
[{"$f":"IF(Prezentace!A32=0,\"\",Prezentace!A32)","v":""},{"$f":"IF(Prezentace!B32=0,\"\",Prezentace!B32)","v":""},{"$f":"Prezentace!D32","v":"P"},{"$f":"IF(Prezentace!F32=0,\"\",Prezentace!F32)","v":""},{"$f":"IF(Prezentace!E32=0,\"\",Prezentace!E32)","v":""},null,null,null,null,null,null,null,null,null,null,null,null,null,null,0]
[{"$f":"IF(Prezentace!A33=0,\"\",Prezentace!A33)","v":""},{"$f":"IF(Prezentace!B33=0,\"\",Prezentace!B33)","v":""},{"$f":"Prezentace!D33","v":"P"},{"$f":"IF(Prezentace!F33=0,\"\",Prezentace!F33)","v":""},{"$f":"IF(Prezentace!E33=0,\"\",Prezentace!E33)","v":""},null,null,null,null,null,null,null,null,null,null,null,null,null,null,0]
[{"$f":"IF(Prezentace!A34=0,\"\",Prezentace!A34)","v":""},{"$f":"IF(Prezentace!B34=0,\"\",Prezentace!B34)","v":""},{"$f":"Prezentace!D34","v":"P"},{"$f":"IF(Prezentace!F34=0,\"\",Prezentace!F34)","v":""},{"$f":"IF(Prezentace!E34=0,\"\",Prezentace!E34)","v":""},null,null,null,null,null,null,null,null,null,null,null,null,null,null,0]
[{"$f":"IF(Prezentace!A35=0,\"\",Prezentace!A35)","v":""},{"$f":"IF(Prezentace!B35=0,\"\",Prezentace!B35)","v":""},{"$f":"Prezentace!D35","v":"P"},{"$f":"IF(Prezentace!F35=0,\"\",Prezentace!F35)","v":""},{"$f":"IF(Prezentace!E35=0,\"\",Prezentace!E35)","v":""},null,null,null,null,null,null,null,null,null,null,null,null,null,null,0]
[{"$f":"IF(Prezentace!A36=0,\"\",Prezentace!A36)","v":""},{"$f":"IF(Prezentace!B36=0,\"\",Prezentace!B36)","v":""},{"$f":"Prezentace!D36","v":"P"},{"$f":"IF(Prezentace!F36=0,\"\",Prezentace!F36)","v":""},{"$f":"IF(Prezentace!E36=0,\"\",Prezentace!E36)","v":""},null,null,null,null,null,null,null,null,null,null,null,null,null,null,0]
[{"$f":"IF(Prezentace!A37=0,\"\",Prezentace!A37)","v":""},{"$f":"IF(Prezentace!B37=0,\"\",Prezentace!B37)","v":""},{"$f":"Prezentace!D37","v":"P"},{"$f":"IF(Prezentace!F37=0,\"\",Prezentace!F37)","v":""},{"$f":"IF(Prezentace!E37=0,\"\",Prezentace!E37)","v":""},null,null,null,null,null,null,null,null,null,null,null,null,null,null,0]
[{"$f":"IF(Prezentace!A38=0,\"\",Prezentace!A38)","v":""},{"$f":"IF(Prezentace!B38=0,\"\",Prezentace!B38)","v":""},{"$f":"Prezentace!D38","v":"P"},{"$f":"IF(Prezentace!F38=0,\"\",Prezentace!F38)","v":""},{"$f":"IF(Prezentace!E38=0,\"\",Prezentace!E38)","v":""},null,null,null,null,null,null,null,null,null,null,null,null,null,null,0]
[{"$f":"IF(Prezentace!A39=0,\"\",Prezentace!A39)","v":""},{"$f":"IF(Prezentace!B39=0,\"\",Prezentace!B39)","v":""},{"$f":"Prezentace!D39","v":"P"},{"$f":"IF(Prezentace!F39=0,\"\",Prezentace!F39)","v":""},{"$f":"IF(Prezentace!E39=0,\"\",Prezentace!E39)","v":""},null,null,null,null,null,null,null,null,null,null,null,null,null,null,0]
[{"$f":"IF(Prezentace!A40=0,\"\",Prezentace!A40)","v":""},{"$f":"IF(Prezentace!B40=0,\"\",Prezentace!B40)","v":""},{"$f":"Prezentace!D40","v":"P"},{"$f":"IF(Prezentace!F40=0,\"\",Prezentace!F40)","v":""},{"$f":"IF(Prezentace!E40=0,\"\",Prezentace!E40)","v":""},null,null,null,null,null,null,null,null,null,null,null,null,null,null,0]
[{"$f":"IF(Prezentace!A41=0,\"\",Prezentace!A41)","v":""},{"$f":"IF(Prezentace!B41=0,\"\",Prezentace!B41)","v":""},{"$f":"Prezentace!D41","v":"P"},{"$f":"IF(Prezentace!F41=0,\"\",Prezentace!F41)","v":""},{"$f":"IF(Prezentace!E41=0,\"\",Prezentace!E41)","v":""},null,null,null,null,null,null,null,null,null,null,null,null,null,null,0]
[{"$f":"IF(Prezentace!A42=0,\"\",Prezentace!A42)","v":""},{"$f":"IF(Prezentace!B42=0,\"\",Prezentace!B42)","v":""},{"$f":"Prezentace!D42","v":"P"},{"$f":"IF(Prezentace!F42=0,\"\",Prezentace!F42)","v":""},{"$f":"IF(Prezentace!E42=0,\"\",Prezentace!E42)","v":""},null,null,null,null,null,null,null,null,null,null,null,null,null,null,0]
[{"$f":"IF(Prezentace!A43=0,\"\",Prezentace!A43)","v":""},{"$f":"IF(Prezentace!B43=0,\"\",Prezentace!B43)","v":""},{"$f":"Prezentace!D43","v":"P"},{"$f":"IF(Prezentace!F43=0,\"\",Prezentace!F43)","v":""},{"$f":"IF(Prezentace!E43=0,\"\",Prezentace!E43)","v":""},null,null,null,null,null,null,null,null,null,null,null,null,null,null,0]
[{"$f":"IF(Prezentace!A44=0,\"\",Prezentace!A44)","v":""},{"$f":"IF(Prezentace!B44=0,\"\",Prezentace!B44)","v":""},{"$f":"Prezentace!D44","v":"P"},{"$f":"IF(Prezentace!F44=0,\"\",Prezentace!F44)","v":""},{"$f":"IF(Prezentace!E44=0,\"\",Prezentace!E44)","v":""},null,null,null,null,null,null,null,null,null,null,null,null,null,null,0]
[{"$f":"IF(Prezentace!A45=0,\"\",Prezentace!A45)","v":""},{"$f":"IF(Prezentace!B45=0,\"\",Prezentace!B45)","v":""},{"$f":"Prezentace!D45","v":"P"},{"$f":"IF(Prezentace!F45=0,\"\",Prezentace!F45)","v":""},{"$f":"IF(Prezentace!E45=0,\"\",Prezentace!E45)","v":""},null,null,null,null,null,null,null,null,null,null,null,null,null,null,0]
[{"$f":"IF(Prezentace!A46=0,\"\",Prezentace!A46)","v":""},{"$f":"IF(Prezentace!B46=0,\"\",Prezentace!B46)","v":""},{"$f":"Prezentace!D46","v":"P"},{"$f":"IF(Prezentace!F46=0,\"\",Prezentace!F46)","v":""},{"$f":"IF(Prezentace!E46=0,\"\",Prezentace!E46)","v":""},null,null,null,null,null,null,null,null,null,null,null,null,null,null,0]
[{"$f":"IF(Prezentace!A47=0,\"\",Prezentace!A47)","v":""},{"$f":"IF(Prezentace!B47=0,\"\",Prezentace!B47)","v":""},{"$f":"Prezentace!D47","v":"P"},{"$f":"IF(Prezentace!F47=0,\"\",Prezentace!F47)","v":""},{"$f":"IF(Prezentace!E47=0,\"\",Prezentace!E47)","v":""},null,null,null,null,null,null,null,null,null,null,null,null,null,null,0]
[{"$f":"IF(Prezentace!A48=0,\"\",Prezentace!A48)","v":""},{"$f":"IF(Prezentace!B48=0,\"\",Prezentace!B48)","v":""},{"$f":"Prezentace!D48","v":"P"},{"$f":"IF(Prezentace!F48=0,\"\",Prezentace!F48)","v":""},{"$f":"IF(Prezentace!E48=0,\"\",Prezentace!E48)","v":""},null,null,null,null,null,null,null,null,null,null,null,null,null,null,0]
[{"$f":"IF(Prezentace!A49=0,\"\",Prezentace!A49)","v":""},{"$f":"IF(Prezentace!B49=0,\"\",Prezentace!B49)","v":""},{"$f":"Prezentace!D49","v":"P"},{"$f":"IF(Prezentace!F49=0,\"\",Prezentace!F49)","v":""},{"$f":"IF(Prezentace!E49=0,\"\",Prezentace!E49)","v":""},null,null,null,null,null,null,null,null,null,null,null,null,null,null,0]
[{"$f":"IF(Prezentace!A50=0,\"\",Prezentace!A50)","v":""},{"$f":"IF(Prezentace!B50=0,\"\",Prezentace!B50)","v":""},{"$f":"Prezentace!D50","v":"P"},{"$f":"IF(Prezentace!F50=0,\"\",Prezentace!F50)","v":""},{"$f":"IF(Prezentace!E50=0,\"\",Prezentace!E50)","v":""},null,null,null,null,null,null,null,null,null,null,null,null,null,null,0]
[{"$f":"IF(Prezentace!A51=0,\"\",Prezentace!A51)","v":""},{"$f":"IF(Prezentace!B51=0,\"\",Prezentace!B51)","v":""},{"$f":"Prezentace!D51","v":"P"},{"$f":"IF(Prezentace!F51=0,\"\",Prezentace!F51)","v":""},{"$f":"IF(Prezentace!E51=0,\"\",Prezentace!E51)","v":""},null,null,null,null,null,null,null,null,null,null,null,null,null,null,0]
[{"$f":"IF(Prezentace!A52=0,\"\",Prezentace!A52)","v":""},{"$f":"IF(Prezentace!B52=0,\"\",Prezentace!B52)","v":""},{"$f":"Prezentace!D52","v":"P"},{"$f":"IF(Prezentace!F52=0,\"\",Prezentace!F52)","v":""},{"$f":"IF(Prezentace!E52=0,\"\",Prezentace!E52)","v":""},null,null,null,null,null,null,null,null,null,null,null,null,null,null,0]
[{"$f":"IF(Prezentace!A53=0,\"\",Prezentace!A53)","v":""},{"$f":"IF(Prezentace!B53=0,\"\",Prezentace!B53)","v":""},{"$f":"Prezentace!D53","v":"P"},{"$f":"IF(Prezentace!F53=0,\"\",Prezentace!F53)","v":""},{"$f":"IF(Prezentace!E53=0,\"\",Prezentace!E53)","v":""},null,null,null,null,null,null,null,null,null,null,null,null,null,null,0]
[{"$f":"IF(Prezentace!A54=0,\"\",Prezentace!A54)","v":""},{"$f":"IF(Prezentace!B54=0,\"\",Prezentace!B54)","v":""},{"$f":"Prezentace!D54","v":"P"},{"$f":"IF(Prezentace!F54=0,\"\",Prezentace!F54)","v":""},{"$f":"IF(Prezentace!E54=0,\"\",Prezentace!E54)","v":""},null,null,null,null,null,null,null,null,null,null,null,null,null,null,0]
[{"$f":"IF(Prezentace!A55=0,\"\",Prezentace!A55)","v":""},{"$f":"IF(Prezentace!B55=0,\"\",Prezentace!B55)","v":""},{"$f":"Prezentace!D55","v":"P"},{"$f":"IF(Prezentace!F55=0,\"\",Prezentace!F55)","v":""},{"$f":"IF(Prezentace!E55=0,\"\",Prezentace!E55)","v":""},null,null,null,null,null,null,null,null,null,null,null,null,null,null,0]
[{"$f":"IF(Prezentace!A56=0,\"\",Prezentace!A56)","v":""},{"$f":"IF(Prezentace!B56=0,\"\",Prezentace!B56)","v":""},{"$f":"Prezentace!D56","v":"P"},{"$f":"IF(Prezentace!F56=0,\"\",Prezentace!F56)","v":""},{"$f":"IF(Prezentace!E56=0,\"\",Prezentace!E56)","v":""},null,null,null,null,null,null,null,null,null,null,null,null,null,null,0]
[{"$f":"IF(Prezentace!A57=0,\"\",Prezentace!A57)","v":""},{"$f":"IF(Prezentace!B57=0,\"\",Prezentace!B57)","v":""},{"$f":"Prezentace!D57","v":"P"},{"$f":"IF(Prezentace!F57=0,\"\",Prezentace!F57)","v":""},{"$f":"IF(Prezentace!E57=0,\"\",Prezentace!E57)","v":""},null,null,null,null,null,null,null,null,null,null,null,null,null,null,0]
[{"$f":"IF(Prezentace!A58=0,\"\",Prezentace!A58)","v":""},{"$f":"IF(Prezentace!B58=0,\"\",Prezentace!B58)","v":""},{"$f":"Prezentace!D58","v":"P"},{"$f":"IF(Prezentace!F58=0,\"\",Prezentace!F58)","v":""},{"$f":"IF(Prezentace!E58=0,\"\",Prezentace!E58)","v":""},null,null,null,null,null,null,null,null,null,null,null,null,null,null,0]
[{"$f":"IF(Prezentace!A59=0,\"\",Prezentace!A59)","v":""},{"$f":"IF(Prezentace!B59=0,\"\",Prezentace!B59)","v":""},{"$f":"Prezentace!D59","v":"P"},{"$f":"IF(Prezentace!F59=0,\"\",Prezentace!F59)","v":""},{"$f":"IF(Prezentace!E59=0,\"\",Prezentace!E59)","v":""},null,null,null,null,null,null,null,null,null,null,null,null,null,null,0]
[{"$f":"IF(Prezentace!A60=0,\"\",Prezentace!A60)","v":""},{"$f":"IF(Prezentace!B60=0,\"\",Prezentace!B60)","v":""},{"$f":"Prezentace!D60","v":"P"},{"$f":"IF(Prezentace!F60=0,\"\",Prezentace!F60)","v":""},{"$f":"IF(Prezentace!E60=0,\"\",Prezentace!E60)","v":""},null,null,null,null,null,null,null,null,null,null,null,null,null,null,0]
[{"$f":"IF(Prezentace!A61=0,\"\",Prezentace!A61)","v":""},{"$f":"IF(Prezentace!B61=0,\"\",Prezentace!B61)","v":""},{"$f":"Prezentace!D61","v":"P"},{"$f":"IF(Prezentace!F61=0,\"\",Prezentace!F61)","v":""},{"$f":"IF(Prezentace!E61=0,\"\",Prezentace!E61)","v":""},null,null,null,null,null,null,null,null,null,null,null,null,null,null,0]
[{"$f":"IF(Prezentace!A62=0,\"\",Prezentace!A62)","v":""},{"$f":"IF(Prezentace!B62=0,\"\",Prezentace!B62)","v":""},{"$f":"Prezentace!D62","v":"P"},{"$f":"IF(Prezentace!F62=0,\"\",Prezentace!F62)","v":""},{"$f":"IF(Prezentace!E62=0,\"\",Prezentace!E62)","v":""},null,null,null,null,null,null,null,null,null,null,null,null,null,null,0]
[{"$f":"IF(Prezentace!A63=0,\"\",Prezentace!A63)","v":""},{"$f":"IF(Prezentace!B63=0,\"\",Prezentace!B63)","v":""},{"$f":"Prezentace!D63","v":"P"},{"$f":"IF(Prezentace!F63=0,\"\",Prezentace!F63)","v":""},{"$f":"IF(Prezentace!E63=0,\"\",Prezentace!E63)","v":""},null,null,null,null,null,null,null,null,null,null,null,null,null,null,0]
[{"$f":"IF(Prezentace!A64=0,\"\",Prezentace!A64)","v":""},{"$f":"IF(Prezentace!B64=0,\"\",Prezentace!B64)","v":""},{"$f":"Prezentace!D64","v":"P"},{"$f":"IF(Prezentace!F64=0,\"\",Prezentace!F64)","v":""},{"$f":"IF(Prezentace!E64=0,\"\",Prezentace!E64)","v":""},null,null,null,null,null,null,null,null,null,null,null,null,null,null,0]
[{"$f":"IF(Prezentace!A65=0,\"\",Prezentace!A65)","v":""},{"$f":"IF(Prezentace!B65=0,\"\",Prezentace!B65)","v":""},{"$f":"Prezentace!D65","v":"P"},{"$f":"IF(Prezentace!F65=0,\"\",Prezentace!F65)","v":""},{"$f":"IF(Prezentace!E65=0,\"\",Prezentace!E65)","v":""},null,null,null,null,null,null,null,null,null,null,null,null,null,null,0]
[{"$f":"IF(Prezentace!A66=0,\"\",Prezentace!A66)","v":""},{"$f":"IF(Prezentace!B66=0,\"\",Prezentace!B66)","v":""},{"$f":"Prezentace!D66","v":"P"},{"$f":"IF(Prezentace!F66=0,\"\",Prezentace!F66)","v":""},{"$f":"IF(Prezentace!E66=0,\"\",Prezentace!E66)","v":""},null,null,null,null,null,null,null,null,null,null,null,null,null,null,0]
[{"$f":"IF(Prezentace!A67=0,\"\",Prezentace!A67)","v":""},{"$f":"IF(Prezentace!B67=0,\"\",Prezentace!B67)","v":""},{"$f":"Prezentace!D67","v":"P"},{"$f":"IF(Prezentace!F67=0,\"\",Prezentace!F67)","v":""},{"$f":"IF(Prezentace!E67=0,\"\",Prezentace!E67)","v":""},null,null,null,null,null,null,null,null,null,null,null,null,null,null,0]
[{"$f":"IF(Prezentace!A68=0,\"\",Prezentace!A68)","v":""},{"$f":"IF(Prezentace!B68=0,\"\",Prezentace!B68)","v":""},{"$f":"Prezentace!D68","v":"P"},{"$f":"IF(Prezentace!F68=0,\"\",Prezentace!F68)","v":""},{"$f":"IF(Prezentace!E68=0,\"\",Prezentace!E68)","v":""},null,null,null,null,null,null,null,null,null,null,null,null,null,null,0]
[{"$f":"IF(Prezentace!A69=0,\"\",Prezentace!A69)","v":""},{"$f":"IF(Prezentace!B69=0,\"\",Prezentace!B69)","v":""},{"$f":"Prezentace!D69","v":"P"},{"$f":"IF(Prezentace!F69=0,\"\",Prezentace!F69)","v":""},{"$f":"IF(Prezentace!E69=0,\"\",Prezentace!E69)","v":""},null,null,null,null,null,null,null,null,null,null,null,null,null,null,0]
[{"$f":"IF(Prezentace!A70=0,\"\",Prezentace!A70)","v":""},{"$f":"IF(Prezentace!B70=0,\"\",Prezentace!B70)","v":""},{"$f":"Prezentace!D70","v":"P"},{"$f":"IF(Prezentace!F70=0,\"\",Prezentace!F70)","v":""},{"$f":"IF(Prezentace!E70=0,\"\",Prezentace!E70)","v":""},null,null,null,null,null,null,null,null,null,null,null,null,null,null,0]
[{"$f":"IF(Prezentace!A71=0,\"\",Prezentace!A71)","v":""},{"$f":"IF(Prezentace!B71=0,\"\",Prezentace!B71)","v":""},{"$f":"Prezentace!D71","v":"P"},{"$f":"IF(Prezentace!F71=0,\"\",Prezentace!F71)","v":""},{"$f":"IF(Prezentace!E71=0,\"\",Prezentace!E71)","v":""},null,null,null,null,null,null,null,null,null,null,null,null,null,null,0]
[{"$f":"IF(Prezentace!A72=0,\"\",Prezentace!A72)","v":""},{"$f":"IF(Prezentace!B72=0,\"\",Prezentace!B72)","v":""},{"$f":"Prezentace!D72","v":"P"},{"$f":"IF(Prezentace!F72=0,\"\",Prezentace!F72)","v":""},{"$f":"IF(Prezentace!E72=0,\"\",Prezentace!E72)","v":""},null,null,null,null,null,null,null,null,null,null,null,null,null,null,0]
[{"$f":"IF(Prezentace!A73=0,\"\",Prezentace!A73)","v":""},{"$f":"IF(Prezentace!B73=0,\"\",Prezentace!B73)","v":""},{"$f":"Prezentace!D73","v":"P"},{"$f":"IF(Prezentace!F73=0,\"\",Prezentace!F73)","v":""},{"$f":"IF(Prezentace!E73=0,\"\",Prezentace!E73)","v":""},null,null,null,null,null,null,null,null,null,null,null,null,null,null,0]
[{"$f":"IF(Prezentace!A74=0,\"\",Prezentace!A74)","v":""},{"$f":"IF(Prezentace!B74=0,\"\",Prezentace!B74)","v":""},{"$f":"Prezentace!D74","v":"P"},{"$f":"IF(Prezentace!F74=0,\"\",Prezentace!F74)","v":""},{"$f":"IF(Prezentace!E74=0,\"\",Prezentace!E74)","v":""},null,null,null,null,null,null,null,null,null,null,null,null,null,null,0]
[{"$f":"IF(Prezentace!A75=0,\"\",Prezentace!A75)","v":""},{"$f":"IF(Prezentace!B75=0,\"\",Prezentace!B75)","v":""},{"$f":"Prezentace!D75","v":"P"},{"$f":"IF(Prezentace!F75=0,\"\",Prezentace!F75)","v":""},{"$f":"IF(Prezentace!E75=0,\"\",Prezentace!E75)","v":""},null,null,null,null,null,null,null,null,null,null,null,null,null,null,{"$f":"(SUM(F102*$F$3,G102*$G$3,H102*$H$3,I102*$I$3,J102*$J$3,K102*$K$3,L102*$L$3,M102*$M$3,N102*$N$3,O102*$O$3,P102*$P$3,Q102*$Q$3,R102*$R$3))-S102","v":0}]

{"sheet":"3(M)","index":6,"n_rows":102,"n_cols":20,"rows_kept":102,"cut":false,"hidden":true,"merged":[[0,3,0,18],[0,0,2,0],[0,1,2,1]]}
["Druž.","Kap.",null,"Disciplina 3"]
[]
[null,null,null,null,null,0,1,2,3,4,5,6,7,8,9,10,12,15,"Čas","Součet"]
[{"$f":"IF(Prezentace!A6=0,\"\",Prezentace!A6)","v":""},{"$f":"IF(Prezentace!B6=0,\"\",Prezentace!B6)","v":""},{"$f":"Prezentace!D6","v":"P"},{"$f":"IF(Prezentace!F6=0,\"\",Prezentace!F6)","v":"Milan"},{"$f":"IF(Prezentace!E6=0,\"\",Prezentace!E6)","v":"Matějka st."},null,null,null,null,null,null,null,null,null,null,null,null,null,null,{"$f":"(SUM(F4*$F$3,G4*$G$3,H4*$H$3,I4*$I$3,J4*$J$3,K4*$K$3,L4*$L$3,M4*$M$3,N4*$N$3,O4*$O$3,P4*$P$3,Q4*$Q$3,R4*$R$3))-S4","v":0}]
[{"$f":"IF(Prezentace!A7=0,\"\",Prezentace!A7)","v":""},{"$f":"IF(Prezentace!B7=0,\"\",Prezentace!B7)","v":""},{"$f":"Prezentace!D7","v":"P"},{"$f":"IF(Prezentace!F7=0,\"\",Prezentace!F7)","v":"Miroslav"},{"$f":"IF(Prezentace!E7=0,\"\",Prezentace!E7)","v":"Fiala  "},null,null,null,null,null,null,null,null,null,null,null,null,null,null,{"$f":"(SUM(F5*$F$3,G5*$G$3,H5*$H$3,I5*$I$3,J5*$J$3,K5*$K$3,L5*$L$3,M5*$M$3,N5*$N$3,O5*$O$3,P5*$P$3,Q5*$Q$3,R5*$R$3))-S5","v":0}]
[{"$f":"IF(Prezentace!A8=0,\"\",Prezentace!A8)","v":""},{"$f":"IF(Prezentace!B8=0,\"\",Prezentace!B8)","v":""},{"$f":"Prezentace!D8","v":"P"},{"$f":"IF(Prezentace!F8=0,\"\",Prezentace!F8)","v":"František"},{"$f":"IF(Prezentace!E8=0,\"\",Prezentace!E8)","v":"Toman "},null,null,null,null,null,null,null,null,null,null,null,null,null,null,0]
[{"$f":"IF(Prezentace!A9=0,\"\",Prezentace!A9)","v":""},{"$f":"IF(Prezentace!B9=0,\"\",Prezentace!B9)","v":""},{"$f":"Prezentace!D9","v":"P"},{"$f":"IF(Prezentace!F9=0,\"\",Prezentace!F9)","v":"Jiří"},{"$f":"IF(Prezentace!E9=0,\"\",Prezentace!E9)","v":"Švihálek "},null,null,null,null,null,null,null,null,null,null,null,null,null,null,0]
[{"$f":"IF(Prezentace!A10=0,\"\",Prezentace!A10)","v":""},{"$f":"IF(Prezentace!B10=0,\"\",Prezentace!B10)","v":""},{"$f":"Prezentace!D10","v":"R"},{"$f":"IF(Prezentace!F10=0,\"\",Prezentace!F10)","v":"Jiří"},{"$f":"IF(Prezentace!E10=0,\"\",Prezentace!E10)","v":"Švihálek "},null,null,null,null,null,null,null,null,null,null,null,null,null,null,0]
[{"$f":"IF(Prezentace!A11=0,\"\",Prezentace!A11)","v":""},{"$f":"IF(Prezentace!B11=0,\"\",Prezentace!B11)","v":""},{"$f":"Prezentace!D11","v":"P"},{"$f":"IF(Prezentace!F11=0,\"\",Prezentace!F11)","v":"Vladimír"},{"$f":"IF(Prezentace!E11=0,\"\",Prezentace!E11)","v":"VejslíK "},null,null,null,null,null,null,null,null,null,null,null,null,null,null,0]
[{"$f":"IF(Prezentace!A12=0,\"\",Prezentace!A12)","v":""},{"$f":"IF(Prezentace!B12=0,\"\",Prezentace!B12)","v":""},{"$f":"Prezentace!D12","v":"P"},{"$f":"IF(Prezentace!F12=0,\"\",Prezentace!F12)","v":"Milan"},{"$f":"IF(Prezentace!E12=0,\"\",Prezentace!E12)","v":"Kraus "},null,null,null,null,null,null,null,null,null,null,null,null,null,null,0]
[{"$f":"IF(Prezentace!#REF!=0,\"\",Prezentace!#REF!)","v":{"$error":"#REF!"}},{"$f":"IF(Prezentace!#REF!=0,\"\",Prezentace!#REF!)","v":{"$error":"#REF!"}},{"$f":"Prezentace!#REF!","v":{"$error":"#REF!"}},{"$f":"IF(Prezentace!#REF!=0,\"\",Prezentace!#REF!)","v":{"$error":"#REF!"}},{"$f":"IF(Prezentace!#REF!=0,\"\",Prezentace!#REF!)","v":{"$error":"#REF!"}},null,null,null,null,null,null,null,null,null,null,null,null,null,null,0]
[{"$f":"IF(Prezentace!A13=0,\"\",Prezentace!A13)","v":""},{"$f":"IF(Prezentace!B13=0,\"\",Prezentace!B13)","v":""},{"$f":"Prezentace!D13","v":"P"},{"$f":"IF(Prezentace!F13=0,\"\",Prezentace!F13)","v":"Vojtěch"},{"$f":"IF(Prezentace!E13=0,\"\",Prezentace!E13)","v":"Brejžek "},null,null,null,null,null,null,null,null,null,null,null,null,null,null,0]
[{"$f":"IF(Prezentace!A14=0,\"\",Prezentace!A14)","v":""},{"$f":"IF(Prezentace!B14=0,\"\",Prezentace!B14)","v":""},{"$f":"Prezentace!D14","v":"P"},{"$f":"IF(Prezentace!F14=0,\"\",Prezentace!F14)","v":"Karel"},{"$f":"IF(Prezentace!E14=0,\"\",Prezentace!E14)","v":"Získal "},null,null,null,null,null,null,null,null,null,null,null,null,null,null,0]
[{"$f":"IF(Prezentace!A15=0,\"\",Prezentace!A15)","v":""},{"$f":"IF(Prezentace!B15=0,\"\",Prezentace!B15)","v":""},{"$f":"Prezentace!D15","v":"R"},{"$f":"IF(Prezentace!F15=0,\"\",Prezentace!F15)","v":"Karel"},{"$f":"IF(Prezentace!E15=0,\"\",Prezentace!E15)","v":"Získal "},null,null,null,null,null,null,null,null,null,null,null,null,null,null,0]
[{"$f":"IF(Prezentace!A16=0,\"\",Prezentace!A16)","v":""},{"$f":"IF(Prezentace!B16=0,\"\",Prezentace!B16)","v":""},{"$f":"Prezentace!D16","v":"P"},{"$f":"IF(Prezentace!F16=0,\"\",Prezentace!F16)","v":"Marie"},{"$f":"IF(Prezentace!E16=0,\"\",Prezentace!E16)","v":"Žemličková"},null,null,null,null,null,null,null,null,null,null,null,null,null,null,0]
[{"$f":"IF(Prezentace!A17=0,\"\",Prezentace!A17)","v":""},{"$f":"IF(Prezentace!B17=0,\"\",Prezentace!B17)","v":""},{"$f":"Prezentace!D17","v":"P"},{"$f":"IF(Prezentace!F17=0,\"\",Prezentace!F17)","v":"Ladislav"},{"$f":"IF(Prezentace!E17=0,\"\",Prezentace!E17)","v":"Žemlička "},null,null,null,null,null,null,null,null,null,null,null,null,null,null,0]
[{"$f":"IF(Prezentace!A18=0,\"\",Prezentace!A18)","v":""},{"$f":"IF(Prezentace!B18=0,\"\",Prezentace!B18)","v":""},{"$f":"Prezentace!D18","v":"P"},{"$f":"IF(Prezentace!F18=0,\"\",Prezentace!F18)","v":"Jiří"},{"$f":"IF(Prezentace!E18=0,\"\",Prezentace!E18)","v":"Janovský "},null,null,null,null,null,null,null,null,null,null,null,null,null,null,0]
[{"$f":"IF(Prezentace!A19=0,\"\",Prezentace!A19)","v":""},{"$f":"IF(Prezentace!B19=0,\"\",Prezentace!B19)","v":""},{"$f":"Prezentace!D19","v":"P"},{"$f":"IF(Prezentace!F19=0,\"\",Prezentace!F19)","v":"Mojmír"},{"$f":"IF(Prezentace!E19=0,\"\",Prezentace!E19)","v":"Janovský "},null,null,null,null,null,null,null,null,null,null,null,null,null,null,0]
[{"$f":"IF(Prezentace!A20=0,\"\",Prezentace!A20)","v":""},{"$f":"IF(Prezentace!B20=0,\"\",Prezentace!B20)","v":""},{"$f":"Prezentace!D20","v":"P"},{"$f":"IF(Prezentace!F20=0,\"\",Prezentace!F20)","v":"Bohumil"},{"$f":"IF(Prezentace!E20=0,\"\",Prezentace!E20)","v":"Herceg"},null,null,null,null,null,null,null,null,null,null,null,null,null,null,0]
[{"$f":"IF(Prezentace!A21=0,\"\",Prezentace!A21)","v":""},{"$f":"IF(Prezentace!B21=0,\"\",Prezentace!B21)","v":""},{"$f":"Prezentace!D21","v":"P"},{"$f":"IF(Prezentace!F21=0,\"\",Prezentace!F21)","v":"Michal"},{"$f":"IF(Prezentace!E21=0,\"\",Prezentace!E21)","v":"Svoboda"},null,null,null,null,null,null,null,null,null,null,null,null,null,null,0]
[{"$f":"IF(Prezentace!A22=0,\"\",Prezentace!A22)","v":""},{"$f":"IF(Prezentace!B22=0,\"\",Prezentace!B22)","v":""},{"$f":"Prezentace!D22","v":"P"},{"$f":"IF(Prezentace!F22=0,\"\",Prezentace!F22)","v":"Viktor"},{"$f":"IF(Prezentace!E22=0,\"\",Prezentace!E22)","v":"Fuksa  "},null,null,null,null,null,null,null,null,null,null,null,null,null,null,0]
[{"$f":"IF(Prezentace!A23=0,\"\",Prezentace!A23)","v":""},{"$f":"IF(Prezentace!B23=0,\"\",Prezentace!B23)","v":""},{"$f":"Prezentace!D23","v":"P"},{"$f":"IF(Prezentace!F23=0,\"\",Prezentace!F23)","v":"Miroslav"},{"$f":"IF(Prezentace!E23=0,\"\",Prezentace!E23)","v":"Koch   ml."},null,null,null,null,null,null,null,null,null,null,null,null,null,null,0]
[{"$f":"IF(Prezentace!A24=0,\"\",Prezentace!A24)","v":""},{"$f":"IF(Prezentace!B24=0,\"\",Prezentace!B24)","v":""},{"$f":"Prezentace!D24","v":"P"},{"$f":"IF(Prezentace!F24=0,\"\",Prezentace!F24)","v":"Miroslav"},{"$f":"IF(Prezentace!E24=0,\"\",Prezentace!E24)","v":"Koch  st. "},null,null,null,null,null,null,null,null,null,null,null,null,null,null,0]
[{"$f":"IF(Prezentace!A25=0,\"\",Prezentace!A25)","v":""},{"$f":"IF(Prezentace!B25=0,\"\",Prezentace!B25)","v":""},{"$f":"Prezentace!D25","v":"P"},{"$f":"IF(Prezentace!F25=0,\"\",Prezentace!F25)","v":"Jaroslav"},{"$f":"IF(Prezentace!E25=0,\"\",Prezentace!E25)","v":"Kostříž "},null,null,null,null,null,null,null,null,null,null,null,null,null,null,0]
[{"$f":"IF(Prezentace!A26=0,\"\",Prezentace!A26)","v":""},{"$f":"IF(Prezentace!B26=0,\"\",Prezentace!B26)","v":""},{"$f":"Prezentace!D26","v":"P"},{"$f":"IF(Prezentace!F26=0,\"\",Prezentace!F26)","v":"Josef"},{"$f":"IF(Prezentace!E26=0,\"\",Prezentace!E26)","v":"Čekal "},null,null,null,null,null,null,null,null,null,null,null,null,null,null,0]
[{"$f":"IF(Prezentace!A27=0,\"\",Prezentace!A27)","v":""},{"$f":"IF(Prezentace!B27=0,\"\",Prezentace!B27)","v":""},{"$f":"Prezentace!D27","v":"P"},{"$f":"IF(Prezentace!F27=0,\"\",Prezentace!F27)","v":"Miloslav"},{"$f":"IF(Prezentace!E27=0,\"\",Prezentace!E27)","v":"Petržílka"},null,null,null,null,null,null,null,null,null,null,null,null,null,null,0]
[{"$f":"IF(Prezentace!A28=0,\"\",Prezentace!A28)","v":""},{"$f":"IF(Prezentace!B28=0,\"\",Prezentace!B28)","v":""},{"$f":"Prezentace!D28","v":"P"},{"$f":"IF(Prezentace!F28=0,\"\",Prezentace!F28)","v":"Václav"},{"$f":"IF(Prezentace!E28=0,\"\",Prezentace!E28)","v":"Landkammer"},null,null,null,null,null,null,null,null,null,null,null,null,null,null,0]
[{"$f":"IF(Prezentace!A29=0,\"\",Prezentace!A29)","v":""},{"$f":"IF(Prezentace!B29=0,\"\",Prezentace!B29)","v":""},{"$f":"Prezentace!D29","v":"P"},{"$f":"IF(Prezentace!F29=0,\"\",Prezentace!F29)","v":"Albert"},{"$f":"IF(Prezentace!E29=0,\"\",Prezentace!E29)","v":"Wrzecionko"},null,null,null,null,null,null,null,null,null,null,null,null,null,null,0]
[{"$f":"IF(Prezentace!A30=0,\"\",Prezentace!A30)","v":""},{"$f":"IF(Prezentace!B30=0,\"\",Prezentace!B30)","v":""},{"$f":"Prezentace!D30","v":"P"},{"$f":"IF(Prezentace!F30=0,\"\",Prezentace!F30)","v":"Michaela"},{"$f":"IF(Prezentace!E30=0,\"\",Prezentace!E30)","v":"Reisnerová"},null,null,null,null,null,null,null,null,null,null,null,null,null,null,0]
[{"$f":"IF(Prezentace!A31=0,\"\",Prezentace!A31)","v":""},{"$f":"IF(Prezentace!B31=0,\"\",Prezentace!B31)","v":""},{"$f":"Prezentace!D31","v":"P"},{"$f":"IF(Prezentace!F31=0,\"\",Prezentace!F31)","v":"Antonín"},{"$f":"IF(Prezentace!E31=0,\"\",Prezentace!E31)","v":"Urbanec  "},null,null,null,null,null,null,null,null,null,null,null,null,null,null,0]
[{"$f":"IF(Prezentace!#REF!=0,\"\",Prezentace!#REF!)","v":{"$error":"#REF!"}},{"$f":"IF(Prezentace!#REF!=0,\"\",Prezentace!#REF!)","v":{"$error":"#REF!"}},{"$f":"Prezentace!#REF!","v":{"$error":"#REF!"}},{"$f":"IF(Prezentace!#REF!=0,\"\",Prezentace!#REF!)","v":{"$error":"#REF!"}},{"$f":"IF(Prezentace!#REF!=0,\"\",Prezentace!#REF!)","v":{"$error":"#REF!"}},null,null,null,null,null,null,null,null,null,null,null,null,null,null,0]
[{"$f":"IF(Prezentace!#REF!=0,\"\",Prezentace!#REF!)","v":{"$error":"#REF!"}},{"$f":"IF(Prezentace!#REF!=0,\"\",Prezentace!#REF!)","v":{"$error":"#REF!"}},{"$f":"Prezentace!#REF!","v":{"$error":"#REF!"}},{"$f":"IF(Prezentace!#REF!=0,\"\",Prezentace!#REF!)","v":{"$error":"#REF!"}},{"$f":"IF(Prezentace!#REF!=0,\"\",Prezentace!#REF!)","v":{"$error":"#REF!"}},null,null,null,null,null,null,null,null,null,null,null,null,null,null,0]
[{"$f":"IF(Prezentace!#REF!=0,\"\",Prezentace!#REF!)","v":{"$error":"#REF!"}},{"$f":"IF(Prezentace!#REF!=0,\"\",Prezentace!#REF!)","v":{"$error":"#REF!"}},{"$f":"Prezentace!#REF!","v":{"$error":"#REF!"}},{"$f":"IF(Prezentace!#REF!=0,\"\",Prezentace!#REF!)","v":{"$error":"#REF!"}},{"$f":"IF(Prezentace!#REF!=0,\"\",Prezentace!#REF!)","v":{"$error":"#REF!"}},null,null,null,null,null,null,null,null,null,null,null,null,null,null,0]
[{"$f":"IF(Prezentace!#REF!=0,\"\",Prezentace!#REF!)","v":{"$error":"#REF!"}},{"$f":"IF(Prezentace!#REF!=0,\"\",Prezentace!#REF!)","v":{"$error":"#REF!"}},{"$f":"Prezentace!#REF!","v":{"$error":"#REF!"}},{"$f":"IF(Prezentace!#REF!=0,\"\",Prezentace!#REF!)","v":{"$error":"#REF!"}},{"$f":"IF(Prezentace!#REF!=0,\"\",Prezentace!#REF!)","v":{"$error":"#REF!"}},null,null,null,null,null,null,null,null,null,null,null,null,null,null,0]
[{"$f":"IF(Prezentace!#REF!=0,\"\",Prezentace!#REF!)","v":{"$error":"#REF!"}},{"$f":"IF(Prezentace!#REF!=0,\"\",Prezentace!#REF!)","v":{"$error":"#REF!"}},{"$f":"Prezentace!#REF!","v":{"$error":"#REF!"}},{"$f":"IF(Prezentace!#REF!=0,\"\",Prezentace!#REF!)","v":{"$error":"#REF!"}},{"$f":"IF(Prezentace!#REF!=0,\"\",Prezentace!#REF!)","v":{"$error":"#REF!"}},null,null,null,null,null,null,null,null,null,null,null,null,null,null,0]
[{"$f":"IF(Prezentace!#REF!=0,\"\",Prezentace!#REF!)","v":{"$error":"#REF!"}},{"$f":"IF(Prezentace!#REF!=0,\"\",Prezentace!#REF!)","v":{"$error":"#REF!"}},{"$f":"Prezentace!#REF!","v":{"$error":"#REF!"}},{"$f":"IF(Prezentace!#REF!=0,\"\",Prezentace!#REF!)","v":{"$error":"#REF!"}},{"$f":"IF(Prezentace!#REF!=0,\"\",Prezentace!#REF!)","v":{"$error":"#REF!"}},null,null,null,null,null,null,null,null,null,null,null,null,null,null,0]
[{"$f":"IF(Prezentace!#REF!=0,\"\",Prezentace!#REF!)","v":{"$error":"#REF!"}},{"$f":"IF(Prezentace!#REF!=0,\"\",Prezentace!#REF!)","v":{"$error":"#REF!"}},{"$f":"Prezentace!#REF!","v":{"$error":"#REF!"}},{"$f":"IF(Prezentace!#REF!=0,\"\",Prezentace!#REF!)","v":{"$error":"#REF!"}},{"$f":"IF(Prezentace!#REF!=0,\"\",Prezentace!#REF!)","v":{"$error":"#REF!"}},null,null,null,null,null,null,null,null,null,null,null,null,null,null,0]
[{"$f":"IF(Prezentace!#REF!=0,\"\",Prezentace!#REF!)","v":{"$error":"#REF!"}},{"$f":"IF(Prezentace!#REF!=0,\"\",Prezentace!#REF!)","v":{"$error":"#REF!"}},{"$f":"Prezentace!#REF!","v":{"$error":"#REF!"}},{"$f":"IF(Prezentace!#REF!=0,\"\",Prezentace!#REF!)","v":{"$error":"#REF!"}},{"$f":"IF(Prezentace!#REF!=0,\"\",Prezentace!#REF!)","v":{"$error":"#REF!"}},null,null,null,null,null,null,null,null,null,null,null,null,null,null,{"$f":"(SUM(F38*$F$3,G38*$G$3,H38*$H$3,I38*$I$3,J38*$J$3,K38*$K$3,L38*$L$3,M38*$M$3,N38*$N$3,O38*$O$3,P38*$P$3,Q38*$Q$3,R38*$R$3))-S38","v":0}]
[{"$f":"IF(Prezentace!#REF!=0,\"\",Prezentace!#REF!)","v":{"$error":"#REF!"}},{"$f":"IF(Prezentace!#REF!=0,\"\",Prezentace!#REF!)","v":{"$error":"#REF!"}},{"$f":"Prezentace!#REF!","v":{"$error":"#REF!"}},{"$f":"IF(Prezentace!#REF!=0,\"\",Prezentace!#REF!)","v":{"$error":"#REF!"}},{"$f":"IF(Prezentace!#REF!=0,\"\",Prezentace!#REF!)","v":{"$error":"#REF!"}},null,null,null,null,null,null,null,null,null,null,null,null,null,null,0]
[{"$f":"IF(Prezentace!#REF!=0,\"\",Prezentace!#REF!)","v":{"$error":"#REF!"}},{"$f":"IF(Prezentace!#REF!=0,\"\",Prezentace!#REF!)","v":{"$error":"#REF!"}},{"$f":"Prezentace!#REF!","v":{"$error":"#REF!"}},{"$f":"IF(Prezentace!#REF!=0,\"\",Prezentace!#REF!)","v":{"$error":"#REF!"}},{"$f":"IF(Prezentace!#REF!=0,\"\",Prezentace!#REF!)","v":{"$error":"#REF!"}},null,null,null,null,null,null,null,null,null,null,null,null,null,null,0]
[{"$f":"IF(Prezentace!#REF!=0,\"\",Prezentace!#REF!)","v":{"$error":"#REF!"}},{"$f":"IF(Prezentace!#REF!=0,\"\",Prezentace!#REF!)","v":{"$error":"#REF!"}},{"$f":"Prezentace!#REF!","v":{"$error":"#REF!"}},{"$f":"IF(Prezentace!#REF!=0,\"\",Prezentace!#REF!)","v":{"$error":"#REF!"}},{"$f":"IF(Prezentace!#REF!=0,\"\",Prezentace!#REF!)","v":{"$error":"#REF!"}},null,null,null,null,null,null,null,null,null,null,null,null,null,null,0]
[{"$f":"IF(Prezentace!#REF!=0,\"\",Prezentace!#REF!)","v":{"$error":"#REF!"}},{"$f":"IF(Prezentace!#REF!=0,\"\",Prezentace!#REF!)","v":{"$error":"#REF!"}},{"$f":"Prezentace!#REF!","v":{"$error":"#REF!"}},{"$f":"IF(Prezentace!#REF!=0,\"\",Prezentace!#REF!)","v":{"$error":"#REF!"}},{"$f":"IF(Prezentace!#REF!=0,\"\",Prezentace!#REF!)","v":{"$error":"#REF!"}},null,null,null,null,null,null,null,null,null,null,null,null,null,null,0]
[{"$f":"IF(Prezentace!#REF!=0,\"\",Prezentace!#REF!)","v":{"$error":"#REF!"}},{"$f":"IF(Prezentace!#REF!=0,\"\",Prezentace!#REF!)","v":{"$error":"#REF!"}},{"$f":"Prezentace!#REF!","v":{"$error":"#REF!"}},{"$f":"IF(Prezentace!#REF!=0,\"\",Prezentace!#REF!)","v":{"$error":"#REF!"}},{"$f":"IF(Prezentace!#REF!=0,\"\",Prezentace!#REF!)","v":{"$error":"#REF!"}},null,null,null,null,null,null,null,null,null,null,null,null,null,null,0]
[{"$f":"IF(Prezentace!#REF!=0,\"\",Prezentace!#REF!)","v":{"$error":"#REF!"}},{"$f":"IF(Prezentace!#REF!=0,\"\",Prezentace!#REF!)","v":{"$error":"#REF!"}},{"$f":"Prezentace!#REF!","v":{"$error":"#REF!"}},{"$f":"IF(Prezentace!#REF!=0,\"\",Prezentace!#REF!)","v":{"$error":"#REF!"}},{"$f":"IF(Prezentace!#REF!=0,\"\",Prezentace!#REF!)","v":{"$error":"#REF!"}},null,null,null,null,null,null,null,null,null,null,null,null,null,null,0]
[{"$f":"IF(Prezentace!#REF!=0,\"\",Prezentace!#REF!)","v":{"$error":"#REF!"}},{"$f":"IF(Prezentace!#REF!=0,\"\",Prezentace!#REF!)","v":{"$error":"#REF!"}},{"$f":"Prezentace!#REF!","v":{"$error":"#REF!"}},{"$f":"IF(Prezentace!#REF!=0,\"\",Prezentace!#REF!)","v":{"$error":"#REF!"}},{"$f":"IF(Prezentace!#REF!=0,\"\",Prezentace!#REF!)","v":{"$error":"#REF!"}},null,null,null,null,null,null,null,null,null,null,null,null,null,null,0]
[{"$f":"IF(Prezentace!#REF!=0,\"\",Prezentace!#REF!)","v":{"$error":"#REF!"}},{"$f":"IF(Prezentace!#REF!=0,\"\",Prezentace!#REF!)","v":{"$error":"#REF!"}},{"$f":"Prezentace!#REF!","v":{"$error":"#REF!"}},{"$f":"IF(Prezentace!#REF!=0,\"\",Prezentace!#REF!)","v":{"$error":"#REF!"}},{"$f":"IF(Prezentace!#REF!=0,\"\",Prezentace!#REF!)","v":{"$error":"#REF!"}},null,null,null,null,null,null,null,null,null,null,null,null,null,null,0]
[{"$f":"IF(Prezentace!#REF!=0,\"\",Prezentace!#REF!)","v":{"$error":"#REF!"}},{"$f":"IF(Prezentace!#REF!=0,\"\",Prezentace!#REF!)","v":{"$error":"#REF!"}},{"$f":"Prezentace!#REF!","v":{"$error":"#REF!"}},{"$f":"IF(Prezentace!#REF!=0,\"\",Prezentace!#REF!)","v":{"$error":"#REF!"}},{"$f":"IF(Prezentace!#REF!=0,\"\",Prezentace!#REF!)","v":{"$error":"#REF!"}},null,null,null,null,null,null,null,null,null,null,null,null,null,null,0]
[{"$f":"IF(Prezentace!#REF!=0,\"\",Prezentace!#REF!)","v":{"$error":"#REF!"}},{"$f":"IF(Prezentace!#REF!=0,\"\",Prezentace!#REF!)","v":{"$error":"#REF!"}},{"$f":"Prezentace!#REF!","v":{"$error":"#REF!"}},{"$f":"IF(Prezentace!#REF!=0,\"\",Prezentace!#REF!)","v":{"$error":"#REF!"}},{"$f":"IF(Prezentace!#REF!=0,\"\",Prezentace!#REF!)","v":{"$error":"#REF!"}},null,null,null,null,null,null,null,null,null,null,null,null,null,null,0]
[{"$f":"IF(Prezentace!#REF!=0,\"\",Prezentace!#REF!)","v":{"$error":"#REF!"}},{"$f":"IF(Prezentace!#REF!=0,\"\",Prezentace!#REF!)","v":{"$error":"#REF!"}},{"$f":"Prezentace!#REF!","v":{"$error":"#REF!"}},{"$f":"IF(Prezentace!#REF!=0,\"\",Prezentace!#REF!)","v":{"$error":"#REF!"}},{"$f":"IF(Prezentace!#REF!=0,\"\",Prezentace!#REF!)","v":{"$error":"#REF!"}},null,null,null,null,null,null,null,null,null,null,null,null,null,null,0]
[{"$f":"IF(Prezentace!#REF!=0,\"\",Prezentace!#REF!)","v":{"$error":"#REF!"}},{"$f":"IF(Prezentace!#REF!=0,\"\",Prezentace!#REF!)","v":{"$error":"#REF!"}},{"$f":"Prezentace!#REF!","v":{"$error":"#REF!"}},{"$f":"IF(Prezentace!#REF!=0,\"\",Prezentace!#REF!)","v":{"$error":"#REF!"}},{"$f":"IF(Prezentace!#REF!=0,\"\",Prezentace!#REF!)","v":{"$error":"#REF!"}},null,null,null,null,null,null,null,null,null,null,null,null,null,null,0]
[{"$f":"IF(Prezentace!#REF!=0,\"\",Prezentace!#REF!)","v":{"$error":"#REF!"}},{"$f":"IF(Prezentace!#REF!=0,\"\",Prezentace!#REF!)","v":{"$error":"#REF!"}},{"$f":"Prezentace!#REF!","v":{"$error":"#REF!"}},{"$f":"IF(Prezentace!#REF!=0,\"\",Prezentace!#REF!)","v":{"$error":"#REF!"}},{"$f":"IF(Prezentace!#REF!=0,\"\",Prezentace!#REF!)","v":{"$error":"#REF!"}},null,null,null,null,null,null,null,null,null,null,null,null,null,null,0]
[{"$f":"IF(Prezentace!#REF!=0,\"\",Prezentace!#REF!)","v":{"$error":"#REF!"}},{"$f":"IF(Prezentace!#REF!=0,\"\",Prezentace!#REF!)","v":{"$error":"#REF!"}},{"$f":"Prezentace!#REF!","v":{"$error":"#REF!"}},{"$f":"IF(Prezentace!#REF!=0,\"\",Prezentace!#REF!)","v":{"$error":"#REF!"}},{"$f":"IF(Prezentace!#REF!=0,\"\",Prezentace!#REF!)","v":{"$error":"#REF!"}},null,null,null,null,null,null,null,null,null,null,null,null,null,null,0]
[{"$f":"IF(Prezentace!#REF!=0,\"\",Prezentace!#REF!)","v":{"$error":"#REF!"}},{"$f":"IF(Prezentace!#REF!=0,\"\",Prezentace!#REF!)","v":{"$error":"#REF!"}},{"$f":"Prezentace!#REF!","v":{"$error":"#REF!"}},{"$f":"IF(Prezentace!#REF!=0,\"\",Prezentace!#REF!)","v":{"$error":"#REF!"}},{"$f":"IF(Prezentace!#REF!=0,\"\",Prezentace!#REF!)","v":{"$error":"#REF!"}},null,null,null,null,null,null,null,null,null,null,null,null,null,null,0]
[{"$f":"IF(Prezentace!#REF!=0,\"\",Prezentace!#REF!)","v":{"$error":"#REF!"}},{"$f":"IF(Prezentace!#REF!=0,\"\",Prezentace!#REF!)","v":{"$error":"#REF!"}},{"$f":"Prezentace!#REF!","v":{"$error":"#REF!"}},{"$f":"IF(Prezentace!#REF!=0,\"\",Prezentace!#REF!)","v":{"$error":"#REF!"}},{"$f":"IF(Prezentace!#REF!=0,\"\",Prezentace!#REF!)","v":{"$error":"#REF!"}},null,null,null,null,null,null,null,null,null,null,null,null,null,null,0]
[{"$f":"IF(Prezentace!#REF!=0,\"\",Prezentace!#REF!)","v":{"$error":"#REF!"}},{"$f":"IF(Prezentace!#REF!=0,\"\",Prezentace!#REF!)","v":{"$error":"#REF!"}},{"$f":"Prezentace!#REF!","v":{"$error":"#REF!"}},{"$f":"IF(Prezentace!#REF!=0,\"\",Prezentace!#REF!)","v":{"$error":"#REF!"}},{"$f":"IF(Prezentace!#REF!=0,\"\",Prezentace!#REF!)","v":{"$error":"#REF!"}},null,null,null,null,null,null,null,null,null,null,null,null,null,null,0]
[{"$f":"IF(Prezentace!#REF!=0,\"\",Prezentace!#REF!)","v":{"$error":"#REF!"}},{"$f":"IF(Prezentace!#REF!=0,\"\",Prezentace!#REF!)","v":{"$error":"#REF!"}},{"$f":"Prezentace!#REF!","v":{"$error":"#REF!"}},{"$f":"IF(Prezentace!#REF!=0,\"\",Prezentace!#REF!)","v":{"$error":"#REF!"}},{"$f":"IF(Prezentace!#REF!=0,\"\",Prezentace!#REF!)","v":{"$error":"#REF!"}},null,null,null,null,null,null,null,null,null,null,null,null,null,null,0]
[{"$f":"IF(Prezentace!#REF!=0,\"\",Prezentace!#REF!)","v":{"$error":"#REF!"}},{"$f":"IF(Prezentace!#REF!=0,\"\",Prezentace!#REF!)","v":{"$error":"#REF!"}},{"$f":"Prezentace!#REF!","v":{"$error":"#REF!"}},{"$f":"IF(Prezentace!#REF!=0,\"\",Prezentace!#REF!)","v":{"$error":"#REF!"}},{"$f":"IF(Prezentace!#REF!=0,\"\",Prezentace!#REF!)","v":{"$error":"#REF!"}},null,null,null,null,null,null,null,null,null,null,null,null,null,null,0]
[{"$f":"IF(Prezentace!#REF!=0,\"\",Prezentace!#REF!)","v":{"$error":"#REF!"}},{"$f":"IF(Prezentace!#REF!=0,\"\",Prezentace!#REF!)","v":{"$error":"#REF!"}},{"$f":"Prezentace!#REF!","v":{"$error":"#REF!"}},{"$f":"IF(Prezentace!#REF!=0,\"\",Prezentace!#REF!)","v":{"$error":"#REF!"}},{"$f":"IF(Prezentace!#REF!=0,\"\",Prezentace!#REF!)","v":{"$error":"#REF!"}},null,null,null,null,null,null,null,null,null,null,null,null,null,null,0]
[{"$f":"IF(Prezentace!A32=0,\"\",Prezentace!A32)","v":""},{"$f":"IF(Prezentace!B32=0,\"\",Prezentace!B32)","v":""},{"$f":"Prezentace!D32","v":"P"},{"$f":"IF(Prezentace!F32=0,\"\",Prezentace!F32)","v":""},{"$f":"IF(Prezentace!E32=0,\"\",Prezentace!E32)","v":""},null,null,null,null,null,null,null,null,null,null,null,null,null,null,0]
[{"$f":"IF(Prezentace!A33=0,\"\",Prezentace!A33)","v":""},{"$f":"IF(Prezentace!B33=0,\"\",Prezentace!B33)","v":""},{"$f":"Prezentace!D33","v":"P"},{"$f":"IF(Prezentace!F33=0,\"\",Prezentace!F33)","v":""},{"$f":"IF(Prezentace!E33=0,\"\",Prezentace!E33)","v":""},null,null,null,null,null,null,null,null,null,null,null,null,null,null,0]
[{"$f":"IF(Prezentace!A34=0,\"\",Prezentace!A34)","v":""},{"$f":"IF(Prezentace!B34=0,\"\",Prezentace!B34)","v":""},{"$f":"Prezentace!D34","v":"P"},{"$f":"IF(Prezentace!F34=0,\"\",Prezentace!F34)","v":""},{"$f":"IF(Prezentace!E34=0,\"\",Prezentace!E34)","v":""},null,null,null,null,null,null,null,null,null,null,null,null,null,null,0]
[{"$f":"IF(Prezentace!A35=0,\"\",Prezentace!A35)","v":""},{"$f":"IF(Prezentace!B35=0,\"\",Prezentace!B35)","v":""},{"$f":"Prezentace!D35","v":"P"},{"$f":"IF(Prezentace!F35=0,\"\",Prezentace!F35)","v":""},{"$f":"IF(Prezentace!E35=0,\"\",Prezentace!E35)","v":""},null,null,null,null,null,null,null,null,null,null,null,null,null,null,0]
[{"$f":"IF(Prezentace!A36=0,\"\",Prezentace!A36)","v":""},{"$f":"IF(Prezentace!B36=0,\"\",Prezentace!B36)","v":""},{"$f":"Prezentace!D36","v":"P"},{"$f":"IF(Prezentace!F36=0,\"\",Prezentace!F36)","v":""},{"$f":"IF(Prezentace!E36=0,\"\",Prezentace!E36)","v":""},null,null,null,null,null,null,null,null,null,null,null,null,null,null,0]
[{"$f":"IF(Prezentace!A37=0,\"\",Prezentace!A37)","v":""},{"$f":"IF(Prezentace!B37=0,\"\",Prezentace!B37)","v":""},{"$f":"Prezentace!D37","v":"P"},{"$f":"IF(Prezentace!F37=0,\"\",Prezentace!F37)","v":""},{"$f":"IF(Prezentace!E37=0,\"\",Prezentace!E37)","v":""},null,null,null,null,null,null,null,null,null,null,null,null,null,null,0]
[{"$f":"IF(Prezentace!A38=0,\"\",Prezentace!A38)","v":""},{"$f":"IF(Prezentace!B38=0,\"\",Prezentace!B38)","v":""},{"$f":"Prezentace!D38","v":"P"},{"$f":"IF(Prezentace!F38=0,\"\",Prezentace!F38)","v":""},{"$f":"IF(Prezentace!E38=0,\"\",Prezentace!E38)","v":""},null,null,null,null,null,null,null,null,null,null,null,null,null,null,0]
[{"$f":"IF(Prezentace!A39=0,\"\",Prezentace!A39)","v":""},{"$f":"IF(Prezentace!B39=0,\"\",Prezentace!B39)","v":""},{"$f":"Prezentace!D39","v":"P"},{"$f":"IF(Prezentace!F39=0,\"\",Prezentace!F39)","v":""},{"$f":"IF(Prezentace!E39=0,\"\",Prezentace!E39)","v":""},null,null,null,null,null,null,null,null,null,null,null,null,null,null,0]
[{"$f":"IF(Prezentace!A40=0,\"\",Prezentace!A40)","v":""},{"$f":"IF(Prezentace!B40=0,\"\",Prezentace!B40)","v":""},{"$f":"Prezentace!D40","v":"P"},{"$f":"IF(Prezentace!F40=0,\"\",Prezentace!F40)","v":""},{"$f":"IF(Prezentace!E40=0,\"\",Prezentace!E40)","v":""},null,null,null,null,null,null,null,null,null,null,null,null,null,null,0]
[{"$f":"IF(Prezentace!A41=0,\"\",Prezentace!A41)","v":""},{"$f":"IF(Prezentace!B41=0,\"\",Prezentace!B41)","v":""},{"$f":"Prezentace!D41","v":"P"},{"$f":"IF(Prezentace!F41=0,\"\",Prezentace!F41)","v":""},{"$f":"IF(Prezentace!E41=0,\"\",Prezentace!E41)","v":""},null,null,null,null,null,null,null,null,null,null,null,null,null,null,0]
[{"$f":"IF(Prezentace!A42=0,\"\",Prezentace!A42)","v":""},{"$f":"IF(Prezentace!B42=0,\"\",Prezentace!B42)","v":""},{"$f":"Prezentace!D42","v":"P"},{"$f":"IF(Prezentace!F42=0,\"\",Prezentace!F42)","v":""},{"$f":"IF(Prezentace!E42=0,\"\",Prezentace!E42)","v":""},null,null,null,null,null,null,null,null,null,null,null,null,null,null,0]
[{"$f":"IF(Prezentace!A43=0,\"\",Prezentace!A43)","v":""},{"$f":"IF(Prezentace!B43=0,\"\",Prezentace!B43)","v":""},{"$f":"Prezentace!D43","v":"P"},{"$f":"IF(Prezentace!F43=0,\"\",Prezentace!F43)","v":""},{"$f":"IF(Prezentace!E43=0,\"\",Prezentace!E43)","v":""},null,null,null,null,null,null,null,null,null,null,null,null,null,null,0]
[{"$f":"IF(Prezentace!A44=0,\"\",Prezentace!A44)","v":""},{"$f":"IF(Prezentace!B44=0,\"\",Prezentace!B44)","v":""},{"$f":"Prezentace!D44","v":"P"},{"$f":"IF(Prezentace!F44=0,\"\",Prezentace!F44)","v":""},{"$f":"IF(Prezentace!E44=0,\"\",Prezentace!E44)","v":""},null,null,null,null,null,null,null,null,null,null,null,null,null,null,0]
[{"$f":"IF(Prezentace!A45=0,\"\",Prezentace!A45)","v":""},{"$f":"IF(Prezentace!B45=0,\"\",Prezentace!B45)","v":""},{"$f":"Prezentace!D45","v":"P"},{"$f":"IF(Prezentace!F45=0,\"\",Prezentace!F45)","v":""},{"$f":"IF(Prezentace!E45=0,\"\",Prezentace!E45)","v":""},null,null,null,null,null,null,null,null,null,null,null,null,null,null,0]
[{"$f":"IF(Prezentace!A46=0,\"\",Prezentace!A46)","v":""},{"$f":"IF(Prezentace!B46=0,\"\",Prezentace!B46)","v":""},{"$f":"Prezentace!D46","v":"P"},{"$f":"IF(Prezentace!F46=0,\"\",Prezentace!F46)","v":""},{"$f":"IF(Prezentace!E46=0,\"\",Prezentace!E46)","v":""},null,null,null,null,null,null,null,null,null,null,null,null,null,null,0]
[{"$f":"IF(Prezentace!A47=0,\"\",Prezentace!A47)","v":""},{"$f":"IF(Prezentace!B47=0,\"\",Prezentace!B47)","v":""},{"$f":"Prezentace!D47","v":"P"},{"$f":"IF(Prezentace!F47=0,\"\",Prezentace!F47)","v":""},{"$f":"IF(Prezentace!E47=0,\"\",Prezentace!E47)","v":""},null,null,null,null,null,null,null,null,null,null,null,null,null,null,0]
[{"$f":"IF(Prezentace!A48=0,\"\",Prezentace!A48)","v":""},{"$f":"IF(Prezentace!B48=0,\"\",Prezentace!B48)","v":""},{"$f":"Prezentace!D48","v":"P"},{"$f":"IF(Prezentace!F48=0,\"\",Prezentace!F48)","v":""},{"$f":"IF(Prezentace!E48=0,\"\",Prezentace!E48)","v":""},null,null,null,null,null,null,null,null,null,null,null,null,null,null,0]
[{"$f":"IF(Prezentace!A49=0,\"\",Prezentace!A49)","v":""},{"$f":"IF(Prezentace!B49=0,\"\",Prezentace!B49)","v":""},{"$f":"Prezentace!D49","v":"P"},{"$f":"IF(Prezentace!F49=0,\"\",Prezentace!F49)","v":""},{"$f":"IF(Prezentace!E49=0,\"\",Prezentace!E49)","v":""},null,null,null,null,null,null,null,null,null,null,null,null,null,null,0]
[{"$f":"IF(Prezentace!A50=0,\"\",Prezentace!A50)","v":""},{"$f":"IF(Prezentace!B50=0,\"\",Prezentace!B50)","v":""},{"$f":"Prezentace!D50","v":"P"},{"$f":"IF(Prezentace!F50=0,\"\",Prezentace!F50)","v":""},{"$f":"IF(Prezentace!E50=0,\"\",Prezentace!E50)","v":""},null,null,null,null,null,null,null,null,null,null,null,null,null,null,0]
[{"$f":"IF(Prezentace!A51=0,\"\",Prezentace!A51)","v":""},{"$f":"IF(Prezentace!B51=0,\"\",Prezentace!B51)","v":""},{"$f":"Prezentace!D51","v":"P"},{"$f":"IF(Prezentace!F51=0,\"\",Prezentace!F51)","v":""},{"$f":"IF(Prezentace!E51=0,\"\",Prezentace!E51)","v":""},null,null,null,null,null,null,null,null,null,null,null,null,null,null,0]
[{"$f":"IF(Prezentace!A52=0,\"\",Prezentace!A52)","v":""},{"$f":"IF(Prezentace!B52=0,\"\",Prezentace!B52)","v":""},{"$f":"Prezentace!D52","v":"P"},{"$f":"IF(Prezentace!F52=0,\"\",Prezentace!F52)","v":""},{"$f":"IF(Prezentace!E52=0,\"\",Prezentace!E52)","v":""},null,null,null,null,null,null,null,null,null,null,null,null,null,null,0]
[{"$f":"IF(Prezentace!A53=0,\"\",Prezentace!A53)","v":""},{"$f":"IF(Prezentace!B53=0,\"\",Prezentace!B53)","v":""},{"$f":"Prezentace!D53","v":"P"},{"$f":"IF(Prezentace!F53=0,\"\",Prezentace!F53)","v":""},{"$f":"IF(Prezentace!E53=0,\"\",Prezentace!E53)","v":""},null,null,null,null,null,null,null,null,null,null,null,null,null,null,0]
[{"$f":"IF(Prezentace!A54=0,\"\",Prezentace!A54)","v":""},{"$f":"IF(Prezentace!B54=0,\"\",Prezentace!B54)","v":""},{"$f":"Prezentace!D54","v":"P"},{"$f":"IF(Prezentace!F54=0,\"\",Prezentace!F54)","v":""},{"$f":"IF(Prezentace!E54=0,\"\",Prezentace!E54)","v":""},null,null,null,null,null,null,null,null,null,null,null,null,null,null,0]
[{"$f":"IF(Prezentace!A55=0,\"\",Prezentace!A55)","v":""},{"$f":"IF(Prezentace!B55=0,\"\",Prezentace!B55)","v":""},{"$f":"Prezentace!D55","v":"P"},{"$f":"IF(Prezentace!F55=0,\"\",Prezentace!F55)","v":""},{"$f":"IF(Prezentace!E55=0,\"\",Prezentace!E55)","v":""},null,null,null,null,null,null,null,null,null,null,null,null,null,null,0]
[{"$f":"IF(Prezentace!A56=0,\"\",Prezentace!A56)","v":""},{"$f":"IF(Prezentace!B56=0,\"\",Prezentace!B56)","v":""},{"$f":"Prezentace!D56","v":"P"},{"$f":"IF(Prezentace!F56=0,\"\",Prezentace!F56)","v":""},{"$f":"IF(Prezentace!E56=0,\"\",Prezentace!E56)","v":""},null,null,null,null,null,null,null,null,null,null,null,null,null,null,0]
[{"$f":"IF(Prezentace!A57=0,\"\",Prezentace!A57)","v":""},{"$f":"IF(Prezentace!B57=0,\"\",Prezentace!B57)","v":""},{"$f":"Prezentace!D57","v":"P"},{"$f":"IF(Prezentace!F57=0,\"\",Prezentace!F57)","v":""},{"$f":"IF(Prezentace!E57=0,\"\",Prezentace!E57)","v":""},null,null,null,null,null,null,null,null,null,null,null,null,null,null,0]
[{"$f":"IF(Prezentace!A58=0,\"\",Prezentace!A58)","v":""},{"$f":"IF(Prezentace!B58=0,\"\",Prezentace!B58)","v":""},{"$f":"Prezentace!D58","v":"P"},{"$f":"IF(Prezentace!F58=0,\"\",Prezentace!F58)","v":""},{"$f":"IF(Prezentace!E58=0,\"\",Prezentace!E58)","v":""},null,null,null,null,null,null,null,null,null,null,null,null,null,null,0]
[{"$f":"IF(Prezentace!A59=0,\"\",Prezentace!A59)","v":""},{"$f":"IF(Prezentace!B59=0,\"\",Prezentace!B59)","v":""},{"$f":"Prezentace!D59","v":"P"},{"$f":"IF(Prezentace!F59=0,\"\",Prezentace!F59)","v":""},{"$f":"IF(Prezentace!E59=0,\"\",Prezentace!E59)","v":""},null,null,null,null,null,null,null,null,null,null,null,null,null,null,0]
[{"$f":"IF(Prezentace!A60=0,\"\",Prezentace!A60)","v":""},{"$f":"IF(Prezentace!B60=0,\"\",Prezentace!B60)","v":""},{"$f":"Prezentace!D60","v":"P"},{"$f":"IF(Prezentace!F60=0,\"\",Prezentace!F60)","v":""},{"$f":"IF(Prezentace!E60=0,\"\",Prezentace!E60)","v":""},null,null,null,null,null,null,null,null,null,null,null,null,null,null,0]
[{"$f":"IF(Prezentace!A61=0,\"\",Prezentace!A61)","v":""},{"$f":"IF(Prezentace!B61=0,\"\",Prezentace!B61)","v":""},{"$f":"Prezentace!D61","v":"P"},{"$f":"IF(Prezentace!F61=0,\"\",Prezentace!F61)","v":""},{"$f":"IF(Prezentace!E61=0,\"\",Prezentace!E61)","v":""},null,null,null,null,null,null,null,null,null,null,null,null,null,null,0]
[{"$f":"IF(Prezentace!A62=0,\"\",Prezentace!A62)","v":""},{"$f":"IF(Prezentace!B62=0,\"\",Prezentace!B62)","v":""},{"$f":"Prezentace!D62","v":"P"},{"$f":"IF(Prezentace!F62=0,\"\",Prezentace!F62)","v":""},{"$f":"IF(Prezentace!E62=0,\"\",Prezentace!E62)","v":""},null,null,null,null,null,null,null,null,null,null,null,null,null,null,0]
[{"$f":"IF(Prezentace!A63=0,\"\",Prezentace!A63)","v":""},{"$f":"IF(Prezentace!B63=0,\"\",Prezentace!B63)","v":""},{"$f":"Prezentace!D63","v":"P"},{"$f":"IF(Prezentace!F63=0,\"\",Prezentace!F63)","v":""},{"$f":"IF(Prezentace!E63=0,\"\",Prezentace!E63)","v":""},null,null,null,null,null,null,null,null,null,null,null,null,null,null,0]
[{"$f":"IF(Prezentace!A64=0,\"\",Prezentace!A64)","v":""},{"$f":"IF(Prezentace!B64=0,\"\",Prezentace!B64)","v":""},{"$f":"Prezentace!D64","v":"P"},{"$f":"IF(Prezentace!F64=0,\"\",Prezentace!F64)","v":""},{"$f":"IF(Prezentace!E64=0,\"\",Prezentace!E64)","v":""},null,null,null,null,null,null,null,null,null,null,null,null,null,null,0]
[{"$f":"IF(Prezentace!A65=0,\"\",Prezentace!A65)","v":""},{"$f":"IF(Prezentace!B65=0,\"\",Prezentace!B65)","v":""},{"$f":"Prezentace!D65","v":"P"},{"$f":"IF(Prezentace!F65=0,\"\",Prezentace!F65)","v":""},{"$f":"IF(Prezentace!E65=0,\"\",Prezentace!E65)","v":""},null,null,null,null,null,null,null,null,null,null,null,null,null,null,0]
[{"$f":"IF(Prezentace!A66=0,\"\",Prezentace!A66)","v":""},{"$f":"IF(Prezentace!B66=0,\"\",Prezentace!B66)","v":""},{"$f":"Prezentace!D66","v":"P"},{"$f":"IF(Prezentace!F66=0,\"\",Prezentace!F66)","v":""},{"$f":"IF(Prezentace!E66=0,\"\",Prezentace!E66)","v":""},null,null,null,null,null,null,null,null,null,null,null,null,null,null,0]
[{"$f":"IF(Prezentace!A67=0,\"\",Prezentace!A67)","v":""},{"$f":"IF(Prezentace!B67=0,\"\",Prezentace!B67)","v":""},{"$f":"Prezentace!D67","v":"P"},{"$f":"IF(Prezentace!F67=0,\"\",Prezentace!F67)","v":""},{"$f":"IF(Prezentace!E67=0,\"\",Prezentace!E67)","v":""},null,null,null,null,null,null,null,null,null,null,null,null,null,null,0]
[{"$f":"IF(Prezentace!A68=0,\"\",Prezentace!A68)","v":""},{"$f":"IF(Prezentace!B68=0,\"\",Prezentace!B68)","v":""},{"$f":"Prezentace!D68","v":"P"},{"$f":"IF(Prezentace!F68=0,\"\",Prezentace!F68)","v":""},{"$f":"IF(Prezentace!E68=0,\"\",Prezentace!E68)","v":""},null,null,null,null,null,null,null,null,null,null,null,null,null,null,0]
[{"$f":"IF(Prezentace!A69=0,\"\",Prezentace!A69)","v":""},{"$f":"IF(Prezentace!B69=0,\"\",Prezentace!B69)","v":""},{"$f":"Prezentace!D69","v":"P"},{"$f":"IF(Prezentace!F69=0,\"\",Prezentace!F69)","v":""},{"$f":"IF(Prezentace!E69=0,\"\",Prezentace!E69)","v":""},null,null,null,null,null,null,null,null,null,null,null,null,null,null,0]
[{"$f":"IF(Prezentace!A70=0,\"\",Prezentace!A70)","v":""},{"$f":"IF(Prezentace!B70=0,\"\",Prezentace!B70)","v":""},{"$f":"Prezentace!D70","v":"P"},{"$f":"IF(Prezentace!F70=0,\"\",Prezentace!F70)","v":""},{"$f":"IF(Prezentace!E70=0,\"\",Prezentace!E70)","v":""},null,null,null,null,null,null,null,null,null,null,null,null,null,null,0]
[{"$f":"IF(Prezentace!A71=0,\"\",Prezentace!A71)","v":""},{"$f":"IF(Prezentace!B71=0,\"\",Prezentace!B71)","v":""},{"$f":"Prezentace!D71","v":"P"},{"$f":"IF(Prezentace!F71=0,\"\",Prezentace!F71)","v":""},{"$f":"IF(Prezentace!E71=0,\"\",Prezentace!E71)","v":""},null,null,null,null,null,null,null,null,null,null,null,null,null,null,0]
[{"$f":"IF(Prezentace!A72=0,\"\",Prezentace!A72)","v":""},{"$f":"IF(Prezentace!B72=0,\"\",Prezentace!B72)","v":""},{"$f":"Prezentace!D72","v":"P"},{"$f":"IF(Prezentace!F72=0,\"\",Prezentace!F72)","v":""},{"$f":"IF(Prezentace!E72=0,\"\",Prezentace!E72)","v":""},null,null,null,null,null,null,null,null,null,null,null,null,null,null,0]
[{"$f":"IF(Prezentace!A73=0,\"\",Prezentace!A73)","v":""},{"$f":"IF(Prezentace!B73=0,\"\",Prezentace!B73)","v":""},{"$f":"Prezentace!D73","v":"P"},{"$f":"IF(Prezentace!F73=0,\"\",Prezentace!F73)","v":""},{"$f":"IF(Prezentace!E73=0,\"\",Prezentace!E73)","v":""},null,null,null,null,null,null,null,null,null,null,null,null,null,null,0]
[{"$f":"IF(Prezentace!A74=0,\"\",Prezentace!A74)","v":""},{"$f":"IF(Prezentace!B74=0,\"\",Prezentace!B74)","v":""},{"$f":"Prezentace!D74","v":"P"},{"$f":"IF(Prezentace!F74=0,\"\",Prezentace!F74)","v":""},{"$f":"IF(Prezentace!E74=0,\"\",Prezentace!E74)","v":""},null,null,null,null,null,null,null,null,null,null,null,null,null,null,0]
[{"$f":"IF(Prezentace!A75=0,\"\",Prezentace!A75)","v":""},{"$f":"IF(Prezentace!B75=0,\"\",Prezentace!B75)","v":""},{"$f":"Prezentace!D75","v":"P"},{"$f":"IF(Prezentace!F75=0,\"\",Prezentace!F75)","v":""},{"$f":"IF(Prezentace!E75=0,\"\",Prezentace!E75)","v":""},null,null,null,null,null,null,null,null,null,null,null,null,null,null,{"$f":"(SUM(F102*$F$3,G102*$G$3,H102*$H$3,I102*$I$3,J102*$J$3,K102*$K$3,L102*$L$3,M102*$M$3,N102*$N$3,O102*$O$3,P102*$P$3,Q102*$Q$3,R102*$R$3))-S102","v":0}]

{"sheet":"3","index":7,"n_rows":101,"n_cols":22,"rows_kept":101,"cut":false,"hidden":false,"merged":[[0,3,0,20],[0,0,2,0],[0,1,2,1]]}
["Druž.","Kap.",null,"Disciplina 3"]
[]
[null,null,null,null,null,"K","M",1,2,3,4,5,6,7,8,9,10,11,12,"TB","Čas","Součet"]
[{"$f":"IF(Prezentace!A6=0,\"\",Prezentace!A6)","v":""},{"$f":"IF(Prezentace!B6=0,\"\",Prezentace!B6)","v":""},{"$f":"Prezentace!D6","v":"P"},{"$f":"IF(Prezentace!F6=0,\"\",Prezentace!F6)","v":"Milan"},{"$f":"IF(Prezentace!E6=0,\"\",Prezentace!E6)","v":"Matějka st."},20,null,10,10,9,0,0,0,null,null,null,null,null,null,null,31.28,{"$f":"(SUM(F4:T4))-U4","v":17.72}]
[{"$f":"IF(Prezentace!A7=0,\"\",Prezentace!A7)","v":""},{"$f":"IF(Prezentace!B7=0,\"\",Prezentace!B7)","v":""},{"$f":"Prezentace!D7","v":"P"},{"$f":"IF(Prezentace!F7=0,\"\",Prezentace!F7)","v":"Miroslav"},{"$f":"IF(Prezentace!E7=0,\"\",Prezentace!E7)","v":"Fiala  "},40,null,11,10,10,9,0,0,null,null,null,null,null,null,null,25.3,{"$f":"(SUM(F5:T5))-U5","v":54.7}]
[{"$f":"IF(Prezentace!A8=0,\"\",Prezentace!A8)","v":""},{"$f":"IF(Prezentace!B8=0,\"\",Prezentace!B8)","v":""},{"$f":"Prezentace!D8","v":"P"},{"$f":"IF(Prezentace!F8=0,\"\",Prezentace!F8)","v":"František"},{"$f":"IF(Prezentace!E8=0,\"\",Prezentace!E8)","v":"Toman "},40,null,9,9,9,9,8,8,null,null,null,null,null,null,null,22.01,69.989999999999995]
[{"$f":"IF(Prezentace!A9=0,\"\",Prezentace!A9)","v":""},{"$f":"IF(Prezentace!B9=0,\"\",Prezentace!B9)","v":""},{"$f":"Prezentace!D9","v":"P"},{"$f":"IF(Prezentace!F9=0,\"\",Prezentace!F9)","v":"Jiří"},{"$f":"IF(Prezentace!E9=0,\"\",Prezentace!E9)","v":"Švihálek "},40,null,11,10,9,9,9,8,null,null,null,null,null,null,null,23.56,72.44]
[{"$f":"IF(Prezentace!A10=0,\"\",Prezentace!A10)","v":""},{"$f":"IF(Prezentace!B10=0,\"\",Prezentace!B10)","v":""},{"$f":"Prezentace!D10","v":"R"},{"$f":"IF(Prezentace!F10=0,\"\",Prezentace!F10)","v":"Jiří"},{"$f":"IF(Prezentace!E10=0,\"\",Prezentace!E10)","v":"Švihálek "},50,null,10,10,10,9,9,9,null,null,null,null,null,null,null,36.479999999999997,70.52000000000001]
[{"$f":"IF(Prezentace!A11=0,\"\",Prezentace!A11)","v":""},{"$f":"IF(Prezentace!B11=0,\"\",Prezentace!B11)","v":""},{"$f":"Prezentace!D11","v":"P"},{"$f":"IF(Prezentace!F11=0,\"\",Prezentace!F11)","v":"Vladimír"},{"$f":"IF(Prezentace!E11=0,\"\",Prezentace!E11)","v":"VejslíK "},50,null,10,10,10,9,9,8,null,null,null,null,null,null,null,23.35,82.65]
[{"$f":"IF(Prezentace!A12=0,\"\",Prezentace!A12)","v":""},{"$f":"IF(Prezentace!B12=0,\"\",Prezentace!B12)","v":""},{"$f":"Prezentace!D12","v":"P"},{"$f":"IF(Prezentace!F12=0,\"\",Prezentace!F12)","v":"Milan"},{"$f":"IF(Prezentace!E12=0,\"\",Prezentace!E12)","v":"Kraus "},60,null,10,10,10,9,9,9,null,null,null,null,null,null,null,20.14,96.86]
[{"$f":"IF(Prezentace!A13=0,\"\",Prezentace!A13)","v":""},{"$f":"IF(Prezentace!B13=0,\"\",Prezentace!B13)","v":""},{"$f":"Prezentace!D13","v":"P"},{"$f":"IF(Prezentace!F13=0,\"\",Prezentace!F13)","v":"Vojtěch"},{"$f":"IF(Prezentace!E13=0,\"\",Prezentace!E13)","v":"Brejžek "},50,null,11,10,9,8,8,0,null,null,null,null,null,null,null,40.97,55.03]
[{"$f":"IF(Prezentace!A14=0,\"\",Prezentace!A14)","v":""},{"$f":"IF(Prezentace!B14=0,\"\",Prezentace!B14)","v":""},{"$f":"Prezentace!D14","v":"P"},{"$f":"IF(Prezentace!F14=0,\"\",Prezentace!F14)","v":"Karel"},{"$f":"IF(Prezentace!E14=0,\"\",Prezentace!E14)","v":"Získal "},50,null,11,10,9,9,9,9,null,null,null,null,null,null,null,27.6,79.400000000000006]
[{"$f":"IF(Prezentace!A15=0,\"\",Prezentace!A15)","v":""},{"$f":"IF(Prezentace!B15=0,\"\",Prezentace!B15)","v":""},{"$f":"Prezentace!D15","v":"R"},{"$f":"IF(Prezentace!F15=0,\"\",Prezentace!F15)","v":"Karel"},{"$f":"IF(Prezentace!E15=0,\"\",Prezentace!E15)","v":"Získal "},40,null,10,10,9,9,0,0,null,null,null,null,null,null,null,44.17,33.83]
[{"$f":"IF(Prezentace!A16=0,\"\",Prezentace!A16)","v":""},{"$f":"IF(Prezentace!B16=0,\"\",Prezentace!B16)","v":""},{"$f":"Prezentace!D16","v":"P"},{"$f":"IF(Prezentace!F16=0,\"\",Prezentace!F16)","v":"Marie"},{"$f":"IF(Prezentace!E16=0,\"\",Prezentace!E16)","v":"Žemličková"},40,null,11,10,8,8,8,0,null,null,null,null,null,null,null,34.36,50.64]
[{"$f":"IF(Prezentace!A17=0,\"\",Prezentace!A17)","v":""},{"$f":"IF(Prezentace!B17=0,\"\",Prezentace!B17)","v":""},{"$f":"Prezentace!D17","v":"P"},{"$f":"IF(Prezentace!F17=0,\"\",Prezentace!F17)","v":"Ladislav"},{"$f":"IF(Prezentace!E17=0,\"\",Prezentace!E17)","v":"Žemlička "},30,null,11,9,9,9,9,8,null,null,null,null,null,null,null,28.39,56.61]
[{"$f":"IF(Prezentace!A18=0,\"\",Prezentace!A18)","v":""},{"$f":"IF(Prezentace!B18=0,\"\",Prezentace!B18)","v":""},{"$f":"Prezentace!D18","v":"P"},{"$f":"IF(Prezentace!F18=0,\"\",Prezentace!F18)","v":"Jiří"},{"$f":"IF(Prezentace!E18=0,\"\",Prezentace!E18)","v":"Janovský "},20,null,11,10,8,0,0,0,null,null,null,null,null,null,null,35.25,13.75]
[{"$f":"IF(Prezentace!A19=0,\"\",Prezentace!A19)","v":""},{"$f":"IF(Prezentace!B19=0,\"\",Prezentace!B19)","v":""},{"$f":"Prezentace!D19","v":"P"},{"$f":"IF(Prezentace!F19=0,\"\",Prezentace!F19)","v":"Mojmír"},{"$f":"IF(Prezentace!E19=0,\"\",Prezentace!E19)","v":"Janovský "},40,null,10,9,8,8,0,0,null,null,null,null,null,null,null,39.630000000000003,35.369999999999997]
[{"$f":"IF(Prezentace!A20=0,\"\",Prezentace!A20)","v":""},{"$f":"IF(Prezentace!B20=0,\"\",Prezentace!B20)","v":""},{"$f":"Prezentace!D20","v":"P"},{"$f":"IF(Prezentace!F20=0,\"\",Prezentace!F20)","v":"Bohumil"},{"$f":"IF(Prezentace!E20=0,\"\",Prezentace!E20)","v":"Herceg"},50,null,10,9,9,9,8,0,null,null,null,null,null,null,null,26.19,68.81]
[{"$f":"IF(Prezentace!A21=0,\"\",Prezentace!A21)","v":""},{"$f":"IF(Prezentace!B21=0,\"\",Prezentace!B21)","v":""},{"$f":"Prezentace!D21","v":"P"},{"$f":"IF(Prezentace!F21=0,\"\",Prezentace!F21)","v":"Michal"},{"$f":"IF(Prezentace!E21=0,\"\",Prezentace!E21)","v":"Svoboda"},60,null,10,10,10,10,8,9,null,null,null,null,null,null,null,16.2,100.8]
[{"$f":"IF(Prezentace!A22=0,\"\",Prezentace!A22)","v":""},{"$f":"IF(Prezentace!B22=0,\"\",Prezentace!B22)","v":""},{"$f":"Prezentace!D22","v":"P"},{"$f":"IF(Prezentace!F22=0,\"\",Prezentace!F22)","v":"Viktor"},{"$f":"IF(Prezentace!E22=0,\"\",Prezentace!E22)","v":"Fuksa  "},40,null,11,10,9,9,8,8,null,null,null,null,null,null,null,27.19,67.81]
[{"$f":"IF(Prezentace!A23=0,\"\",Prezentace!A23)","v":""},{"$f":"IF(Prezentace!B23=0,\"\",Prezentace!B23)","v":""},{"$f":"Prezentace!D23","v":"P"},{"$f":"IF(Prezentace!F23=0,\"\",Prezentace!F23)","v":"Miroslav"},{"$f":"IF(Prezentace!E23=0,\"\",Prezentace!E23)","v":"Koch   ml."},40,null,10,10,0,9,8,8,null,null,null,null,null,null,null,21.45,63.55]
[{"$f":"IF(Prezentace!A24=0,\"\",Prezentace!A24)","v":""},{"$f":"IF(Prezentace!B24=0,\"\",Prezentace!B24)","v":""},{"$f":"Prezentace!D24","v":"P"},{"$f":"IF(Prezentace!F24=0,\"\",Prezentace!F24)","v":"Miroslav"},{"$f":"IF(Prezentace!E24=0,\"\",Prezentace!E24)","v":"Koch  st. "},50,null,10,10,10,10,10,10,null,null,null,null,null,null,null,27.32,82.68]
[{"$f":"IF(Prezentace!A25=0,\"\",Prezentace!A25)","v":""},{"$f":"IF(Prezentace!B25=0,\"\",Prezentace!B25)","v":""},{"$f":"Prezentace!D25","v":"P"},{"$f":"IF(Prezentace!F25=0,\"\",Prezentace!F25)","v":"Jaroslav"},{"$f":"IF(Prezentace!E25=0,\"\",Prezentace!E25)","v":"Kostříž "},50,null,9,9,9,8,0,0,null,null,null,null,null,null,null,22.91,62.09]
[{"$f":"IF(Prezentace!A26=0,\"\",Prezentace!A26)","v":""},{"$f":"IF(Prezentace!B26=0,\"\",Prezentace!B26)","v":""},{"$f":"Prezentace!D26","v":"P"},{"$f":"IF(Prezentace!F26=0,\"\",Prezentace!F26)","v":"Josef"},{"$f":"IF(Prezentace!E26=0,\"\",Prezentace!E26)","v":"Čekal "},50,null,11,10,9,8,8,0,null,null,null,null,null,null,null,27.54,68.460000000000008]
[{"$f":"IF(Prezentace!A27=0,\"\",Prezentace!A27)","v":""},{"$f":"IF(Prezentace!B27=0,\"\",Prezentace!B27)","v":""},{"$f":"Prezentace!D27","v":"P"},{"$f":"IF(Prezentace!F27=0,\"\",Prezentace!F27)","v":"Miloslav"},{"$f":"IF(Prezentace!E27=0,\"\",Prezentace!E27)","v":"Petržílka"},40,null,10,9,9,9,8,8,null,null,null,null,null,null,null,21.57,71.430000000000007]
[{"$f":"IF(Prezentace!A28=0,\"\",Prezentace!A28)","v":""},{"$f":"IF(Prezentace!B28=0,\"\",Prezentace!B28)","v":""},{"$f":"Prezentace!D28","v":"P"},{"$f":"IF(Prezentace!F28=0,\"\",Prezentace!F28)","v":"Václav"},{"$f":"IF(Prezentace!E28=0,\"\",Prezentace!E28)","v":"Landkammer"},30,null,10,10,10,9,9,0,null,null,null,null,null,null,null,30.94,47.06]
[{"$f":"IF(Prezentace!A29=0,\"\",Prezentace!A29)","v":""},{"$f":"IF(Prezentace!B29=0,\"\",Prezentace!B29)","v":""},{"$f":"Prezentace!D29","v":"P"},{"$f":"IF(Prezentace!F29=0,\"\",Prezentace!F29)","v":"Albert"},{"$f":"IF(Prezentace!E29=0,\"\",Prezentace!E29)","v":"Wrzecionko"},50,null,10,11,10,9,8,0,null,null,null,null,null,null,null,41.68,56.32]
[{"$f":"IF(Prezentace!A30=0,\"\",Prezentace!A30)","v":""},{"$f":"IF(Prezentace!B30=0,\"\",Prezentace!B30)","v":""},{"$f":"Prezentace!D30","v":"P"},{"$f":"IF(Prezentace!F30=0,\"\",Prezentace!F30)","v":"Michaela"},{"$f":"IF(Prezentace!E30=0,\"\",Prezentace!E30)","v":"Reisnerová"},10,null,10,10,9,8,0,0,null,null,null,null,null,null,null,29,18]
[{"$f":"IF(Prezentace!A31=0,\"\",Prezentace!A31)","v":""},{"$f":"IF(Prezentace!B31=0,\"\",Prezentace!B31)","v":""},{"$f":"Prezentace!D31","v":"P"},{"$f":"IF(Prezentace!F31=0,\"\",Prezentace!F31)","v":"Antonín"},{"$f":"IF(Prezentace!E31=0,\"\",Prezentace!E31)","v":"Urbanec  "},30,null,10,9,8,8,8,8,null,null,null,null,null,null,null,27.3,53.7]
[{"$f":"IF(Prezentace!#REF!=0,\"\",Prezentace!#REF!)","v":{"$error":"#REF!"}},{"$f":"IF(Prezentace!#REF!=0,\"\",Prezentace!#REF!)","v":{"$error":"#REF!"}},{"$f":"Prezentace!#REF!","v":{"$error":"#REF!"}},{"$f":"IF(Prezentace!#REF!=0,\"\",Prezentace!#REF!)","v":{"$error":"#REF!"}},{"$f":"IF(Prezentace!#REF!=0,\"\",Prezentace!#REF!)","v":{"$error":"#REF!"}},null,null,null,null,null,null,null,null,null,null,null,null,null,null,null,null,0]
[{"$f":"IF(Prezentace!#REF!=0,\"\",Prezentace!#REF!)","v":{"$error":"#REF!"}},{"$f":"IF(Prezentace!#REF!=0,\"\",Prezentace!#REF!)","v":{"$error":"#REF!"}},{"$f":"Prezentace!#REF!","v":{"$error":"#REF!"}},{"$f":"IF(Prezentace!#REF!=0,\"\",Prezentace!#REF!)","v":{"$error":"#REF!"}},{"$f":"IF(Prezentace!#REF!=0,\"\",Prezentace!#REF!)","v":{"$error":"#REF!"}},null,null,null,null,null,null,null,null,null,null,null,null,null,null,null,null,0]
[{"$f":"IF(Prezentace!#REF!=0,\"\",Prezentace!#REF!)","v":{"$error":"#REF!"}},{"$f":"IF(Prezentace!#REF!=0,\"\",Prezentace!#REF!)","v":{"$error":"#REF!"}},{"$f":"Prezentace!#REF!","v":{"$error":"#REF!"}},{"$f":"IF(Prezentace!#REF!=0,\"\",Prezentace!#REF!)","v":{"$error":"#REF!"}},{"$f":"IF(Prezentace!#REF!=0,\"\",Prezentace!#REF!)","v":{"$error":"#REF!"}},null,null,null,null,null,null,null,null,null,null,null,null,null,null,null,null,0]
[{"$f":"IF(Prezentace!#REF!=0,\"\",Prezentace!#REF!)","v":{"$error":"#REF!"}},{"$f":"IF(Prezentace!#REF!=0,\"\",Prezentace!#REF!)","v":{"$error":"#REF!"}},{"$f":"Prezentace!#REF!","v":{"$error":"#REF!"}},{"$f":"IF(Prezentace!#REF!=0,\"\",Prezentace!#REF!)","v":{"$error":"#REF!"}},{"$f":"IF(Prezentace!#REF!=0,\"\",Prezentace!#REF!)","v":{"$error":"#REF!"}},null,null,null,null,null,null,null,null,null,null,null,null,null,null,null,null,0]
[{"$f":"IF(Prezentace!#REF!=0,\"\",Prezentace!#REF!)","v":{"$error":"#REF!"}},{"$f":"IF(Prezentace!#REF!=0,\"\",Prezentace!#REF!)","v":{"$error":"#REF!"}},{"$f":"Prezentace!#REF!","v":{"$error":"#REF!"}},{"$f":"IF(Prezentace!#REF!=0,\"\",Prezentace!#REF!)","v":{"$error":"#REF!"}},{"$f":"IF(Prezentace!#REF!=0,\"\",Prezentace!#REF!)","v":{"$error":"#REF!"}},null,null,null,null,null,null,null,null,null,null,null,null,null,null,null,null,0]
[{"$f":"IF(Prezentace!#REF!=0,\"\",Prezentace!#REF!)","v":{"$error":"#REF!"}},{"$f":"IF(Prezentace!#REF!=0,\"\",Prezentace!#REF!)","v":{"$error":"#REF!"}},{"$f":"Prezentace!#REF!","v":{"$error":"#REF!"}},{"$f":"IF(Prezentace!#REF!=0,\"\",Prezentace!#REF!)","v":{"$error":"#REF!"}},{"$f":"IF(Prezentace!#REF!=0,\"\",Prezentace!#REF!)","v":{"$error":"#REF!"}},null,null,null,null,null,null,null,null,null,null,null,null,null,null,null,null,0]
[{"$f":"IF(Prezentace!#REF!=0,\"\",Prezentace!#REF!)","v":{"$error":"#REF!"}},{"$f":"IF(Prezentace!#REF!=0,\"\",Prezentace!#REF!)","v":{"$error":"#REF!"}},{"$f":"Prezentace!#REF!","v":{"$error":"#REF!"}},{"$f":"IF(Prezentace!#REF!=0,\"\",Prezentace!#REF!)","v":{"$error":"#REF!"}},{"$f":"IF(Prezentace!#REF!=0,\"\",Prezentace!#REF!)","v":{"$error":"#REF!"}},null,null,null,null,null,null,null,null,null,null,null,null,null,null,null,null,0]
[{"$f":"IF(Prezentace!#REF!=0,\"\",Prezentace!#REF!)","v":{"$error":"#REF!"}},{"$f":"IF(Prezentace!#REF!=0,\"\",Prezentace!#REF!)","v":{"$error":"#REF!"}},{"$f":"Prezentace!#REF!","v":{"$error":"#REF!"}},{"$f":"IF(Prezentace!#REF!=0,\"\",Prezentace!#REF!)","v":{"$error":"#REF!"}},{"$f":"IF(Prezentace!#REF!=0,\"\",Prezentace!#REF!)","v":{"$error":"#REF!"}},null,null,null,null,null,null,null,null,null,null,null,null,null,null,null,null,{"$f":"(SUM(F37:T37))-U37","v":0}]
[{"$f":"IF(Prezentace!#REF!=0,\"\",Prezentace!#REF!)","v":{"$error":"#REF!"}},{"$f":"IF(Prezentace!#REF!=0,\"\",Prezentace!#REF!)","v":{"$error":"#REF!"}},{"$f":"Prezentace!#REF!","v":{"$error":"#REF!"}},{"$f":"IF(Prezentace!#REF!=0,\"\",Prezentace!#REF!)","v":{"$error":"#REF!"}},{"$f":"IF(Prezentace!#REF!=0,\"\",Prezentace!#REF!)","v":{"$error":"#REF!"}},null,null,null,null,null,null,null,null,null,null,null,null,null,null,null,null,0]
[{"$f":"IF(Prezentace!#REF!=0,\"\",Prezentace!#REF!)","v":{"$error":"#REF!"}},{"$f":"IF(Prezentace!#REF!=0,\"\",Prezentace!#REF!)","v":{"$error":"#REF!"}},{"$f":"Prezentace!#REF!","v":{"$error":"#REF!"}},{"$f":"IF(Prezentace!#REF!=0,\"\",Prezentace!#REF!)","v":{"$error":"#REF!"}},{"$f":"IF(Prezentace!#REF!=0,\"\",Prezentace!#REF!)","v":{"$error":"#REF!"}},null,null,null,null,null,null,null,null,null,null,null,null,null,null,null,null,0]
[{"$f":"IF(Prezentace!#REF!=0,\"\",Prezentace!#REF!)","v":{"$error":"#REF!"}},{"$f":"IF(Prezentace!#REF!=0,\"\",Prezentace!#REF!)","v":{"$error":"#REF!"}},{"$f":"Prezentace!#REF!","v":{"$error":"#REF!"}},{"$f":"IF(Prezentace!#REF!=0,\"\",Prezentace!#REF!)","v":{"$error":"#REF!"}},{"$f":"IF(Prezentace!#REF!=0,\"\",Prezentace!#REF!)","v":{"$error":"#REF!"}},null,null,null,null,null,null,null,null,null,null,null,null,null,null,null,null,0]
[{"$f":"IF(Prezentace!#REF!=0,\"\",Prezentace!#REF!)","v":{"$error":"#REF!"}},{"$f":"IF(Prezentace!#REF!=0,\"\",Prezentace!#REF!)","v":{"$error":"#REF!"}},{"$f":"Prezentace!#REF!","v":{"$error":"#REF!"}},{"$f":"IF(Prezentace!#REF!=0,\"\",Prezentace!#REF!)","v":{"$error":"#REF!"}},{"$f":"IF(Prezentace!#REF!=0,\"\",Prezentace!#REF!)","v":{"$error":"#REF!"}},null,null,null,null,null,null,null,null,null,null,null,null,null,null,null,null,0]
[{"$f":"IF(Prezentace!#REF!=0,\"\",Prezentace!#REF!)","v":{"$error":"#REF!"}},{"$f":"IF(Prezentace!#REF!=0,\"\",Prezentace!#REF!)","v":{"$error":"#REF!"}},{"$f":"Prezentace!#REF!","v":{"$error":"#REF!"}},{"$f":"IF(Prezentace!#REF!=0,\"\",Prezentace!#REF!)","v":{"$error":"#REF!"}},{"$f":"IF(Prezentace!#REF!=0,\"\",Prezentace!#REF!)","v":{"$error":"#REF!"}},null,null,null,null,null,null,null,null,null,null,null,null,null,null,null,null,0]
[{"$f":"IF(Prezentace!#REF!=0,\"\",Prezentace!#REF!)","v":{"$error":"#REF!"}},{"$f":"IF(Prezentace!#REF!=0,\"\",Prezentace!#REF!)","v":{"$error":"#REF!"}},{"$f":"Prezentace!#REF!","v":{"$error":"#REF!"}},{"$f":"IF(Prezentace!#REF!=0,\"\",Prezentace!#REF!)","v":{"$error":"#REF!"}},{"$f":"IF(Prezentace!#REF!=0,\"\",Prezentace!#REF!)","v":{"$error":"#REF!"}},null,null,null,null,null,null,null,null,null,null,null,null,null,null,null,null,0]
[{"$f":"IF(Prezentace!#REF!=0,\"\",Prezentace!#REF!)","v":{"$error":"#REF!"}},{"$f":"IF(Prezentace!#REF!=0,\"\",Prezentace!#REF!)","v":{"$error":"#REF!"}},{"$f":"Prezentace!#REF!","v":{"$error":"#REF!"}},{"$f":"IF(Prezentace!#REF!=0,\"\",Prezentace!#REF!)","v":{"$error":"#REF!"}},{"$f":"IF(Prezentace!#REF!=0,\"\",Prezentace!#REF!)","v":{"$error":"#REF!"}},null,null,null,null,null,null,null,null,null,null,null,null,null,null,null,null,0]
[{"$f":"IF(Prezentace!#REF!=0,\"\",Prezentace!#REF!)","v":{"$error":"#REF!"}},{"$f":"IF(Prezentace!#REF!=0,\"\",Prezentace!#REF!)","v":{"$error":"#REF!"}},{"$f":"Prezentace!#REF!","v":{"$error":"#REF!"}},{"$f":"IF(Prezentace!#REF!=0,\"\",Prezentace!#REF!)","v":{"$error":"#REF!"}},{"$f":"IF(Prezentace!#REF!=0,\"\",Prezentace!#REF!)","v":{"$error":"#REF!"}},null,null,null,null,null,null,null,null,null,null,null,null,null,null,null,null,0]
[{"$f":"IF(Prezentace!#REF!=0,\"\",Prezentace!#REF!)","v":{"$error":"#REF!"}},{"$f":"IF(Prezentace!#REF!=0,\"\",Prezentace!#REF!)","v":{"$error":"#REF!"}},{"$f":"Prezentace!#REF!","v":{"$error":"#REF!"}},{"$f":"IF(Prezentace!#REF!=0,\"\",Prezentace!#REF!)","v":{"$error":"#REF!"}},{"$f":"IF(Prezentace!#REF!=0,\"\",Prezentace!#REF!)","v":{"$error":"#REF!"}},null,null,null,null,null,null,null,null,null,null,null,null,null,null,null,null,0]
[{"$f":"IF(Prezentace!#REF!=0,\"\",Prezentace!#REF!)","v":{"$error":"#REF!"}},{"$f":"IF(Prezentace!#REF!=0,\"\",Prezentace!#REF!)","v":{"$error":"#REF!"}},{"$f":"Prezentace!#REF!","v":{"$error":"#REF!"}},{"$f":"IF(Prezentace!#REF!=0,\"\",Prezentace!#REF!)","v":{"$error":"#REF!"}},{"$f":"IF(Prezentace!#REF!=0,\"\",Prezentace!#REF!)","v":{"$error":"#REF!"}},null,null,null,null,null,null,null,null,null,null,null,null,null,null,null,null,0]
[{"$f":"IF(Prezentace!#REF!=0,\"\",Prezentace!#REF!)","v":{"$error":"#REF!"}},{"$f":"IF(Prezentace!#REF!=0,\"\",Prezentace!#REF!)","v":{"$error":"#REF!"}},{"$f":"Prezentace!#REF!","v":{"$error":"#REF!"}},{"$f":"IF(Prezentace!#REF!=0,\"\",Prezentace!#REF!)","v":{"$error":"#REF!"}},{"$f":"IF(Prezentace!#REF!=0,\"\",Prezentace!#REF!)","v":{"$error":"#REF!"}},null,null,null,null,null,null,null,null,null,null,null,null,null,null,null,null,0]
[{"$f":"IF(Prezentace!#REF!=0,\"\",Prezentace!#REF!)","v":{"$error":"#REF!"}},{"$f":"IF(Prezentace!#REF!=0,\"\",Prezentace!#REF!)","v":{"$error":"#REF!"}},{"$f":"Prezentace!#REF!","v":{"$error":"#REF!"}},{"$f":"IF(Prezentace!#REF!=0,\"\",Prezentace!#REF!)","v":{"$error":"#REF!"}},{"$f":"IF(Prezentace!#REF!=0,\"\",Prezentace!#REF!)","v":{"$error":"#REF!"}},null,null,null,null,null,null,null,null,null,null,null,null,null,null,null,null,0]
[{"$f":"IF(Prezentace!#REF!=0,\"\",Prezentace!#REF!)","v":{"$error":"#REF!"}},{"$f":"IF(Prezentace!#REF!=0,\"\",Prezentace!#REF!)","v":{"$error":"#REF!"}},{"$f":"Prezentace!#REF!","v":{"$error":"#REF!"}},{"$f":"IF(Prezentace!#REF!=0,\"\",Prezentace!#REF!)","v":{"$error":"#REF!"}},{"$f":"IF(Prezentace!#REF!=0,\"\",Prezentace!#REF!)","v":{"$error":"#REF!"}},null,null,null,null,null,null,null,null,null,null,null,null,null,null,null,null,0]
[{"$f":"IF(Prezentace!#REF!=0,\"\",Prezentace!#REF!)","v":{"$error":"#REF!"}},{"$f":"IF(Prezentace!#REF!=0,\"\",Prezentace!#REF!)","v":{"$error":"#REF!"}},{"$f":"Prezentace!#REF!","v":{"$error":"#REF!"}},{"$f":"IF(Prezentace!#REF!=0,\"\",Prezentace!#REF!)","v":{"$error":"#REF!"}},{"$f":"IF(Prezentace!#REF!=0,\"\",Prezentace!#REF!)","v":{"$error":"#REF!"}},null,null,null,null,null,null,null,null,null,null,null,null,null,null,null,null,0]
[{"$f":"IF(Prezentace!#REF!=0,\"\",Prezentace!#REF!)","v":{"$error":"#REF!"}},{"$f":"IF(Prezentace!#REF!=0,\"\",Prezentace!#REF!)","v":{"$error":"#REF!"}},{"$f":"Prezentace!#REF!","v":{"$error":"#REF!"}},{"$f":"IF(Prezentace!#REF!=0,\"\",Prezentace!#REF!)","v":{"$error":"#REF!"}},{"$f":"IF(Prezentace!#REF!=0,\"\",Prezentace!#REF!)","v":{"$error":"#REF!"}},null,null,null,null,null,null,null,null,null,null,null,null,null,null,null,null,0]
[{"$f":"IF(Prezentace!#REF!=0,\"\",Prezentace!#REF!)","v":{"$error":"#REF!"}},{"$f":"IF(Prezentace!#REF!=0,\"\",Prezentace!#REF!)","v":{"$error":"#REF!"}},{"$f":"Prezentace!#REF!","v":{"$error":"#REF!"}},{"$f":"IF(Prezentace!#REF!=0,\"\",Prezentace!#REF!)","v":{"$error":"#REF!"}},{"$f":"IF(Prezentace!#REF!=0,\"\",Prezentace!#REF!)","v":{"$error":"#REF!"}},null,null,null,null,null,null,null,null,null,null,null,null,null,null,null,null,0]
[{"$f":"IF(Prezentace!#REF!=0,\"\",Prezentace!#REF!)","v":{"$error":"#REF!"}},{"$f":"IF(Prezentace!#REF!=0,\"\",Prezentace!#REF!)","v":{"$error":"#REF!"}},{"$f":"Prezentace!#REF!","v":{"$error":"#REF!"}},{"$f":"IF(Prezentace!#REF!=0,\"\",Prezentace!#REF!)","v":{"$error":"#REF!"}},{"$f":"IF(Prezentace!#REF!=0,\"\",Prezentace!#REF!)","v":{"$error":"#REF!"}},null,null,null,null,null,null,null,null,null,null,null,null,null,null,null,null,0]
[{"$f":"IF(Prezentace!#REF!=0,\"\",Prezentace!#REF!)","v":{"$error":"#REF!"}},{"$f":"IF(Prezentace!#REF!=0,\"\",Prezentace!#REF!)","v":{"$error":"#REF!"}},{"$f":"Prezentace!#REF!","v":{"$error":"#REF!"}},{"$f":"IF(Prezentace!#REF!=0,\"\",Prezentace!#REF!)","v":{"$error":"#REF!"}},{"$f":"IF(Prezentace!#REF!=0,\"\",Prezentace!#REF!)","v":{"$error":"#REF!"}},null,null,null,null,null,null,null,null,null,null,null,null,null,null,null,null,0]
[{"$f":"IF(Prezentace!#REF!=0,\"\",Prezentace!#REF!)","v":{"$error":"#REF!"}},{"$f":"IF(Prezentace!#REF!=0,\"\",Prezentace!#REF!)","v":{"$error":"#REF!"}},{"$f":"Prezentace!#REF!","v":{"$error":"#REF!"}},{"$f":"IF(Prezentace!#REF!=0,\"\",Prezentace!#REF!)","v":{"$error":"#REF!"}},{"$f":"IF(Prezentace!#REF!=0,\"\",Prezentace!#REF!)","v":{"$error":"#REF!"}},null,null,null,null,null,null,null,null,null,null,null,null,null,null,null,null,0]
[{"$f":"IF(Prezentace!#REF!=0,\"\",Prezentace!#REF!)","v":{"$error":"#REF!"}},{"$f":"IF(Prezentace!#REF!=0,\"\",Prezentace!#REF!)","v":{"$error":"#REF!"}},{"$f":"Prezentace!#REF!","v":{"$error":"#REF!"}},{"$f":"IF(Prezentace!#REF!=0,\"\",Prezentace!#REF!)","v":{"$error":"#REF!"}},{"$f":"IF(Prezentace!#REF!=0,\"\",Prezentace!#REF!)","v":{"$error":"#REF!"}},null,null,null,null,null,null,null,null,null,null,null,null,null,null,null,null,0]
[{"$f":"IF(Prezentace!A32=0,\"\",Prezentace!A32)","v":""},{"$f":"IF(Prezentace!B32=0,\"\",Prezentace!B32)","v":""},{"$f":"Prezentace!D32","v":"P"},{"$f":"IF(Prezentace!F32=0,\"\",Prezentace!F32)","v":""},{"$f":"IF(Prezentace!E32=0,\"\",Prezentace!E32)","v":""},null,null,null,null,null,null,null,null,null,null,null,null,null,null,null,null,0]
[{"$f":"IF(Prezentace!A33=0,\"\",Prezentace!A33)","v":""},{"$f":"IF(Prezentace!B33=0,\"\",Prezentace!B33)","v":""},{"$f":"Prezentace!D33","v":"P"},{"$f":"IF(Prezentace!F33=0,\"\",Prezentace!F33)","v":""},{"$f":"IF(Prezentace!E33=0,\"\",Prezentace!E33)","v":""},null,null,null,null,null,null,null,null,null,null,null,null,null,null,null,null,0]
[{"$f":"IF(Prezentace!A34=0,\"\",Prezentace!A34)","v":""},{"$f":"IF(Prezentace!B34=0,\"\",Prezentace!B34)","v":""},{"$f":"Prezentace!D34","v":"P"},{"$f":"IF(Prezentace!F34=0,\"\",Prezentace!F34)","v":""},{"$f":"IF(Prezentace!E34=0,\"\",Prezentace!E34)","v":""},null,null,null,null,null,null,null,null,null,null,null,null,null,null,null,null,0]
[{"$f":"IF(Prezentace!A35=0,\"\",Prezentace!A35)","v":""},{"$f":"IF(Prezentace!B35=0,\"\",Prezentace!B35)","v":""},{"$f":"Prezentace!D35","v":"P"},{"$f":"IF(Prezentace!F35=0,\"\",Prezentace!F35)","v":""},{"$f":"IF(Prezentace!E35=0,\"\",Prezentace!E35)","v":""},null,null,null,null,null,null,null,null,null,null,null,null,null,null,null,null,0]
[{"$f":"IF(Prezentace!A36=0,\"\",Prezentace!A36)","v":""},{"$f":"IF(Prezentace!B36=0,\"\",Prezentace!B36)","v":""},{"$f":"Prezentace!D36","v":"P"},{"$f":"IF(Prezentace!F36=0,\"\",Prezentace!F36)","v":""},{"$f":"IF(Prezentace!E36=0,\"\",Prezentace!E36)","v":""},null,null,null,null,null,null,null,null,null,null,null,null,null,null,null,null,0]
[{"$f":"IF(Prezentace!A37=0,\"\",Prezentace!A37)","v":""},{"$f":"IF(Prezentace!B37=0,\"\",Prezentace!B37)","v":""},{"$f":"Prezentace!D37","v":"P"},{"$f":"IF(Prezentace!F37=0,\"\",Prezentace!F37)","v":""},{"$f":"IF(Prezentace!E37=0,\"\",Prezentace!E37)","v":""},null,null,null,null,null,null,null,null,null,null,null,null,null,null,null,null,0]
[{"$f":"IF(Prezentace!A38=0,\"\",Prezentace!A38)","v":""},{"$f":"IF(Prezentace!B38=0,\"\",Prezentace!B38)","v":""},{"$f":"Prezentace!D38","v":"P"},{"$f":"IF(Prezentace!F38=0,\"\",Prezentace!F38)","v":""},{"$f":"IF(Prezentace!E38=0,\"\",Prezentace!E38)","v":""},null,null,null,null,null,null,null,null,null,null,null,null,null,null,null,null,0]
[{"$f":"IF(Prezentace!A39=0,\"\",Prezentace!A39)","v":""},{"$f":"IF(Prezentace!B39=0,\"\",Prezentace!B39)","v":""},{"$f":"Prezentace!D39","v":"P"},{"$f":"IF(Prezentace!F39=0,\"\",Prezentace!F39)","v":""},{"$f":"IF(Prezentace!E39=0,\"\",Prezentace!E39)","v":""},null,null,null,null,null,null,null,null,null,null,null,null,null,null,null,null,0]
[{"$f":"IF(Prezentace!A40=0,\"\",Prezentace!A40)","v":""},{"$f":"IF(Prezentace!B40=0,\"\",Prezentace!B40)","v":""},{"$f":"Prezentace!D40","v":"P"},{"$f":"IF(Prezentace!F40=0,\"\",Prezentace!F40)","v":""},{"$f":"IF(Prezentace!E40=0,\"\",Prezentace!E40)","v":""},null,null,null,null,null,null,null,null,null,null,null,null,null,null,null,null,0]
[{"$f":"IF(Prezentace!A41=0,\"\",Prezentace!A41)","v":""},{"$f":"IF(Prezentace!B41=0,\"\",Prezentace!B41)","v":""},{"$f":"Prezentace!D41","v":"P"},{"$f":"IF(Prezentace!F41=0,\"\",Prezentace!F41)","v":""},{"$f":"IF(Prezentace!E41=0,\"\",Prezentace!E41)","v":""},null,null,null,null,null,null,null,null,null,null,null,null,null,null,null,null,0]
[{"$f":"IF(Prezentace!A42=0,\"\",Prezentace!A42)","v":""},{"$f":"IF(Prezentace!B42=0,\"\",Prezentace!B42)","v":""},{"$f":"Prezentace!D42","v":"P"},{"$f":"IF(Prezentace!F42=0,\"\",Prezentace!F42)","v":""},{"$f":"IF(Prezentace!E42=0,\"\",Prezentace!E42)","v":""},null,null,null,null,null,null,null,null,null,null,null,null,null,null,null,null,0]
[{"$f":"IF(Prezentace!A43=0,\"\",Prezentace!A43)","v":""},{"$f":"IF(Prezentace!B43=0,\"\",Prezentace!B43)","v":""},{"$f":"Prezentace!D43","v":"P"},{"$f":"IF(Prezentace!F43=0,\"\",Prezentace!F43)","v":""},{"$f":"IF(Prezentace!E43=0,\"\",Prezentace!E43)","v":""},null,null,null,null,null,null,null,null,null,null,null,null,null,null,null,null,0]
[{"$f":"IF(Prezentace!A44=0,\"\",Prezentace!A44)","v":""},{"$f":"IF(Prezentace!B44=0,\"\",Prezentace!B44)","v":""},{"$f":"Prezentace!D44","v":"P"},{"$f":"IF(Prezentace!F44=0,\"\",Prezentace!F44)","v":""},{"$f":"IF(Prezentace!E44=0,\"\",Prezentace!E44)","v":""},null,null,null,null,null,null,null,null,null,null,null,null,null,null,null,null,0]
[{"$f":"IF(Prezentace!A45=0,\"\",Prezentace!A45)","v":""},{"$f":"IF(Prezentace!B45=0,\"\",Prezentace!B45)","v":""},{"$f":"Prezentace!D45","v":"P"},{"$f":"IF(Prezentace!F45=0,\"\",Prezentace!F45)","v":""},{"$f":"IF(Prezentace!E45=0,\"\",Prezentace!E45)","v":""},null,null,null,null,null,null,null,null,null,null,null,null,null,null,null,null,0]
[{"$f":"IF(Prezentace!A46=0,\"\",Prezentace!A46)","v":""},{"$f":"IF(Prezentace!B46=0,\"\",Prezentace!B46)","v":""},{"$f":"Prezentace!D46","v":"P"},{"$f":"IF(Prezentace!F46=0,\"\",Prezentace!F46)","v":""},{"$f":"IF(Prezentace!E46=0,\"\",Prezentace!E46)","v":""},null,null,null,null,null,null,null,null,null,null,null,null,null,null,null,null,0]
[{"$f":"IF(Prezentace!A47=0,\"\",Prezentace!A47)","v":""},{"$f":"IF(Prezentace!B47=0,\"\",Prezentace!B47)","v":""},{"$f":"Prezentace!D47","v":"P"},{"$f":"IF(Prezentace!F47=0,\"\",Prezentace!F47)","v":""},{"$f":"IF(Prezentace!E47=0,\"\",Prezentace!E47)","v":""},null,null,null,null,null,null,null,null,null,null,null,null,null,null,null,null,0]
[{"$f":"IF(Prezentace!A48=0,\"\",Prezentace!A48)","v":""},{"$f":"IF(Prezentace!B48=0,\"\",Prezentace!B48)","v":""},{"$f":"Prezentace!D48","v":"P"},{"$f":"IF(Prezentace!F48=0,\"\",Prezentace!F48)","v":""},{"$f":"IF(Prezentace!E48=0,\"\",Prezentace!E48)","v":""},null,null,null,null,null,null,null,null,null,null,null,null,null,null,null,null,0]
[{"$f":"IF(Prezentace!A49=0,\"\",Prezentace!A49)","v":""},{"$f":"IF(Prezentace!B49=0,\"\",Prezentace!B49)","v":""},{"$f":"Prezentace!D49","v":"P"},{"$f":"IF(Prezentace!F49=0,\"\",Prezentace!F49)","v":""},{"$f":"IF(Prezentace!E49=0,\"\",Prezentace!E49)","v":""},null,null,null,null,null,null,null,null,null,null,null,null,null,null,null,null,0]
[{"$f":"IF(Prezentace!A50=0,\"\",Prezentace!A50)","v":""},{"$f":"IF(Prezentace!B50=0,\"\",Prezentace!B50)","v":""},{"$f":"Prezentace!D50","v":"P"},{"$f":"IF(Prezentace!F50=0,\"\",Prezentace!F50)","v":""},{"$f":"IF(Prezentace!E50=0,\"\",Prezentace!E50)","v":""},null,null,null,null,null,null,null,null,null,null,null,null,null,null,null,null,0]
[{"$f":"IF(Prezentace!A51=0,\"\",Prezentace!A51)","v":""},{"$f":"IF(Prezentace!B51=0,\"\",Prezentace!B51)","v":""},{"$f":"Prezentace!D51","v":"P"},{"$f":"IF(Prezentace!F51=0,\"\",Prezentace!F51)","v":""},{"$f":"IF(Prezentace!E51=0,\"\",Prezentace!E51)","v":""},null,null,null,null,null,null,null,null,null,null,null,null,null,null,null,null,0]
[{"$f":"IF(Prezentace!A52=0,\"\",Prezentace!A52)","v":""},{"$f":"IF(Prezentace!B52=0,\"\",Prezentace!B52)","v":""},{"$f":"Prezentace!D52","v":"P"},{"$f":"IF(Prezentace!F52=0,\"\",Prezentace!F52)","v":""},{"$f":"IF(Prezentace!E52=0,\"\",Prezentace!E52)","v":""},null,null,null,null,null,null,null,null,null,null,null,null,null,null,null,null,0]
[{"$f":"IF(Prezentace!A53=0,\"\",Prezentace!A53)","v":""},{"$f":"IF(Prezentace!B53=0,\"\",Prezentace!B53)","v":""},{"$f":"Prezentace!D53","v":"P"},{"$f":"IF(Prezentace!F53=0,\"\",Prezentace!F53)","v":""},{"$f":"IF(Prezentace!E53=0,\"\",Prezentace!E53)","v":""},null,null,null,null,null,null,null,null,null,null,null,null,null,null,null,null,0]
[{"$f":"IF(Prezentace!A54=0,\"\",Prezentace!A54)","v":""},{"$f":"IF(Prezentace!B54=0,\"\",Prezentace!B54)","v":""},{"$f":"Prezentace!D54","v":"P"},{"$f":"IF(Prezentace!F54=0,\"\",Prezentace!F54)","v":""},{"$f":"IF(Prezentace!E54=0,\"\",Prezentace!E54)","v":""},null,null,null,null,null,null,null,null,null,null,null,null,null,null,null,null,0]
[{"$f":"IF(Prezentace!A55=0,\"\",Prezentace!A55)","v":""},{"$f":"IF(Prezentace!B55=0,\"\",Prezentace!B55)","v":""},{"$f":"Prezentace!D55","v":"P"},{"$f":"IF(Prezentace!F55=0,\"\",Prezentace!F55)","v":""},{"$f":"IF(Prezentace!E55=0,\"\",Prezentace!E55)","v":""},null,null,null,null,null,null,null,null,null,null,null,null,null,null,null,null,0]
[{"$f":"IF(Prezentace!A56=0,\"\",Prezentace!A56)","v":""},{"$f":"IF(Prezentace!B56=0,\"\",Prezentace!B56)","v":""},{"$f":"Prezentace!D56","v":"P"},{"$f":"IF(Prezentace!F56=0,\"\",Prezentace!F56)","v":""},{"$f":"IF(Prezentace!E56=0,\"\",Prezentace!E56)","v":""},null,null,null,null,null,null,null,null,null,null,null,null,null,null,null,null,0]
[{"$f":"IF(Prezentace!A57=0,\"\",Prezentace!A57)","v":""},{"$f":"IF(Prezentace!B57=0,\"\",Prezentace!B57)","v":""},{"$f":"Prezentace!D57","v":"P"},{"$f":"IF(Prezentace!F57=0,\"\",Prezentace!F57)","v":""},{"$f":"IF(Prezentace!E57=0,\"\",Prezentace!E57)","v":""},null,null,null,null,null,null,null,null,null,null,null,null,null,null,null,null,0]
[{"$f":"IF(Prezentace!A58=0,\"\",Prezentace!A58)","v":""},{"$f":"IF(Prezentace!B58=0,\"\",Prezentace!B58)","v":""},{"$f":"Prezentace!D58","v":"P"},{"$f":"IF(Prezentace!F58=0,\"\",Prezentace!F58)","v":""},{"$f":"IF(Prezentace!E58=0,\"\",Prezentace!E58)","v":""},null,null,null,null,null,null,null,null,null,null,null,null,null,null,null,null,0]
[{"$f":"IF(Prezentace!A59=0,\"\",Prezentace!A59)","v":""},{"$f":"IF(Prezentace!B59=0,\"\",Prezentace!B59)","v":""},{"$f":"Prezentace!D59","v":"P"},{"$f":"IF(Prezentace!F59=0,\"\",Prezentace!F59)","v":""},{"$f":"IF(Prezentace!E59=0,\"\",Prezentace!E59)","v":""},null,null,null,null,null,null,null,null,null,null,null,null,null,null,null,null,0]
[{"$f":"IF(Prezentace!A60=0,\"\",Prezentace!A60)","v":""},{"$f":"IF(Prezentace!B60=0,\"\",Prezentace!B60)","v":""},{"$f":"Prezentace!D60","v":"P"},{"$f":"IF(Prezentace!F60=0,\"\",Prezentace!F60)","v":""},{"$f":"IF(Prezentace!E60=0,\"\",Prezentace!E60)","v":""},null,null,null,null,null,null,null,null,null,null,null,null,null,null,null,null,0]
[{"$f":"IF(Prezentace!A61=0,\"\",Prezentace!A61)","v":""},{"$f":"IF(Prezentace!B61=0,\"\",Prezentace!B61)","v":""},{"$f":"Prezentace!D61","v":"P"},{"$f":"IF(Prezentace!F61=0,\"\",Prezentace!F61)","v":""},{"$f":"IF(Prezentace!E61=0,\"\",Prezentace!E61)","v":""},null,null,null,null,null,null,null,null,null,null,null,null,null,null,null,null,0]
[{"$f":"IF(Prezentace!A62=0,\"\",Prezentace!A62)","v":""},{"$f":"IF(Prezentace!B62=0,\"\",Prezentace!B62)","v":""},{"$f":"Prezentace!D62","v":"P"},{"$f":"IF(Prezentace!F62=0,\"\",Prezentace!F62)","v":""},{"$f":"IF(Prezentace!E62=0,\"\",Prezentace!E62)","v":""},null,null,null,null,null,null,null,null,null,null,null,null,null,null,null,null,0]
[{"$f":"IF(Prezentace!A63=0,\"\",Prezentace!A63)","v":""},{"$f":"IF(Prezentace!B63=0,\"\",Prezentace!B63)","v":""},{"$f":"Prezentace!D63","v":"P"},{"$f":"IF(Prezentace!F63=0,\"\",Prezentace!F63)","v":""},{"$f":"IF(Prezentace!E63=0,\"\",Prezentace!E63)","v":""},null,null,null,null,null,null,null,null,null,null,null,null,null,null,null,null,0]
[{"$f":"IF(Prezentace!A64=0,\"\",Prezentace!A64)","v":""},{"$f":"IF(Prezentace!B64=0,\"\",Prezentace!B64)","v":""},{"$f":"Prezentace!D64","v":"P"},{"$f":"IF(Prezentace!F64=0,\"\",Prezentace!F64)","v":""},{"$f":"IF(Prezentace!E64=0,\"\",Prezentace!E64)","v":""},null,null,null,null,null,null,null,null,null,null,null,null,null,null,null,null,0]
[{"$f":"IF(Prezentace!A65=0,\"\",Prezentace!A65)","v":""},{"$f":"IF(Prezentace!B65=0,\"\",Prezentace!B65)","v":""},{"$f":"Prezentace!D65","v":"P"},{"$f":"IF(Prezentace!F65=0,\"\",Prezentace!F65)","v":""},{"$f":"IF(Prezentace!E65=0,\"\",Prezentace!E65)","v":""},null,null,null,null,null,null,null,null,null,null,null,null,null,null,null,null,0]
[{"$f":"IF(Prezentace!A66=0,\"\",Prezentace!A66)","v":""},{"$f":"IF(Prezentace!B66=0,\"\",Prezentace!B66)","v":""},{"$f":"Prezentace!D66","v":"P"},{"$f":"IF(Prezentace!F66=0,\"\",Prezentace!F66)","v":""},{"$f":"IF(Prezentace!E66=0,\"\",Prezentace!E66)","v":""},null,null,null,null,null,null,null,null,null,null,null,null,null,null,null,null,0]
[{"$f":"IF(Prezentace!A67=0,\"\",Prezentace!A67)","v":""},{"$f":"IF(Prezentace!B67=0,\"\",Prezentace!B67)","v":""},{"$f":"Prezentace!D67","v":"P"},{"$f":"IF(Prezentace!F67=0,\"\",Prezentace!F67)","v":""},{"$f":"IF(Prezentace!E67=0,\"\",Prezentace!E67)","v":""},null,null,null,null,null,null,null,null,null,null,null,null,null,null,null,null,0]
[{"$f":"IF(Prezentace!A68=0,\"\",Prezentace!A68)","v":""},{"$f":"IF(Prezentace!B68=0,\"\",Prezentace!B68)","v":""},{"$f":"Prezentace!D68","v":"P"},{"$f":"IF(Prezentace!F68=0,\"\",Prezentace!F68)","v":""},{"$f":"IF(Prezentace!E68=0,\"\",Prezentace!E68)","v":""},null,null,null,null,null,null,null,null,null,null,null,null,null,null,null,null,0]
[{"$f":"IF(Prezentace!A69=0,\"\",Prezentace!A69)","v":""},{"$f":"IF(Prezentace!B69=0,\"\",Prezentace!B69)","v":""},{"$f":"Prezentace!D69","v":"P"},{"$f":"IF(Prezentace!F69=0,\"\",Prezentace!F69)","v":""},{"$f":"IF(Prezentace!E69=0,\"\",Prezentace!E69)","v":""},null,null,null,null,null,null,null,null,null,null,null,null,null,null,null,null,0]
[{"$f":"IF(Prezentace!A70=0,\"\",Prezentace!A70)","v":""},{"$f":"IF(Prezentace!B70=0,\"\",Prezentace!B70)","v":""},{"$f":"Prezentace!D70","v":"P"},{"$f":"IF(Prezentace!F70=0,\"\",Prezentace!F70)","v":""},{"$f":"IF(Prezentace!E70=0,\"\",Prezentace!E70)","v":""},null,null,null,null,null,null,null,null,null,null,null,null,null,null,null,null,0]
[{"$f":"IF(Prezentace!A71=0,\"\",Prezentace!A71)","v":""},{"$f":"IF(Prezentace!B71=0,\"\",Prezentace!B71)","v":""},{"$f":"Prezentace!D71","v":"P"},{"$f":"IF(Prezentace!F71=0,\"\",Prezentace!F71)","v":""},{"$f":"IF(Prezentace!E71=0,\"\",Prezentace!E71)","v":""},null,null,null,null,null,null,null,null,null,null,null,null,null,null,null,null,0]
[{"$f":"IF(Prezentace!A72=0,\"\",Prezentace!A72)","v":""},{"$f":"IF(Prezentace!B72=0,\"\",Prezentace!B72)","v":""},{"$f":"Prezentace!D72","v":"P"},{"$f":"IF(Prezentace!F72=0,\"\",Prezentace!F72)","v":""},{"$f":"IF(Prezentace!E72=0,\"\",Prezentace!E72)","v":""},null,null,null,null,null,null,null,null,null,null,null,null,null,null,null,null,0]
[{"$f":"IF(Prezentace!A73=0,\"\",Prezentace!A73)","v":""},{"$f":"IF(Prezentace!B73=0,\"\",Prezentace!B73)","v":""},{"$f":"Prezentace!D73","v":"P"},{"$f":"IF(Prezentace!F73=0,\"\",Prezentace!F73)","v":""},{"$f":"IF(Prezentace!E73=0,\"\",Prezentace!E73)","v":""},null,null,null,null,null,null,null,null,null,null,null,null,null,null,null,null,0]
[{"$f":"IF(Prezentace!A74=0,\"\",Prezentace!A74)","v":""},{"$f":"IF(Prezentace!B74=0,\"\",Prezentace!B74)","v":""},{"$f":"Prezentace!D74","v":"P"},{"$f":"IF(Prezentace!F74=0,\"\",Prezentace!F74)","v":""},{"$f":"IF(Prezentace!E74=0,\"\",Prezentace!E74)","v":""},null,null,null,null,null,null,null,null,null,null,null,null,null,null,null,null,0]
[{"$f":"IF(Prezentace!A75=0,\"\",Prezentace!A75)","v":""},{"$f":"IF(Prezentace!B75=0,\"\",Prezentace!B75)","v":""},{"$f":"Prezentace!D75","v":"P"},{"$f":"IF(Prezentace!F75=0,\"\",Prezentace!F75)","v":""},{"$f":"IF(Prezentace!E75=0,\"\",Prezentace!E75)","v":""},null,null,null,null,null,null,null,null,null,null,null,null,null,null,null,null,{"$f":"(SUM(F101:T101))-U101","v":0}]

{"sheet":"4","index":8,"n_rows":101,"n_cols":22,"rows_kept":101,"cut":false,"hidden":false,"merged":[[0,3,0,20],[0,0,2,0],[0,1,2,1]]}
["Druž.","Kap.",null,"Disciplina 4"]
[]
[null,null,null,null,null,"K","M",1,2,3,4,5,6,7,8,9,10,11,12,"TB","Čas","Součet"]
[{"$f":"IF(Prezentace!A6=0,\"\",Prezentace!A6)","v":""},{"$f":"IF(Prezentace!B6=0,\"\",Prezentace!B6)","v":""},{"$f":"Prezentace!D6","v":"P"},{"$f":"IF(Prezentace!F6=0,\"\",Prezentace!F6)","v":"Milan"},{"$f":"IF(Prezentace!E6=0,\"\",Prezentace!E6)","v":"Matějka st."},0,null,10,9,0,0,0,null,null,null,null,null,null,null,null,19,{"$f":"(SUM(F4:T4))-U4","v":0}]
[{"$f":"IF(Prezentace!A7=0,\"\",Prezentace!A7)","v":""},{"$f":"IF(Prezentace!B7=0,\"\",Prezentace!B7)","v":""},{"$f":"Prezentace!D7","v":"P"},{"$f":"IF(Prezentace!F7=0,\"\",Prezentace!F7)","v":"Miroslav"},{"$f":"IF(Prezentace!E7=0,\"\",Prezentace!E7)","v":"Fiala  "},0,null,10,10,10,8,0,null,null,null,null,null,null,null,null,8.6199999999999992,{"$f":"(SUM(F5:T5))-U5","v":29.380000000000003}]
[{"$f":"IF(Prezentace!A8=0,\"\",Prezentace!A8)","v":""},{"$f":"IF(Prezentace!B8=0,\"\",Prezentace!B8)","v":""},{"$f":"Prezentace!D8","v":"P"},{"$f":"IF(Prezentace!F8=0,\"\",Prezentace!F8)","v":"František"},{"$f":"IF(Prezentace!E8=0,\"\",Prezentace!E8)","v":"Toman "},0,null,10,9,9,8,8,null,null,null,null,null,null,null,null,9.59,34.409999999999997]
[{"$f":"IF(Prezentace!A9=0,\"\",Prezentace!A9)","v":""},{"$f":"IF(Prezentace!B9=0,\"\",Prezentace!B9)","v":""},{"$f":"Prezentace!D9","v":"P"},{"$f":"IF(Prezentace!F9=0,\"\",Prezentace!F9)","v":"Jiří"},{"$f":"IF(Prezentace!E9=0,\"\",Prezentace!E9)","v":"Švihálek "},0,null,10,9,9,8,8,null,null,null,null,null,null,null,null,9.23,34.769999999999996]
[{"$f":"IF(Prezentace!A10=0,\"\",Prezentace!A10)","v":""},{"$f":"IF(Prezentace!B10=0,\"\",Prezentace!B10)","v":""},{"$f":"Prezentace!D10","v":"R"},{"$f":"IF(Prezentace!F10=0,\"\",Prezentace!F10)","v":"Jiří"},{"$f":"IF(Prezentace!E10=0,\"\",Prezentace!E10)","v":"Švihálek "},0,null,10,10,10,8,0,null,null,null,null,null,null,null,null,12.59,25.41]
[{"$f":"IF(Prezentace!A11=0,\"\",Prezentace!A11)","v":""},{"$f":"IF(Prezentace!B11=0,\"\",Prezentace!B11)","v":""},{"$f":"Prezentace!D11","v":"P"},{"$f":"IF(Prezentace!F11=0,\"\",Prezentace!F11)","v":"Vladimír"},{"$f":"IF(Prezentace!E11=0,\"\",Prezentace!E11)","v":"VejslíK "},0,null,10,9,9,8,0,null,null,null,null,null,null,null,null,10.67,25.33]
[{"$f":"IF(Prezentace!A12=0,\"\",Prezentace!A12)","v":""},{"$f":"IF(Prezentace!B12=0,\"\",Prezentace!B12)","v":""},{"$f":"Prezentace!D12","v":"P"},{"$f":"IF(Prezentace!F12=0,\"\",Prezentace!F12)","v":"Milan"},{"$f":"IF(Prezentace!E12=0,\"\",Prezentace!E12)","v":"Kraus "},0,null,11,11,10,10,9,null,null,null,null,null,null,null,null,9.9,41.1]
[{"$f":"IF(Prezentace!A13=0,\"\",Prezentace!A13)","v":""},{"$f":"IF(Prezentace!B13=0,\"\",Prezentace!B13)","v":""},{"$f":"Prezentace!D13","v":"P"},{"$f":"IF(Prezentace!F13=0,\"\",Prezentace!F13)","v":"Vojtěch"},{"$f":"IF(Prezentace!E13=0,\"\",Prezentace!E13)","v":"Brejžek "},0,null,11,10,8,0,0,null,null,null,null,null,null,null,null,8.02,20.98]
[{"$f":"IF(Prezentace!A14=0,\"\",Prezentace!A14)","v":""},{"$f":"IF(Prezentace!B14=0,\"\",Prezentace!B14)","v":""},{"$f":"Prezentace!D14","v":"P"},{"$f":"IF(Prezentace!F14=0,\"\",Prezentace!F14)","v":"Karel"},{"$f":"IF(Prezentace!E14=0,\"\",Prezentace!E14)","v":"Získal "},0,null,10,9,9,8,0,null,null,null,null,null,null,null,null,11.19,24.810000000000002]
[{"$f":"IF(Prezentace!A15=0,\"\",Prezentace!A15)","v":""},{"$f":"IF(Prezentace!B15=0,\"\",Prezentace!B15)","v":""},{"$f":"Prezentace!D15","v":"R"},{"$f":"IF(Prezentace!F15=0,\"\",Prezentace!F15)","v":"Karel"},{"$f":"IF(Prezentace!E15=0,\"\",Prezentace!E15)","v":"Získal "},0,null,10,9,9,0,0,null,null,null,null,null,null,null,null,11.6,16.399999999999999]
[{"$f":"IF(Prezentace!A16=0,\"\",Prezentace!A16)","v":""},{"$f":"IF(Prezentace!B16=0,\"\",Prezentace!B16)","v":""},{"$f":"Prezentace!D16","v":"P"},{"$f":"IF(Prezentace!F16=0,\"\",Prezentace!F16)","v":"Marie"},{"$f":"IF(Prezentace!E16=0,\"\",Prezentace!E16)","v":"Žemličková"},0,null,10,10,10,8,8,null,null,null,null,null,null,null,null,12.72,33.28]
[{"$f":"IF(Prezentace!A17=0,\"\",Prezentace!A17)","v":""},{"$f":"IF(Prezentace!B17=0,\"\",Prezentace!B17)","v":""},{"$f":"Prezentace!D17","v":"P"},{"$f":"IF(Prezentace!F17=0,\"\",Prezentace!F17)","v":"Ladislav"},{"$f":"IF(Prezentace!E17=0,\"\",Prezentace!E17)","v":"Žemlička "},0,null,10,10,8,0,0,null,null,null,null,null,null,null,null,12.63,15.37]
[{"$f":"IF(Prezentace!A18=0,\"\",Prezentace!A18)","v":""},{"$f":"IF(Prezentace!B18=0,\"\",Prezentace!B18)","v":""},{"$f":"Prezentace!D18","v":"P"},{"$f":"IF(Prezentace!F18=0,\"\",Prezentace!F18)","v":"Jiří"},{"$f":"IF(Prezentace!E18=0,\"\",Prezentace!E18)","v":"Janovský "},0,null,10,0,0,0,0,null,null,null,null,null,null,null,null,10,0]
[{"$f":"IF(Prezentace!A19=0,\"\",Prezentace!A19)","v":""},{"$f":"IF(Prezentace!B19=0,\"\",Prezentace!B19)","v":""},{"$f":"Prezentace!D19","v":"P"},{"$f":"IF(Prezentace!F19=0,\"\",Prezentace!F19)","v":"Mojmír"},{"$f":"IF(Prezentace!E19=0,\"\",Prezentace!E19)","v":"Janovský "},0,null,11,8,0,0,0,null,null,null,null,null,null,null,null,18.95,5.0000000000000711E-2]
[{"$f":"IF(Prezentace!A20=0,\"\",Prezentace!A20)","v":""},{"$f":"IF(Prezentace!B20=0,\"\",Prezentace!B20)","v":""},{"$f":"Prezentace!D20","v":"P"},{"$f":"IF(Prezentace!F20=0,\"\",Prezentace!F20)","v":"Bohumil"},{"$f":"IF(Prezentace!E20=0,\"\",Prezentace!E20)","v":"Herceg"},0,null,10,10,10,10,9,null,null,null,null,null,null,null,null,14.83,34.17]
[{"$f":"IF(Prezentace!A21=0,\"\",Prezentace!A21)","v":""},{"$f":"IF(Prezentace!B21=0,\"\",Prezentace!B21)","v":""},{"$f":"Prezentace!D21","v":"P"},{"$f":"IF(Prezentace!F21=0,\"\",Prezentace!F21)","v":"Michal"},{"$f":"IF(Prezentace!E21=0,\"\",Prezentace!E21)","v":"Svoboda"},0,null,10,8,8,0,0,null,null,null,null,null,null,null,null,6.7,19.3]
[{"$f":"IF(Prezentace!A22=0,\"\",Prezentace!A22)","v":""},{"$f":"IF(Prezentace!B22=0,\"\",Prezentace!B22)","v":""},{"$f":"Prezentace!D22","v":"P"},{"$f":"IF(Prezentace!F22=0,\"\",Prezentace!F22)","v":"Viktor"},{"$f":"IF(Prezentace!E22=0,\"\",Prezentace!E22)","v":"Fuksa  "},0,null,11,9,9,9,0,null,null,null,null,null,null,null,null,13.19,24.810000000000002]
[{"$f":"IF(Prezentace!A23=0,\"\",Prezentace!A23)","v":""},{"$f":"IF(Prezentace!B23=0,\"\",Prezentace!B23)","v":""},{"$f":"Prezentace!D23","v":"P"},{"$f":"IF(Prezentace!F23=0,\"\",Prezentace!F23)","v":"Miroslav"},{"$f":"IF(Prezentace!E23=0,\"\",Prezentace!E23)","v":"Koch   ml."},0,null,11,10,10,8,0,null,null,null,null,null,null,null,null,13.38,25.619999999999997]
[{"$f":"IF(Prezentace!A24=0,\"\",Prezentace!A24)","v":""},{"$f":"IF(Prezentace!B24=0,\"\",Prezentace!B24)","v":""},{"$f":"Prezentace!D24","v":"P"},{"$f":"IF(Prezentace!F24=0,\"\",Prezentace!F24)","v":"Miroslav"},{"$f":"IF(Prezentace!E24=0,\"\",Prezentace!E24)","v":"Koch  st. "},0,null,11,10,10,10,9,null,null,null,null,null,null,null,null,12.27,37.730000000000004]
[{"$f":"IF(Prezentace!A25=0,\"\",Prezentace!A25)","v":""},{"$f":"IF(Prezentace!B25=0,\"\",Prezentace!B25)","v":""},{"$f":"Prezentace!D25","v":"P"},{"$f":"IF(Prezentace!F25=0,\"\",Prezentace!F25)","v":"Jaroslav"},{"$f":"IF(Prezentace!E25=0,\"\",Prezentace!E25)","v":"Kostříž "},0,null,10,10,9,0,0,null,null,null,null,null,null,null,null,11,18]
[{"$f":"IF(Prezentace!A26=0,\"\",Prezentace!A26)","v":""},{"$f":"IF(Prezentace!B26=0,\"\",Prezentace!B26)","v":""},{"$f":"Prezentace!D26","v":"P"},{"$f":"IF(Prezentace!F26=0,\"\",Prezentace!F26)","v":"Josef"},{"$f":"IF(Prezentace!E26=0,\"\",Prezentace!E26)","v":"Čekal "},0,null,9,9,9,8,0,null,null,null,null,null,null,null,null,11.83,23.17]
[{"$f":"IF(Prezentace!A27=0,\"\",Prezentace!A27)","v":""},{"$f":"IF(Prezentace!B27=0,\"\",Prezentace!B27)","v":""},{"$f":"Prezentace!D27","v":"P"},{"$f":"IF(Prezentace!F27=0,\"\",Prezentace!F27)","v":"Miloslav"},{"$f":"IF(Prezentace!E27=0,\"\",Prezentace!E27)","v":"Petržílka"},0,null,11,10,10,9,0,null,null,null,null,null,null,null,null,11.4,28.6]
[{"$f":"IF(Prezentace!A28=0,\"\",Prezentace!A28)","v":""},{"$f":"IF(Prezentace!B28=0,\"\",Prezentace!B28)","v":""},{"$f":"Prezentace!D28","v":"P"},{"$f":"IF(Prezentace!F28=0,\"\",Prezentace!F28)","v":"Václav"},{"$f":"IF(Prezentace!E28=0,\"\",Prezentace!E28)","v":"Landkammer"},0,null,11,10,9,8,0,null,null,null,null,null,null,null,null,13.7,24.3]
[{"$f":"IF(Prezentace!A29=0,\"\",Prezentace!A29)","v":""},{"$f":"IF(Prezentace!B29=0,\"\",Prezentace!B29)","v":""},{"$f":"Prezentace!D29","v":"P"},{"$f":"IF(Prezentace!F29=0,\"\",Prezentace!F29)","v":"Albert"},{"$f":"IF(Prezentace!E29=0,\"\",Prezentace!E29)","v":"Wrzecionko"},0,null,10,8,8,0,0,null,null,null,null,null,null,null,null,23.34,2.66]
[{"$f":"IF(Prezentace!A30=0,\"\",Prezentace!A30)","v":""},{"$f":"IF(Prezentace!B30=0,\"\",Prezentace!B30)","v":""},{"$f":"Prezentace!D30","v":"P"},{"$f":"IF(Prezentace!F30=0,\"\",Prezentace!F30)","v":"Michaela"},{"$f":"IF(Prezentace!E30=0,\"\",Prezentace!E30)","v":"Reisnerová"},0,null,0,0,0,0,0,null,null,null,null,null,null,null,null,0,0]
[{"$f":"IF(Prezentace!A31=0,\"\",Prezentace!A31)","v":""},{"$f":"IF(Prezentace!B31=0,\"\",Prezentace!B31)","v":""},{"$f":"Prezentace!D31","v":"P"},{"$f":"IF(Prezentace!F31=0,\"\",Prezentace!F31)","v":"Antonín"},{"$f":"IF(Prezentace!E31=0,\"\",Prezentace!E31)","v":"Urbanec  "},0,null,9,9,0,0,0,null,null,null,null,null,null,null,null,12.41,5.59]
[{"$f":"IF(Prezentace!#REF!=0,\"\",Prezentace!#REF!)","v":{"$error":"#REF!"}},{"$f":"IF(Prezentace!#REF!=0,\"\",Prezentace!#REF!)","v":{"$error":"#REF!"}},{"$f":"Prezentace!#REF!","v":{"$error":"#REF!"}},{"$f":"IF(Prezentace!#REF!=0,\"\",Prezentace!#REF!)","v":{"$error":"#REF!"}},{"$f":"IF(Prezentace!#REF!=0,\"\",Prezentace!#REF!)","v":{"$error":"#REF!"}},null,null,null,null,null,null,null,null,null,null,null,null,null,null,null,null,0]
[{"$f":"IF(Prezentace!#REF!=0,\"\",Prezentace!#REF!)","v":{"$error":"#REF!"}},{"$f":"IF(Prezentace!#REF!=0,\"\",Prezentace!#REF!)","v":{"$error":"#REF!"}},{"$f":"Prezentace!#REF!","v":{"$error":"#REF!"}},{"$f":"IF(Prezentace!#REF!=0,\"\",Prezentace!#REF!)","v":{"$error":"#REF!"}},{"$f":"IF(Prezentace!#REF!=0,\"\",Prezentace!#REF!)","v":{"$error":"#REF!"}},null,null,null,null,null,null,null,null,null,null,null,null,null,null,null,null,0]
[{"$f":"IF(Prezentace!#REF!=0,\"\",Prezentace!#REF!)","v":{"$error":"#REF!"}},{"$f":"IF(Prezentace!#REF!=0,\"\",Prezentace!#REF!)","v":{"$error":"#REF!"}},{"$f":"Prezentace!#REF!","v":{"$error":"#REF!"}},{"$f":"IF(Prezentace!#REF!=0,\"\",Prezentace!#REF!)","v":{"$error":"#REF!"}},{"$f":"IF(Prezentace!#REF!=0,\"\",Prezentace!#REF!)","v":{"$error":"#REF!"}},null,null,null,null,null,null,null,null,null,null,null,null,null,null,null,null,0]
[{"$f":"IF(Prezentace!#REF!=0,\"\",Prezentace!#REF!)","v":{"$error":"#REF!"}},{"$f":"IF(Prezentace!#REF!=0,\"\",Prezentace!#REF!)","v":{"$error":"#REF!"}},{"$f":"Prezentace!#REF!","v":{"$error":"#REF!"}},{"$f":"IF(Prezentace!#REF!=0,\"\",Prezentace!#REF!)","v":{"$error":"#REF!"}},{"$f":"IF(Prezentace!#REF!=0,\"\",Prezentace!#REF!)","v":{"$error":"#REF!"}},null,null,null,null,null,null,null,null,null,null,null,null,null,null,null,null,0]
[{"$f":"IF(Prezentace!#REF!=0,\"\",Prezentace!#REF!)","v":{"$error":"#REF!"}},{"$f":"IF(Prezentace!#REF!=0,\"\",Prezentace!#REF!)","v":{"$error":"#REF!"}},{"$f":"Prezentace!#REF!","v":{"$error":"#REF!"}},{"$f":"IF(Prezentace!#REF!=0,\"\",Prezentace!#REF!)","v":{"$error":"#REF!"}},{"$f":"IF(Prezentace!#REF!=0,\"\",Prezentace!#REF!)","v":{"$error":"#REF!"}},null,null,null,null,null,null,null,null,null,null,null,null,null,null,null,null,0]
[{"$f":"IF(Prezentace!#REF!=0,\"\",Prezentace!#REF!)","v":{"$error":"#REF!"}},{"$f":"IF(Prezentace!#REF!=0,\"\",Prezentace!#REF!)","v":{"$error":"#REF!"}},{"$f":"Prezentace!#REF!","v":{"$error":"#REF!"}},{"$f":"IF(Prezentace!#REF!=0,\"\",Prezentace!#REF!)","v":{"$error":"#REF!"}},{"$f":"IF(Prezentace!#REF!=0,\"\",Prezentace!#REF!)","v":{"$error":"#REF!"}},null,null,null,null,null,null,null,null,null,null,null,null,null,null,null,null,0]
[{"$f":"IF(Prezentace!#REF!=0,\"\",Prezentace!#REF!)","v":{"$error":"#REF!"}},{"$f":"IF(Prezentace!#REF!=0,\"\",Prezentace!#REF!)","v":{"$error":"#REF!"}},{"$f":"Prezentace!#REF!","v":{"$error":"#REF!"}},{"$f":"IF(Prezentace!#REF!=0,\"\",Prezentace!#REF!)","v":{"$error":"#REF!"}},{"$f":"IF(Prezentace!#REF!=0,\"\",Prezentace!#REF!)","v":{"$error":"#REF!"}},null,null,null,null,null,null,null,null,null,null,null,null,null,null,null,null,0]
[{"$f":"IF(Prezentace!#REF!=0,\"\",Prezentace!#REF!)","v":{"$error":"#REF!"}},{"$f":"IF(Prezentace!#REF!=0,\"\",Prezentace!#REF!)","v":{"$error":"#REF!"}},{"$f":"Prezentace!#REF!","v":{"$error":"#REF!"}},{"$f":"IF(Prezentace!#REF!=0,\"\",Prezentace!#REF!)","v":{"$error":"#REF!"}},{"$f":"IF(Prezentace!#REF!=0,\"\",Prezentace!#REF!)","v":{"$error":"#REF!"}},null,null,null,null,null,null,null,null,null,null,null,null,null,null,null,null,{"$f":"(SUM(F37:T37))-U37","v":0}]
[{"$f":"IF(Prezentace!#REF!=0,\"\",Prezentace!#REF!)","v":{"$error":"#REF!"}},{"$f":"IF(Prezentace!#REF!=0,\"\",Prezentace!#REF!)","v":{"$error":"#REF!"}},{"$f":"Prezentace!#REF!","v":{"$error":"#REF!"}},{"$f":"IF(Prezentace!#REF!=0,\"\",Prezentace!#REF!)","v":{"$error":"#REF!"}},{"$f":"IF(Prezentace!#REF!=0,\"\",Prezentace!#REF!)","v":{"$error":"#REF!"}},null,null,null,null,null,null,null,null,null,null,null,null,null,null,null,null,0]
[{"$f":"IF(Prezentace!#REF!=0,\"\",Prezentace!#REF!)","v":{"$error":"#REF!"}},{"$f":"IF(Prezentace!#REF!=0,\"\",Prezentace!#REF!)","v":{"$error":"#REF!"}},{"$f":"Prezentace!#REF!","v":{"$error":"#REF!"}},{"$f":"IF(Prezentace!#REF!=0,\"\",Prezentace!#REF!)","v":{"$error":"#REF!"}},{"$f":"IF(Prezentace!#REF!=0,\"\",Prezentace!#REF!)","v":{"$error":"#REF!"}},null,null,null,null,null,null,null,null,null,null,null,null,null,null,null,null,0]
[{"$f":"IF(Prezentace!#REF!=0,\"\",Prezentace!#REF!)","v":{"$error":"#REF!"}},{"$f":"IF(Prezentace!#REF!=0,\"\",Prezentace!#REF!)","v":{"$error":"#REF!"}},{"$f":"Prezentace!#REF!","v":{"$error":"#REF!"}},{"$f":"IF(Prezentace!#REF!=0,\"\",Prezentace!#REF!)","v":{"$error":"#REF!"}},{"$f":"IF(Prezentace!#REF!=0,\"\",Prezentace!#REF!)","v":{"$error":"#REF!"}},null,null,null,null,null,null,null,null,null,null,null,null,null,null,null,null,0]
[{"$f":"IF(Prezentace!#REF!=0,\"\",Prezentace!#REF!)","v":{"$error":"#REF!"}},{"$f":"IF(Prezentace!#REF!=0,\"\",Prezentace!#REF!)","v":{"$error":"#REF!"}},{"$f":"Prezentace!#REF!","v":{"$error":"#REF!"}},{"$f":"IF(Prezentace!#REF!=0,\"\",Prezentace!#REF!)","v":{"$error":"#REF!"}},{"$f":"IF(Prezentace!#REF!=0,\"\",Prezentace!#REF!)","v":{"$error":"#REF!"}},null,null,null,null,null,null,null,null,null,null,null,null,null,null,null,null,0]
[{"$f":"IF(Prezentace!#REF!=0,\"\",Prezentace!#REF!)","v":{"$error":"#REF!"}},{"$f":"IF(Prezentace!#REF!=0,\"\",Prezentace!#REF!)","v":{"$error":"#REF!"}},{"$f":"Prezentace!#REF!","v":{"$error":"#REF!"}},{"$f":"IF(Prezentace!#REF!=0,\"\",Prezentace!#REF!)","v":{"$error":"#REF!"}},{"$f":"IF(Prezentace!#REF!=0,\"\",Prezentace!#REF!)","v":{"$error":"#REF!"}},null,null,null,null,null,null,null,null,null,null,null,null,null,null,null,null,0]
[{"$f":"IF(Prezentace!#REF!=0,\"\",Prezentace!#REF!)","v":{"$error":"#REF!"}},{"$f":"IF(Prezentace!#REF!=0,\"\",Prezentace!#REF!)","v":{"$error":"#REF!"}},{"$f":"Prezentace!#REF!","v":{"$error":"#REF!"}},{"$f":"IF(Prezentace!#REF!=0,\"\",Prezentace!#REF!)","v":{"$error":"#REF!"}},{"$f":"IF(Prezentace!#REF!=0,\"\",Prezentace!#REF!)","v":{"$error":"#REF!"}},null,null,null,null,null,null,null,null,null,null,null,null,null,null,null,null,0]
[{"$f":"IF(Prezentace!#REF!=0,\"\",Prezentace!#REF!)","v":{"$error":"#REF!"}},{"$f":"IF(Prezentace!#REF!=0,\"\",Prezentace!#REF!)","v":{"$error":"#REF!"}},{"$f":"Prezentace!#REF!","v":{"$error":"#REF!"}},{"$f":"IF(Prezentace!#REF!=0,\"\",Prezentace!#REF!)","v":{"$error":"#REF!"}},{"$f":"IF(Prezentace!#REF!=0,\"\",Prezentace!#REF!)","v":{"$error":"#REF!"}},null,null,null,null,null,null,null,null,null,null,null,null,null,null,null,null,0]
[{"$f":"IF(Prezentace!#REF!=0,\"\",Prezentace!#REF!)","v":{"$error":"#REF!"}},{"$f":"IF(Prezentace!#REF!=0,\"\",Prezentace!#REF!)","v":{"$error":"#REF!"}},{"$f":"Prezentace!#REF!","v":{"$error":"#REF!"}},{"$f":"IF(Prezentace!#REF!=0,\"\",Prezentace!#REF!)","v":{"$error":"#REF!"}},{"$f":"IF(Prezentace!#REF!=0,\"\",Prezentace!#REF!)","v":{"$error":"#REF!"}},null,null,null,null,null,null,null,null,null,null,null,null,null,null,null,null,0]
[{"$f":"IF(Prezentace!#REF!=0,\"\",Prezentace!#REF!)","v":{"$error":"#REF!"}},{"$f":"IF(Prezentace!#REF!=0,\"\",Prezentace!#REF!)","v":{"$error":"#REF!"}},{"$f":"Prezentace!#REF!","v":{"$error":"#REF!"}},{"$f":"IF(Prezentace!#REF!=0,\"\",Prezentace!#REF!)","v":{"$error":"#REF!"}},{"$f":"IF(Prezentace!#REF!=0,\"\",Prezentace!#REF!)","v":{"$error":"#REF!"}},null,null,null,null,null,null,null,null,null,null,null,null,null,null,null,null,0]
[{"$f":"IF(Prezentace!#REF!=0,\"\",Prezentace!#REF!)","v":{"$error":"#REF!"}},{"$f":"IF(Prezentace!#REF!=0,\"\",Prezentace!#REF!)","v":{"$error":"#REF!"}},{"$f":"Prezentace!#REF!","v":{"$error":"#REF!"}},{"$f":"IF(Prezentace!#REF!=0,\"\",Prezentace!#REF!)","v":{"$error":"#REF!"}},{"$f":"IF(Prezentace!#REF!=0,\"\",Prezentace!#REF!)","v":{"$error":"#REF!"}},null,null,null,null,null,null,null,null,null,null,null,null,null,null,null,null,0]
[{"$f":"IF(Prezentace!#REF!=0,\"\",Prezentace!#REF!)","v":{"$error":"#REF!"}},{"$f":"IF(Prezentace!#REF!=0,\"\",Prezentace!#REF!)","v":{"$error":"#REF!"}},{"$f":"Prezentace!#REF!","v":{"$error":"#REF!"}},{"$f":"IF(Prezentace!#REF!=0,\"\",Prezentace!#REF!)","v":{"$error":"#REF!"}},{"$f":"IF(Prezentace!#REF!=0,\"\",Prezentace!#REF!)","v":{"$error":"#REF!"}},null,null,null,null,null,null,null,null,null,null,null,null,null,null,null,null,0]
[{"$f":"IF(Prezentace!#REF!=0,\"\",Prezentace!#REF!)","v":{"$error":"#REF!"}},{"$f":"IF(Prezentace!#REF!=0,\"\",Prezentace!#REF!)","v":{"$error":"#REF!"}},{"$f":"Prezentace!#REF!","v":{"$error":"#REF!"}},{"$f":"IF(Prezentace!#REF!=0,\"\",Prezentace!#REF!)","v":{"$error":"#REF!"}},{"$f":"IF(Prezentace!#REF!=0,\"\",Prezentace!#REF!)","v":{"$error":"#REF!"}},null,null,null,null,null,null,null,null,null,null,null,null,null,null,null,null,0]
[{"$f":"IF(Prezentace!#REF!=0,\"\",Prezentace!#REF!)","v":{"$error":"#REF!"}},{"$f":"IF(Prezentace!#REF!=0,\"\",Prezentace!#REF!)","v":{"$error":"#REF!"}},{"$f":"Prezentace!#REF!","v":{"$error":"#REF!"}},{"$f":"IF(Prezentace!#REF!=0,\"\",Prezentace!#REF!)","v":{"$error":"#REF!"}},{"$f":"IF(Prezentace!#REF!=0,\"\",Prezentace!#REF!)","v":{"$error":"#REF!"}},null,null,null,null,null,null,null,null,null,null,null,null,null,null,null,null,0]
[{"$f":"IF(Prezentace!#REF!=0,\"\",Prezentace!#REF!)","v":{"$error":"#REF!"}},{"$f":"IF(Prezentace!#REF!=0,\"\",Prezentace!#REF!)","v":{"$error":"#REF!"}},{"$f":"Prezentace!#REF!","v":{"$error":"#REF!"}},{"$f":"IF(Prezentace!#REF!=0,\"\",Prezentace!#REF!)","v":{"$error":"#REF!"}},{"$f":"IF(Prezentace!#REF!=0,\"\",Prezentace!#REF!)","v":{"$error":"#REF!"}},null,null,null,null,null,null,null,null,null,null,null,null,null,null,null,null,0]
[{"$f":"IF(Prezentace!#REF!=0,\"\",Prezentace!#REF!)","v":{"$error":"#REF!"}},{"$f":"IF(Prezentace!#REF!=0,\"\",Prezentace!#REF!)","v":{"$error":"#REF!"}},{"$f":"Prezentace!#REF!","v":{"$error":"#REF!"}},{"$f":"IF(Prezentace!#REF!=0,\"\",Prezentace!#REF!)","v":{"$error":"#REF!"}},{"$f":"IF(Prezentace!#REF!=0,\"\",Prezentace!#REF!)","v":{"$error":"#REF!"}},null,null,null,null,null,null,null,null,null,null,null,null,null,null,null,null,0]
[{"$f":"IF(Prezentace!#REF!=0,\"\",Prezentace!#REF!)","v":{"$error":"#REF!"}},{"$f":"IF(Prezentace!#REF!=0,\"\",Prezentace!#REF!)","v":{"$error":"#REF!"}},{"$f":"Prezentace!#REF!","v":{"$error":"#REF!"}},{"$f":"IF(Prezentace!#REF!=0,\"\",Prezentace!#REF!)","v":{"$error":"#REF!"}},{"$f":"IF(Prezentace!#REF!=0,\"\",Prezentace!#REF!)","v":{"$error":"#REF!"}},null,null,null,null,null,null,null,null,null,null,null,null,null,null,null,null,0]
[{"$f":"IF(Prezentace!#REF!=0,\"\",Prezentace!#REF!)","v":{"$error":"#REF!"}},{"$f":"IF(Prezentace!#REF!=0,\"\",Prezentace!#REF!)","v":{"$error":"#REF!"}},{"$f":"Prezentace!#REF!","v":{"$error":"#REF!"}},{"$f":"IF(Prezentace!#REF!=0,\"\",Prezentace!#REF!)","v":{"$error":"#REF!"}},{"$f":"IF(Prezentace!#REF!=0,\"\",Prezentace!#REF!)","v":{"$error":"#REF!"}},null,null,null,null,null,null,null,null,null,null,null,null,null,null,null,null,0]
[{"$f":"IF(Prezentace!#REF!=0,\"\",Prezentace!#REF!)","v":{"$error":"#REF!"}},{"$f":"IF(Prezentace!#REF!=0,\"\",Prezentace!#REF!)","v":{"$error":"#REF!"}},{"$f":"Prezentace!#REF!","v":{"$error":"#REF!"}},{"$f":"IF(Prezentace!#REF!=0,\"\",Prezentace!#REF!)","v":{"$error":"#REF!"}},{"$f":"IF(Prezentace!#REF!=0,\"\",Prezentace!#REF!)","v":{"$error":"#REF!"}},null,null,null,null,null,null,null,null,null,null,null,null,null,null,null,null,0]
[{"$f":"IF(Prezentace!#REF!=0,\"\",Prezentace!#REF!)","v":{"$error":"#REF!"}},{"$f":"IF(Prezentace!#REF!=0,\"\",Prezentace!#REF!)","v":{"$error":"#REF!"}},{"$f":"Prezentace!#REF!","v":{"$error":"#REF!"}},{"$f":"IF(Prezentace!#REF!=0,\"\",Prezentace!#REF!)","v":{"$error":"#REF!"}},{"$f":"IF(Prezentace!#REF!=0,\"\",Prezentace!#REF!)","v":{"$error":"#REF!"}},null,null,null,null,null,null,null,null,null,null,null,null,null,null,null,null,0]
[{"$f":"IF(Prezentace!#REF!=0,\"\",Prezentace!#REF!)","v":{"$error":"#REF!"}},{"$f":"IF(Prezentace!#REF!=0,\"\",Prezentace!#REF!)","v":{"$error":"#REF!"}},{"$f":"Prezentace!#REF!","v":{"$error":"#REF!"}},{"$f":"IF(Prezentace!#REF!=0,\"\",Prezentace!#REF!)","v":{"$error":"#REF!"}},{"$f":"IF(Prezentace!#REF!=0,\"\",Prezentace!#REF!)","v":{"$error":"#REF!"}},null,null,null,null,null,null,null,null,null,null,null,null,null,null,null,null,0]
[{"$f":"IF(Prezentace!A32=0,\"\",Prezentace!A32)","v":""},{"$f":"IF(Prezentace!B32=0,\"\",Prezentace!B32)","v":""},{"$f":"Prezentace!D32","v":"P"},{"$f":"IF(Prezentace!F32=0,\"\",Prezentace!F32)","v":""},{"$f":"IF(Prezentace!E32=0,\"\",Prezentace!E32)","v":""},null,null,null,null,null,null,null,null,null,null,null,null,null,null,null,null,0]
[{"$f":"IF(Prezentace!A33=0,\"\",Prezentace!A33)","v":""},{"$f":"IF(Prezentace!B33=0,\"\",Prezentace!B33)","v":""},{"$f":"Prezentace!D33","v":"P"},{"$f":"IF(Prezentace!F33=0,\"\",Prezentace!F33)","v":""},{"$f":"IF(Prezentace!E33=0,\"\",Prezentace!E33)","v":""},null,null,null,null,null,null,null,null,null,null,null,null,null,null,null,null,0]
[{"$f":"IF(Prezentace!A34=0,\"\",Prezentace!A34)","v":""},{"$f":"IF(Prezentace!B34=0,\"\",Prezentace!B34)","v":""},{"$f":"Prezentace!D34","v":"P"},{"$f":"IF(Prezentace!F34=0,\"\",Prezentace!F34)","v":""},{"$f":"IF(Prezentace!E34=0,\"\",Prezentace!E34)","v":""},null,null,null,null,null,null,null,null,null,null,null,null,null,null,null,null,0]
[{"$f":"IF(Prezentace!A35=0,\"\",Prezentace!A35)","v":""},{"$f":"IF(Prezentace!B35=0,\"\",Prezentace!B35)","v":""},{"$f":"Prezentace!D35","v":"P"},{"$f":"IF(Prezentace!F35=0,\"\",Prezentace!F35)","v":""},{"$f":"IF(Prezentace!E35=0,\"\",Prezentace!E35)","v":""},null,null,null,null,null,null,null,null,null,null,null,null,null,null,null,null,0]
[{"$f":"IF(Prezentace!A36=0,\"\",Prezentace!A36)","v":""},{"$f":"IF(Prezentace!B36=0,\"\",Prezentace!B36)","v":""},{"$f":"Prezentace!D36","v":"P"},{"$f":"IF(Prezentace!F36=0,\"\",Prezentace!F36)","v":""},{"$f":"IF(Prezentace!E36=0,\"\",Prezentace!E36)","v":""},null,null,null,null,null,null,null,null,null,null,null,null,null,null,null,null,0]
[{"$f":"IF(Prezentace!A37=0,\"\",Prezentace!A37)","v":""},{"$f":"IF(Prezentace!B37=0,\"\",Prezentace!B37)","v":""},{"$f":"Prezentace!D37","v":"P"},{"$f":"IF(Prezentace!F37=0,\"\",Prezentace!F37)","v":""},{"$f":"IF(Prezentace!E37=0,\"\",Prezentace!E37)","v":""},null,null,null,null,null,null,null,null,null,null,null,null,null,null,null,null,0]
[{"$f":"IF(Prezentace!A38=0,\"\",Prezentace!A38)","v":""},{"$f":"IF(Prezentace!B38=0,\"\",Prezentace!B38)","v":""},{"$f":"Prezentace!D38","v":"P"},{"$f":"IF(Prezentace!F38=0,\"\",Prezentace!F38)","v":""},{"$f":"IF(Prezentace!E38=0,\"\",Prezentace!E38)","v":""},null,null,null,null,null,null,null,null,null,null,null,null,null,null,null,null,0]
[{"$f":"IF(Prezentace!A39=0,\"\",Prezentace!A39)","v":""},{"$f":"IF(Prezentace!B39=0,\"\",Prezentace!B39)","v":""},{"$f":"Prezentace!D39","v":"P"},{"$f":"IF(Prezentace!F39=0,\"\",Prezentace!F39)","v":""},{"$f":"IF(Prezentace!E39=0,\"\",Prezentace!E39)","v":""},null,null,null,null,null,null,null,null,null,null,null,null,null,null,null,null,0]
[{"$f":"IF(Prezentace!A40=0,\"\",Prezentace!A40)","v":""},{"$f":"IF(Prezentace!B40=0,\"\",Prezentace!B40)","v":""},{"$f":"Prezentace!D40","v":"P"},{"$f":"IF(Prezentace!F40=0,\"\",Prezentace!F40)","v":""},{"$f":"IF(Prezentace!E40=0,\"\",Prezentace!E40)","v":""},null,null,null,null,null,null,null,null,null,null,null,null,null,null,null,null,0]
[{"$f":"IF(Prezentace!A41=0,\"\",Prezentace!A41)","v":""},{"$f":"IF(Prezentace!B41=0,\"\",Prezentace!B41)","v":""},{"$f":"Prezentace!D41","v":"P"},{"$f":"IF(Prezentace!F41=0,\"\",Prezentace!F41)","v":""},{"$f":"IF(Prezentace!E41=0,\"\",Prezentace!E41)","v":""},null,null,null,null,null,null,null,null,null,null,null,null,null,null,null,null,0]
[{"$f":"IF(Prezentace!A42=0,\"\",Prezentace!A42)","v":""},{"$f":"IF(Prezentace!B42=0,\"\",Prezentace!B42)","v":""},{"$f":"Prezentace!D42","v":"P"},{"$f":"IF(Prezentace!F42=0,\"\",Prezentace!F42)","v":""},{"$f":"IF(Prezentace!E42=0,\"\",Prezentace!E42)","v":""},null,null,null,null,null,null,null,null,null,null,null,null,null,null,null,null,0]
[{"$f":"IF(Prezentace!A43=0,\"\",Prezentace!A43)","v":""},{"$f":"IF(Prezentace!B43=0,\"\",Prezentace!B43)","v":""},{"$f":"Prezentace!D43","v":"P"},{"$f":"IF(Prezentace!F43=0,\"\",Prezentace!F43)","v":""},{"$f":"IF(Prezentace!E43=0,\"\",Prezentace!E43)","v":""},null,null,null,null,null,null,null,null,null,null,null,null,null,null,null,null,0]
[{"$f":"IF(Prezentace!A44=0,\"\",Prezentace!A44)","v":""},{"$f":"IF(Prezentace!B44=0,\"\",Prezentace!B44)","v":""},{"$f":"Prezentace!D44","v":"P"},{"$f":"IF(Prezentace!F44=0,\"\",Prezentace!F44)","v":""},{"$f":"IF(Prezentace!E44=0,\"\",Prezentace!E44)","v":""},null,null,null,null,null,null,null,null,null,null,null,null,null,null,null,null,0]
[{"$f":"IF(Prezentace!A45=0,\"\",Prezentace!A45)","v":""},{"$f":"IF(Prezentace!B45=0,\"\",Prezentace!B45)","v":""},{"$f":"Prezentace!D45","v":"P"},{"$f":"IF(Prezentace!F45=0,\"\",Prezentace!F45)","v":""},{"$f":"IF(Prezentace!E45=0,\"\",Prezentace!E45)","v":""},null,null,null,null,null,null,null,null,null,null,null,null,null,null,null,null,0]
[{"$f":"IF(Prezentace!A46=0,\"\",Prezentace!A46)","v":""},{"$f":"IF(Prezentace!B46=0,\"\",Prezentace!B46)","v":""},{"$f":"Prezentace!D46","v":"P"},{"$f":"IF(Prezentace!F46=0,\"\",Prezentace!F46)","v":""},{"$f":"IF(Prezentace!E46=0,\"\",Prezentace!E46)","v":""},null,null,null,null,null,null,null,null,null,null,null,null,null,null,null,null,0]
[{"$f":"IF(Prezentace!A47=0,\"\",Prezentace!A47)","v":""},{"$f":"IF(Prezentace!B47=0,\"\",Prezentace!B47)","v":""},{"$f":"Prezentace!D47","v":"P"},{"$f":"IF(Prezentace!F47=0,\"\",Prezentace!F47)","v":""},{"$f":"IF(Prezentace!E47=0,\"\",Prezentace!E47)","v":""},null,null,null,null,null,null,null,null,null,null,null,null,null,null,null,null,0]
[{"$f":"IF(Prezentace!A48=0,\"\",Prezentace!A48)","v":""},{"$f":"IF(Prezentace!B48=0,\"\",Prezentace!B48)","v":""},{"$f":"Prezentace!D48","v":"P"},{"$f":"IF(Prezentace!F48=0,\"\",Prezentace!F48)","v":""},{"$f":"IF(Prezentace!E48=0,\"\",Prezentace!E48)","v":""},null,null,null,null,null,null,null,null,null,null,null,null,null,null,null,null,0]
[{"$f":"IF(Prezentace!A49=0,\"\",Prezentace!A49)","v":""},{"$f":"IF(Prezentace!B49=0,\"\",Prezentace!B49)","v":""},{"$f":"Prezentace!D49","v":"P"},{"$f":"IF(Prezentace!F49=0,\"\",Prezentace!F49)","v":""},{"$f":"IF(Prezentace!E49=0,\"\",Prezentace!E49)","v":""},null,null,null,null,null,null,null,null,null,null,null,null,null,null,null,null,0]
[{"$f":"IF(Prezentace!A50=0,\"\",Prezentace!A50)","v":""},{"$f":"IF(Prezentace!B50=0,\"\",Prezentace!B50)","v":""},{"$f":"Prezentace!D50","v":"P"},{"$f":"IF(Prezentace!F50=0,\"\",Prezentace!F50)","v":""},{"$f":"IF(Prezentace!E50=0,\"\",Prezentace!E50)","v":""},null,null,null,null,null,null,null,null,null,null,null,null,null,null,null,null,0]
[{"$f":"IF(Prezentace!A51=0,\"\",Prezentace!A51)","v":""},{"$f":"IF(Prezentace!B51=0,\"\",Prezentace!B51)","v":""},{"$f":"Prezentace!D51","v":"P"},{"$f":"IF(Prezentace!F51=0,\"\",Prezentace!F51)","v":""},{"$f":"IF(Prezentace!E51=0,\"\",Prezentace!E51)","v":""},null,null,null,null,null,null,null,null,null,null,null,null,null,null,null,null,0]
[{"$f":"IF(Prezentace!A52=0,\"\",Prezentace!A52)","v":""},{"$f":"IF(Prezentace!B52=0,\"\",Prezentace!B52)","v":""},{"$f":"Prezentace!D52","v":"P"},{"$f":"IF(Prezentace!F52=0,\"\",Prezentace!F52)","v":""},{"$f":"IF(Prezentace!E52=0,\"\",Prezentace!E52)","v":""},null,null,null,null,null,null,null,null,null,null,null,null,null,null,null,null,0]
[{"$f":"IF(Prezentace!A53=0,\"\",Prezentace!A53)","v":""},{"$f":"IF(Prezentace!B53=0,\"\",Prezentace!B53)","v":""},{"$f":"Prezentace!D53","v":"P"},{"$f":"IF(Prezentace!F53=0,\"\",Prezentace!F53)","v":""},{"$f":"IF(Prezentace!E53=0,\"\",Prezentace!E53)","v":""},null,null,null,null,null,null,null,null,null,null,null,null,null,null,null,null,0]
[{"$f":"IF(Prezentace!A54=0,\"\",Prezentace!A54)","v":""},{"$f":"IF(Prezentace!B54=0,\"\",Prezentace!B54)","v":""},{"$f":"Prezentace!D54","v":"P"},{"$f":"IF(Prezentace!F54=0,\"\",Prezentace!F54)","v":""},{"$f":"IF(Prezentace!E54=0,\"\",Prezentace!E54)","v":""},null,null,null,null,null,null,null,null,null,null,null,null,null,null,null,null,0]
[{"$f":"IF(Prezentace!A55=0,\"\",Prezentace!A55)","v":""},{"$f":"IF(Prezentace!B55=0,\"\",Prezentace!B55)","v":""},{"$f":"Prezentace!D55","v":"P"},{"$f":"IF(Prezentace!F55=0,\"\",Prezentace!F55)","v":""},{"$f":"IF(Prezentace!E55=0,\"\",Prezentace!E55)","v":""},null,null,null,null,null,null,null,null,null,null,null,null,null,null,null,null,0]
[{"$f":"IF(Prezentace!A56=0,\"\",Prezentace!A56)","v":""},{"$f":"IF(Prezentace!B56=0,\"\",Prezentace!B56)","v":""},{"$f":"Prezentace!D56","v":"P"},{"$f":"IF(Prezentace!F56=0,\"\",Prezentace!F56)","v":""},{"$f":"IF(Prezentace!E56=0,\"\",Prezentace!E56)","v":""},null,null,null,null,null,null,null,null,null,null,null,null,null,null,null,null,0]
[{"$f":"IF(Prezentace!A57=0,\"\",Prezentace!A57)","v":""},{"$f":"IF(Prezentace!B57=0,\"\",Prezentace!B57)","v":""},{"$f":"Prezentace!D57","v":"P"},{"$f":"IF(Prezentace!F57=0,\"\",Prezentace!F57)","v":""},{"$f":"IF(Prezentace!E57=0,\"\",Prezentace!E57)","v":""},null,null,null,null,null,null,null,null,null,null,null,null,null,null,null,null,0]
[{"$f":"IF(Prezentace!A58=0,\"\",Prezentace!A58)","v":""},{"$f":"IF(Prezentace!B58=0,\"\",Prezentace!B58)","v":""},{"$f":"Prezentace!D58","v":"P"},{"$f":"IF(Prezentace!F58=0,\"\",Prezentace!F58)","v":""},{"$f":"IF(Prezentace!E58=0,\"\",Prezentace!E58)","v":""},null,null,null,null,null,null,null,null,null,null,null,null,null,null,null,null,0]
[{"$f":"IF(Prezentace!A59=0,\"\",Prezentace!A59)","v":""},{"$f":"IF(Prezentace!B59=0,\"\",Prezentace!B59)","v":""},{"$f":"Prezentace!D59","v":"P"},{"$f":"IF(Prezentace!F59=0,\"\",Prezentace!F59)","v":""},{"$f":"IF(Prezentace!E59=0,\"\",Prezentace!E59)","v":""},null,null,null,null,null,null,null,null,null,null,null,null,null,null,null,null,0]
[{"$f":"IF(Prezentace!A60=0,\"\",Prezentace!A60)","v":""},{"$f":"IF(Prezentace!B60=0,\"\",Prezentace!B60)","v":""},{"$f":"Prezentace!D60","v":"P"},{"$f":"IF(Prezentace!F60=0,\"\",Prezentace!F60)","v":""},{"$f":"IF(Prezentace!E60=0,\"\",Prezentace!E60)","v":""},null,null,null,null,null,null,null,null,null,null,null,null,null,null,null,null,0]
[{"$f":"IF(Prezentace!A61=0,\"\",Prezentace!A61)","v":""},{"$f":"IF(Prezentace!B61=0,\"\",Prezentace!B61)","v":""},{"$f":"Prezentace!D61","v":"P"},{"$f":"IF(Prezentace!F61=0,\"\",Prezentace!F61)","v":""},{"$f":"IF(Prezentace!E61=0,\"\",Prezentace!E61)","v":""},null,null,null,null,null,null,null,null,null,null,null,null,null,null,null,null,0]
[{"$f":"IF(Prezentace!A62=0,\"\",Prezentace!A62)","v":""},{"$f":"IF(Prezentace!B62=0,\"\",Prezentace!B62)","v":""},{"$f":"Prezentace!D62","v":"P"},{"$f":"IF(Prezentace!F62=0,\"\",Prezentace!F62)","v":""},{"$f":"IF(Prezentace!E62=0,\"\",Prezentace!E62)","v":""},null,null,null,null,null,null,null,null,null,null,null,null,null,null,null,null,0]
[{"$f":"IF(Prezentace!A63=0,\"\",Prezentace!A63)","v":""},{"$f":"IF(Prezentace!B63=0,\"\",Prezentace!B63)","v":""},{"$f":"Prezentace!D63","v":"P"},{"$f":"IF(Prezentace!F63=0,\"\",Prezentace!F63)","v":""},{"$f":"IF(Prezentace!E63=0,\"\",Prezentace!E63)","v":""},null,null,null,null,null,null,null,null,null,null,null,null,null,null,null,null,0]
[{"$f":"IF(Prezentace!A64=0,\"\",Prezentace!A64)","v":""},{"$f":"IF(Prezentace!B64=0,\"\",Prezentace!B64)","v":""},{"$f":"Prezentace!D64","v":"P"},{"$f":"IF(Prezentace!F64=0,\"\",Prezentace!F64)","v":""},{"$f":"IF(Prezentace!E64=0,\"\",Prezentace!E64)","v":""},null,null,null,null,null,null,null,null,null,null,null,null,null,null,null,null,0]
[{"$f":"IF(Prezentace!A65=0,\"\",Prezentace!A65)","v":""},{"$f":"IF(Prezentace!B65=0,\"\",Prezentace!B65)","v":""},{"$f":"Prezentace!D65","v":"P"},{"$f":"IF(Prezentace!F65=0,\"\",Prezentace!F65)","v":""},{"$f":"IF(Prezentace!E65=0,\"\",Prezentace!E65)","v":""},null,null,null,null,null,null,null,null,null,null,null,null,null,null,null,null,0]
[{"$f":"IF(Prezentace!A66=0,\"\",Prezentace!A66)","v":""},{"$f":"IF(Prezentace!B66=0,\"\",Prezentace!B66)","v":""},{"$f":"Prezentace!D66","v":"P"},{"$f":"IF(Prezentace!F66=0,\"\",Prezentace!F66)","v":""},{"$f":"IF(Prezentace!E66=0,\"\",Prezentace!E66)","v":""},null,null,null,null,null,null,null,null,null,null,null,null,null,null,null,null,0]
[{"$f":"IF(Prezentace!A67=0,\"\",Prezentace!A67)","v":""},{"$f":"IF(Prezentace!B67=0,\"\",Prezentace!B67)","v":""},{"$f":"Prezentace!D67","v":"P"},{"$f":"IF(Prezentace!F67=0,\"\",Prezentace!F67)","v":""},{"$f":"IF(Prezentace!E67=0,\"\",Prezentace!E67)","v":""},null,null,null,null,null,null,null,null,null,null,null,null,null,null,null,null,0]
[{"$f":"IF(Prezentace!A68=0,\"\",Prezentace!A68)","v":""},{"$f":"IF(Prezentace!B68=0,\"\",Prezentace!B68)","v":""},{"$f":"Prezentace!D68","v":"P"},{"$f":"IF(Prezentace!F68=0,\"\",Prezentace!F68)","v":""},{"$f":"IF(Prezentace!E68=0,\"\",Prezentace!E68)","v":""},null,null,null,null,null,null,null,null,null,null,null,null,null,null,null,null,0]
[{"$f":"IF(Prezentace!A69=0,\"\",Prezentace!A69)","v":""},{"$f":"IF(Prezentace!B69=0,\"\",Prezentace!B69)","v":""},{"$f":"Prezentace!D69","v":"P"},{"$f":"IF(Prezentace!F69=0,\"\",Prezentace!F69)","v":""},{"$f":"IF(Prezentace!E69=0,\"\",Prezentace!E69)","v":""},null,null,null,null,null,null,null,null,null,null,null,null,null,null,null,null,0]
[{"$f":"IF(Prezentace!A70=0,\"\",Prezentace!A70)","v":""},{"$f":"IF(Prezentace!B70=0,\"\",Prezentace!B70)","v":""},{"$f":"Prezentace!D70","v":"P"},{"$f":"IF(Prezentace!F70=0,\"\",Prezentace!F70)","v":""},{"$f":"IF(Prezentace!E70=0,\"\",Prezentace!E70)","v":""},null,null,null,null,null,null,null,null,null,null,null,null,null,null,null,null,0]
[{"$f":"IF(Prezentace!A71=0,\"\",Prezentace!A71)","v":""},{"$f":"IF(Prezentace!B71=0,\"\",Prezentace!B71)","v":""},{"$f":"Prezentace!D71","v":"P"},{"$f":"IF(Prezentace!F71=0,\"\",Prezentace!F71)","v":""},{"$f":"IF(Prezentace!E71=0,\"\",Prezentace!E71)","v":""},null,null,null,null,null,null,null,null,null,null,null,null,null,null,null,null,0]
[{"$f":"IF(Prezentace!A72=0,\"\",Prezentace!A72)","v":""},{"$f":"IF(Prezentace!B72=0,\"\",Prezentace!B72)","v":""},{"$f":"Prezentace!D72","v":"P"},{"$f":"IF(Prezentace!F72=0,\"\",Prezentace!F72)","v":""},{"$f":"IF(Prezentace!E72=0,\"\",Prezentace!E72)","v":""},null,null,null,null,null,null,null,null,null,null,null,null,null,null,null,null,0]
[{"$f":"IF(Prezentace!A73=0,\"\",Prezentace!A73)","v":""},{"$f":"IF(Prezentace!B73=0,\"\",Prezentace!B73)","v":""},{"$f":"Prezentace!D73","v":"P"},{"$f":"IF(Prezentace!F73=0,\"\",Prezentace!F73)","v":""},{"$f":"IF(Prezentace!E73=0,\"\",Prezentace!E73)","v":""},null,null,null,null,null,null,null,null,null,null,null,null,null,null,null,null,0]
[{"$f":"IF(Prezentace!A74=0,\"\",Prezentace!A74)","v":""},{"$f":"IF(Prezentace!B74=0,\"\",Prezentace!B74)","v":""},{"$f":"Prezentace!D74","v":"P"},{"$f":"IF(Prezentace!F74=0,\"\",Prezentace!F74)","v":""},{"$f":"IF(Prezentace!E74=0,\"\",Prezentace!E74)","v":""},null,null,null,null,null,null,null,null,null,null,null,null,null,null,null,null,0]
[{"$f":"IF(Prezentace!A75=0,\"\",Prezentace!A75)","v":""},{"$f":"IF(Prezentace!B75=0,\"\",Prezentace!B75)","v":""},{"$f":"Prezentace!D75","v":"P"},{"$f":"IF(Prezentace!F75=0,\"\",Prezentace!F75)","v":""},{"$f":"IF(Prezentace!E75=0,\"\",Prezentace!E75)","v":""},null,null,null,null,null,null,null,null,null,null,null,null,null,null,null,null,{"$f":"(SUM(F101:T101))-U101","v":0}]

{"sheet":"4(M)","index":9,"n_rows":102,"n_cols":20,"rows_kept":102,"cut":false,"hidden":true,"merged":[[0,3,0,18],[0,0,2,0],[0,1,2,1]]}
["Druž.","Kap.",null,"Disciplina 4"]
[]
[null,null,null,null,null,0,1,2,3,4,5,6,7,8,9,10,12,15,"Čas","Součet"]
[{"$f":"IF(Prezentace!A6=0,\"\",Prezentace!A6)","v":""},{"$f":"IF(Prezentace!B6=0,\"\",Prezentace!B6)","v":""},{"$f":"Prezentace!D6","v":"P"},{"$f":"IF(Prezentace!F6=0,\"\",Prezentace!F6)","v":"Milan"},{"$f":"IF(Prezentace!E6=0,\"\",Prezentace!E6)","v":"Matějka st."},null,null,null,null,null,null,null,null,null,null,null,null,null,null,{"$f":"(SUM(F4*$F$3,G4*$G$3,H4*$H$3,I4*$I$3,J4*$J$3,K4*$K$3,L4*$L$3,M4*$M$3,N4*$N$3,O4*$O$3,P4*$P$3,Q4*$Q$3,R4*$R$3))-S4","v":0}]
[{"$f":"IF(Prezentace!A7=0,\"\",Prezentace!A7)","v":""},{"$f":"IF(Prezentace!B7=0,\"\",Prezentace!B7)","v":""},{"$f":"Prezentace!D7","v":"P"},{"$f":"IF(Prezentace!F7=0,\"\",Prezentace!F7)","v":"Miroslav"},{"$f":"IF(Prezentace!E7=0,\"\",Prezentace!E7)","v":"Fiala  "},null,null,null,null,null,null,null,null,null,null,null,null,null,null,{"$f":"(SUM(F5*$F$3,G5*$G$3,H5*$H$3,I5*$I$3,J5*$J$3,K5*$K$3,L5*$L$3,M5*$M$3,N5*$N$3,O5*$O$3,P5*$P$3,Q5*$Q$3,R5*$R$3))-S5","v":0}]
[{"$f":"IF(Prezentace!A8=0,\"\",Prezentace!A8)","v":""},{"$f":"IF(Prezentace!B8=0,\"\",Prezentace!B8)","v":""},{"$f":"Prezentace!D8","v":"P"},{"$f":"IF(Prezentace!F8=0,\"\",Prezentace!F8)","v":"František"},{"$f":"IF(Prezentace!E8=0,\"\",Prezentace!E8)","v":"Toman "},null,null,null,null,null,null,null,null,null,null,null,null,null,null,0]
[{"$f":"IF(Prezentace!A9=0,\"\",Prezentace!A9)","v":""},{"$f":"IF(Prezentace!B9=0,\"\",Prezentace!B9)","v":""},{"$f":"Prezentace!D9","v":"P"},{"$f":"IF(Prezentace!F9=0,\"\",Prezentace!F9)","v":"Jiří"},{"$f":"IF(Prezentace!E9=0,\"\",Prezentace!E9)","v":"Švihálek "},null,null,null,null,null,null,null,null,null,null,null,null,null,null,0]
[{"$f":"IF(Prezentace!A10=0,\"\",Prezentace!A10)","v":""},{"$f":"IF(Prezentace!B10=0,\"\",Prezentace!B10)","v":""},{"$f":"Prezentace!D10","v":"R"},{"$f":"IF(Prezentace!F10=0,\"\",Prezentace!F10)","v":"Jiří"},{"$f":"IF(Prezentace!E10=0,\"\",Prezentace!E10)","v":"Švihálek "},null,null,null,null,null,null,null,null,null,null,null,null,null,null,0]
[{"$f":"IF(Prezentace!A11=0,\"\",Prezentace!A11)","v":""},{"$f":"IF(Prezentace!B11=0,\"\",Prezentace!B11)","v":""},{"$f":"Prezentace!D11","v":"P"},{"$f":"IF(Prezentace!F11=0,\"\",Prezentace!F11)","v":"Vladimír"},{"$f":"IF(Prezentace!E11=0,\"\",Prezentace!E11)","v":"VejslíK "},null,null,null,null,null,null,null,null,null,null,null,null,null,null,0]
[{"$f":"IF(Prezentace!A12=0,\"\",Prezentace!A12)","v":""},{"$f":"IF(Prezentace!B12=0,\"\",Prezentace!B12)","v":""},{"$f":"Prezentace!D12","v":"P"},{"$f":"IF(Prezentace!F12=0,\"\",Prezentace!F12)","v":"Milan"},{"$f":"IF(Prezentace!E12=0,\"\",Prezentace!E12)","v":"Kraus "},null,null,null,null,null,null,null,null,null,null,null,null,null,null,0]
[{"$f":"IF(Prezentace!#REF!=0,\"\",Prezentace!#REF!)","v":{"$error":"#REF!"}},{"$f":"IF(Prezentace!#REF!=0,\"\",Prezentace!#REF!)","v":{"$error":"#REF!"}},{"$f":"Prezentace!#REF!","v":{"$error":"#REF!"}},{"$f":"IF(Prezentace!#REF!=0,\"\",Prezentace!#REF!)","v":{"$error":"#REF!"}},{"$f":"IF(Prezentace!#REF!=0,\"\",Prezentace!#REF!)","v":{"$error":"#REF!"}},null,null,null,null,null,null,null,null,null,null,null,null,null,null,0]
[{"$f":"IF(Prezentace!A13=0,\"\",Prezentace!A13)","v":""},{"$f":"IF(Prezentace!B13=0,\"\",Prezentace!B13)","v":""},{"$f":"Prezentace!D13","v":"P"},{"$f":"IF(Prezentace!F13=0,\"\",Prezentace!F13)","v":"Vojtěch"},{"$f":"IF(Prezentace!E13=0,\"\",Prezentace!E13)","v":"Brejžek "},null,null,null,null,null,null,null,null,null,null,null,null,null,null,0]
[{"$f":"IF(Prezentace!A14=0,\"\",Prezentace!A14)","v":""},{"$f":"IF(Prezentace!B14=0,\"\",Prezentace!B14)","v":""},{"$f":"Prezentace!D14","v":"P"},{"$f":"IF(Prezentace!F14=0,\"\",Prezentace!F14)","v":"Karel"},{"$f":"IF(Prezentace!E14=0,\"\",Prezentace!E14)","v":"Získal "},null,null,null,null,null,null,null,null,null,null,null,null,null,null,0]
[{"$f":"IF(Prezentace!A15=0,\"\",Prezentace!A15)","v":""},{"$f":"IF(Prezentace!B15=0,\"\",Prezentace!B15)","v":""},{"$f":"Prezentace!D15","v":"R"},{"$f":"IF(Prezentace!F15=0,\"\",Prezentace!F15)","v":"Karel"},{"$f":"IF(Prezentace!E15=0,\"\",Prezentace!E15)","v":"Získal "},null,null,null,null,null,null,null,null,null,null,null,null,null,null,0]
[{"$f":"IF(Prezentace!A16=0,\"\",Prezentace!A16)","v":""},{"$f":"IF(Prezentace!B16=0,\"\",Prezentace!B16)","v":""},{"$f":"Prezentace!D16","v":"P"},{"$f":"IF(Prezentace!F16=0,\"\",Prezentace!F16)","v":"Marie"},{"$f":"IF(Prezentace!E16=0,\"\",Prezentace!E16)","v":"Žemličková"},null,null,null,null,null,null,null,null,null,null,null,null,null,null,0]
[{"$f":"IF(Prezentace!A17=0,\"\",Prezentace!A17)","v":""},{"$f":"IF(Prezentace!B17=0,\"\",Prezentace!B17)","v":""},{"$f":"Prezentace!D17","v":"P"},{"$f":"IF(Prezentace!F17=0,\"\",Prezentace!F17)","v":"Ladislav"},{"$f":"IF(Prezentace!E17=0,\"\",Prezentace!E17)","v":"Žemlička "},null,null,null,null,null,null,null,null,null,null,null,null,null,null,0]
[{"$f":"IF(Prezentace!A18=0,\"\",Prezentace!A18)","v":""},{"$f":"IF(Prezentace!B18=0,\"\",Prezentace!B18)","v":""},{"$f":"Prezentace!D18","v":"P"},{"$f":"IF(Prezentace!F18=0,\"\",Prezentace!F18)","v":"Jiří"},{"$f":"IF(Prezentace!E18=0,\"\",Prezentace!E18)","v":"Janovský "},null,null,null,null,null,null,null,null,null,null,null,null,null,null,0]
[{"$f":"IF(Prezentace!A19=0,\"\",Prezentace!A19)","v":""},{"$f":"IF(Prezentace!B19=0,\"\",Prezentace!B19)","v":""},{"$f":"Prezentace!D19","v":"P"},{"$f":"IF(Prezentace!F19=0,\"\",Prezentace!F19)","v":"Mojmír"},{"$f":"IF(Prezentace!E19=0,\"\",Prezentace!E19)","v":"Janovský "},null,null,null,null,null,null,null,null,null,null,null,null,null,null,0]
[{"$f":"IF(Prezentace!A20=0,\"\",Prezentace!A20)","v":""},{"$f":"IF(Prezentace!B20=0,\"\",Prezentace!B20)","v":""},{"$f":"Prezentace!D20","v":"P"},{"$f":"IF(Prezentace!F20=0,\"\",Prezentace!F20)","v":"Bohumil"},{"$f":"IF(Prezentace!E20=0,\"\",Prezentace!E20)","v":"Herceg"},null,null,null,null,null,null,null,null,null,null,null,null,null,null,0]
[{"$f":"IF(Prezentace!A21=0,\"\",Prezentace!A21)","v":""},{"$f":"IF(Prezentace!B21=0,\"\",Prezentace!B21)","v":""},{"$f":"Prezentace!D21","v":"P"},{"$f":"IF(Prezentace!F21=0,\"\",Prezentace!F21)","v":"Michal"},{"$f":"IF(Prezentace!E21=0,\"\",Prezentace!E21)","v":"Svoboda"},null,null,null,null,null,null,null,null,null,null,null,null,null,null,0]
[{"$f":"IF(Prezentace!A22=0,\"\",Prezentace!A22)","v":""},{"$f":"IF(Prezentace!B22=0,\"\",Prezentace!B22)","v":""},{"$f":"Prezentace!D22","v":"P"},{"$f":"IF(Prezentace!F22=0,\"\",Prezentace!F22)","v":"Viktor"},{"$f":"IF(Prezentace!E22=0,\"\",Prezentace!E22)","v":"Fuksa  "},null,null,null,null,null,null,null,null,null,null,null,null,null,null,0]
[{"$f":"IF(Prezentace!A23=0,\"\",Prezentace!A23)","v":""},{"$f":"IF(Prezentace!B23=0,\"\",Prezentace!B23)","v":""},{"$f":"Prezentace!D23","v":"P"},{"$f":"IF(Prezentace!F23=0,\"\",Prezentace!F23)","v":"Miroslav"},{"$f":"IF(Prezentace!E23=0,\"\",Prezentace!E23)","v":"Koch   ml."},null,null,null,null,null,null,null,null,null,null,null,null,null,null,0]
[{"$f":"IF(Prezentace!A24=0,\"\",Prezentace!A24)","v":""},{"$f":"IF(Prezentace!B24=0,\"\",Prezentace!B24)","v":""},{"$f":"Prezentace!D24","v":"P"},{"$f":"IF(Prezentace!F24=0,\"\",Prezentace!F24)","v":"Miroslav"},{"$f":"IF(Prezentace!E24=0,\"\",Prezentace!E24)","v":"Koch  st. "},null,null,null,null,null,null,null,null,null,null,null,null,null,null,0]
[{"$f":"IF(Prezentace!A25=0,\"\",Prezentace!A25)","v":""},{"$f":"IF(Prezentace!B25=0,\"\",Prezentace!B25)","v":""},{"$f":"Prezentace!D25","v":"P"},{"$f":"IF(Prezentace!F25=0,\"\",Prezentace!F25)","v":"Jaroslav"},{"$f":"IF(Prezentace!E25=0,\"\",Prezentace!E25)","v":"Kostříž "},null,null,null,null,null,null,null,null,null,null,null,null,null,null,0]
[{"$f":"IF(Prezentace!A26=0,\"\",Prezentace!A26)","v":""},{"$f":"IF(Prezentace!B26=0,\"\",Prezentace!B26)","v":""},{"$f":"Prezentace!D26","v":"P"},{"$f":"IF(Prezentace!F26=0,\"\",Prezentace!F26)","v":"Josef"},{"$f":"IF(Prezentace!E26=0,\"\",Prezentace!E26)","v":"Čekal "},null,null,null,null,null,null,null,null,null,null,null,null,null,null,0]
[{"$f":"IF(Prezentace!A27=0,\"\",Prezentace!A27)","v":""},{"$f":"IF(Prezentace!B27=0,\"\",Prezentace!B27)","v":""},{"$f":"Prezentace!D27","v":"P"},{"$f":"IF(Prezentace!F27=0,\"\",Prezentace!F27)","v":"Miloslav"},{"$f":"IF(Prezentace!E27=0,\"\",Prezentace!E27)","v":"Petržílka"},null,null,null,null,null,null,null,null,null,null,null,null,null,null,0]
[{"$f":"IF(Prezentace!A28=0,\"\",Prezentace!A28)","v":""},{"$f":"IF(Prezentace!B28=0,\"\",Prezentace!B28)","v":""},{"$f":"Prezentace!D28","v":"P"},{"$f":"IF(Prezentace!F28=0,\"\",Prezentace!F28)","v":"Václav"},{"$f":"IF(Prezentace!E28=0,\"\",Prezentace!E28)","v":"Landkammer"},null,null,null,null,null,null,null,null,null,null,null,null,null,null,0]
[{"$f":"IF(Prezentace!A29=0,\"\",Prezentace!A29)","v":""},{"$f":"IF(Prezentace!B29=0,\"\",Prezentace!B29)","v":""},{"$f":"Prezentace!D29","v":"P"},{"$f":"IF(Prezentace!F29=0,\"\",Prezentace!F29)","v":"Albert"},{"$f":"IF(Prezentace!E29=0,\"\",Prezentace!E29)","v":"Wrzecionko"},null,null,null,null,null,null,null,null,null,null,null,null,null,null,0]
[{"$f":"IF(Prezentace!A30=0,\"\",Prezentace!A30)","v":""},{"$f":"IF(Prezentace!B30=0,\"\",Prezentace!B30)","v":""},{"$f":"Prezentace!D30","v":"P"},{"$f":"IF(Prezentace!F30=0,\"\",Prezentace!F30)","v":"Michaela"},{"$f":"IF(Prezentace!E30=0,\"\",Prezentace!E30)","v":"Reisnerová"},null,null,null,null,null,null,null,null,null,null,null,null,null,null,0]
[{"$f":"IF(Prezentace!A31=0,\"\",Prezentace!A31)","v":""},{"$f":"IF(Prezentace!B31=0,\"\",Prezentace!B31)","v":""},{"$f":"Prezentace!D31","v":"P"},{"$f":"IF(Prezentace!F31=0,\"\",Prezentace!F31)","v":"Antonín"},{"$f":"IF(Prezentace!E31=0,\"\",Prezentace!E31)","v":"Urbanec  "},null,null,null,null,null,null,null,null,null,null,null,null,null,null,0]
[{"$f":"IF(Prezentace!#REF!=0,\"\",Prezentace!#REF!)","v":{"$error":"#REF!"}},{"$f":"IF(Prezentace!#REF!=0,\"\",Prezentace!#REF!)","v":{"$error":"#REF!"}},{"$f":"Prezentace!#REF!","v":{"$error":"#REF!"}},{"$f":"IF(Prezentace!#REF!=0,\"\",Prezentace!#REF!)","v":{"$error":"#REF!"}},{"$f":"IF(Prezentace!#REF!=0,\"\",Prezentace!#REF!)","v":{"$error":"#REF!"}},null,null,null,null,null,null,null,null,null,null,null,null,null,null,0]
[{"$f":"IF(Prezentace!#REF!=0,\"\",Prezentace!#REF!)","v":{"$error":"#REF!"}},{"$f":"IF(Prezentace!#REF!=0,\"\",Prezentace!#REF!)","v":{"$error":"#REF!"}},{"$f":"Prezentace!#REF!","v":{"$error":"#REF!"}},{"$f":"IF(Prezentace!#REF!=0,\"\",Prezentace!#REF!)","v":{"$error":"#REF!"}},{"$f":"IF(Prezentace!#REF!=0,\"\",Prezentace!#REF!)","v":{"$error":"#REF!"}},null,null,null,null,null,null,null,null,null,null,null,null,null,null,0]
[{"$f":"IF(Prezentace!#REF!=0,\"\",Prezentace!#REF!)","v":{"$error":"#REF!"}},{"$f":"IF(Prezentace!#REF!=0,\"\",Prezentace!#REF!)","v":{"$error":"#REF!"}},{"$f":"Prezentace!#REF!","v":{"$error":"#REF!"}},{"$f":"IF(Prezentace!#REF!=0,\"\",Prezentace!#REF!)","v":{"$error":"#REF!"}},{"$f":"IF(Prezentace!#REF!=0,\"\",Prezentace!#REF!)","v":{"$error":"#REF!"}},null,null,null,null,null,null,null,null,null,null,null,null,null,null,0]
[{"$f":"IF(Prezentace!#REF!=0,\"\",Prezentace!#REF!)","v":{"$error":"#REF!"}},{"$f":"IF(Prezentace!#REF!=0,\"\",Prezentace!#REF!)","v":{"$error":"#REF!"}},{"$f":"Prezentace!#REF!","v":{"$error":"#REF!"}},{"$f":"IF(Prezentace!#REF!=0,\"\",Prezentace!#REF!)","v":{"$error":"#REF!"}},{"$f":"IF(Prezentace!#REF!=0,\"\",Prezentace!#REF!)","v":{"$error":"#REF!"}},null,null,null,null,null,null,null,null,null,null,null,null,null,null,0]
[{"$f":"IF(Prezentace!#REF!=0,\"\",Prezentace!#REF!)","v":{"$error":"#REF!"}},{"$f":"IF(Prezentace!#REF!=0,\"\",Prezentace!#REF!)","v":{"$error":"#REF!"}},{"$f":"Prezentace!#REF!","v":{"$error":"#REF!"}},{"$f":"IF(Prezentace!#REF!=0,\"\",Prezentace!#REF!)","v":{"$error":"#REF!"}},{"$f":"IF(Prezentace!#REF!=0,\"\",Prezentace!#REF!)","v":{"$error":"#REF!"}},null,null,null,null,null,null,null,null,null,null,null,null,null,null,0]
[{"$f":"IF(Prezentace!#REF!=0,\"\",Prezentace!#REF!)","v":{"$error":"#REF!"}},{"$f":"IF(Prezentace!#REF!=0,\"\",Prezentace!#REF!)","v":{"$error":"#REF!"}},{"$f":"Prezentace!#REF!","v":{"$error":"#REF!"}},{"$f":"IF(Prezentace!#REF!=0,\"\",Prezentace!#REF!)","v":{"$error":"#REF!"}},{"$f":"IF(Prezentace!#REF!=0,\"\",Prezentace!#REF!)","v":{"$error":"#REF!"}},null,null,null,null,null,null,null,null,null,null,null,null,null,null,0]
[{"$f":"IF(Prezentace!#REF!=0,\"\",Prezentace!#REF!)","v":{"$error":"#REF!"}},{"$f":"IF(Prezentace!#REF!=0,\"\",Prezentace!#REF!)","v":{"$error":"#REF!"}},{"$f":"Prezentace!#REF!","v":{"$error":"#REF!"}},{"$f":"IF(Prezentace!#REF!=0,\"\",Prezentace!#REF!)","v":{"$error":"#REF!"}},{"$f":"IF(Prezentace!#REF!=0,\"\",Prezentace!#REF!)","v":{"$error":"#REF!"}},null,null,null,null,null,null,null,null,null,null,null,null,null,null,0]
[{"$f":"IF(Prezentace!#REF!=0,\"\",Prezentace!#REF!)","v":{"$error":"#REF!"}},{"$f":"IF(Prezentace!#REF!=0,\"\",Prezentace!#REF!)","v":{"$error":"#REF!"}},{"$f":"Prezentace!#REF!","v":{"$error":"#REF!"}},{"$f":"IF(Prezentace!#REF!=0,\"\",Prezentace!#REF!)","v":{"$error":"#REF!"}},{"$f":"IF(Prezentace!#REF!=0,\"\",Prezentace!#REF!)","v":{"$error":"#REF!"}},null,null,null,null,null,null,null,null,null,null,null,null,null,null,{"$f":"(SUM(F38*$F$3,G38*$G$3,H38*$H$3,I38*$I$3,J38*$J$3,K38*$K$3,L38*$L$3,M38*$M$3,N38*$N$3,O38*$O$3,P38*$P$3,Q38*$Q$3,R38*$R$3))-S38","v":0}]
[{"$f":"IF(Prezentace!#REF!=0,\"\",Prezentace!#REF!)","v":{"$error":"#REF!"}},{"$f":"IF(Prezentace!#REF!=0,\"\",Prezentace!#REF!)","v":{"$error":"#REF!"}},{"$f":"Prezentace!#REF!","v":{"$error":"#REF!"}},{"$f":"IF(Prezentace!#REF!=0,\"\",Prezentace!#REF!)","v":{"$error":"#REF!"}},{"$f":"IF(Prezentace!#REF!=0,\"\",Prezentace!#REF!)","v":{"$error":"#REF!"}},null,null,null,null,null,null,null,null,null,null,null,null,null,null,0]
[{"$f":"IF(Prezentace!#REF!=0,\"\",Prezentace!#REF!)","v":{"$error":"#REF!"}},{"$f":"IF(Prezentace!#REF!=0,\"\",Prezentace!#REF!)","v":{"$error":"#REF!"}},{"$f":"Prezentace!#REF!","v":{"$error":"#REF!"}},{"$f":"IF(Prezentace!#REF!=0,\"\",Prezentace!#REF!)","v":{"$error":"#REF!"}},{"$f":"IF(Prezentace!#REF!=0,\"\",Prezentace!#REF!)","v":{"$error":"#REF!"}},null,null,null,null,null,null,null,null,null,null,null,null,null,null,0]
[{"$f":"IF(Prezentace!#REF!=0,\"\",Prezentace!#REF!)","v":{"$error":"#REF!"}},{"$f":"IF(Prezentace!#REF!=0,\"\",Prezentace!#REF!)","v":{"$error":"#REF!"}},{"$f":"Prezentace!#REF!","v":{"$error":"#REF!"}},{"$f":"IF(Prezentace!#REF!=0,\"\",Prezentace!#REF!)","v":{"$error":"#REF!"}},{"$f":"IF(Prezentace!#REF!=0,\"\",Prezentace!#REF!)","v":{"$error":"#REF!"}},null,null,null,null,null,null,null,null,null,null,null,null,null,null,0]
[{"$f":"IF(Prezentace!#REF!=0,\"\",Prezentace!#REF!)","v":{"$error":"#REF!"}},{"$f":"IF(Prezentace!#REF!=0,\"\",Prezentace!#REF!)","v":{"$error":"#REF!"}},{"$f":"Prezentace!#REF!","v":{"$error":"#REF!"}},{"$f":"IF(Prezentace!#REF!=0,\"\",Prezentace!#REF!)","v":{"$error":"#REF!"}},{"$f":"IF(Prezentace!#REF!=0,\"\",Prezentace!#REF!)","v":{"$error":"#REF!"}},null,null,null,null,null,null,null,null,null,null,null,null,null,null,0]
[{"$f":"IF(Prezentace!#REF!=0,\"\",Prezentace!#REF!)","v":{"$error":"#REF!"}},{"$f":"IF(Prezentace!#REF!=0,\"\",Prezentace!#REF!)","v":{"$error":"#REF!"}},{"$f":"Prezentace!#REF!","v":{"$error":"#REF!"}},{"$f":"IF(Prezentace!#REF!=0,\"\",Prezentace!#REF!)","v":{"$error":"#REF!"}},{"$f":"IF(Prezentace!#REF!=0,\"\",Prezentace!#REF!)","v":{"$error":"#REF!"}},null,null,null,null,null,null,null,null,null,null,null,null,null,null,0]
[{"$f":"IF(Prezentace!#REF!=0,\"\",Prezentace!#REF!)","v":{"$error":"#REF!"}},{"$f":"IF(Prezentace!#REF!=0,\"\",Prezentace!#REF!)","v":{"$error":"#REF!"}},{"$f":"Prezentace!#REF!","v":{"$error":"#REF!"}},{"$f":"IF(Prezentace!#REF!=0,\"\",Prezentace!#REF!)","v":{"$error":"#REF!"}},{"$f":"IF(Prezentace!#REF!=0,\"\",Prezentace!#REF!)","v":{"$error":"#REF!"}},null,null,null,null,null,null,null,null,null,null,null,null,null,null,0]
[{"$f":"IF(Prezentace!#REF!=0,\"\",Prezentace!#REF!)","v":{"$error":"#REF!"}},{"$f":"IF(Prezentace!#REF!=0,\"\",Prezentace!#REF!)","v":{"$error":"#REF!"}},{"$f":"Prezentace!#REF!","v":{"$error":"#REF!"}},{"$f":"IF(Prezentace!#REF!=0,\"\",Prezentace!#REF!)","v":{"$error":"#REF!"}},{"$f":"IF(Prezentace!#REF!=0,\"\",Prezentace!#REF!)","v":{"$error":"#REF!"}},null,null,null,null,null,null,null,null,null,null,null,null,null,null,0]
[{"$f":"IF(Prezentace!#REF!=0,\"\",Prezentace!#REF!)","v":{"$error":"#REF!"}},{"$f":"IF(Prezentace!#REF!=0,\"\",Prezentace!#REF!)","v":{"$error":"#REF!"}},{"$f":"Prezentace!#REF!","v":{"$error":"#REF!"}},{"$f":"IF(Prezentace!#REF!=0,\"\",Prezentace!#REF!)","v":{"$error":"#REF!"}},{"$f":"IF(Prezentace!#REF!=0,\"\",Prezentace!#REF!)","v":{"$error":"#REF!"}},null,null,null,null,null,null,null,null,null,null,null,null,null,null,0]
[{"$f":"IF(Prezentace!#REF!=0,\"\",Prezentace!#REF!)","v":{"$error":"#REF!"}},{"$f":"IF(Prezentace!#REF!=0,\"\",Prezentace!#REF!)","v":{"$error":"#REF!"}},{"$f":"Prezentace!#REF!","v":{"$error":"#REF!"}},{"$f":"IF(Prezentace!#REF!=0,\"\",Prezentace!#REF!)","v":{"$error":"#REF!"}},{"$f":"IF(Prezentace!#REF!=0,\"\",Prezentace!#REF!)","v":{"$error":"#REF!"}},null,null,null,null,null,null,null,null,null,null,null,null,null,null,0]
[{"$f":"IF(Prezentace!#REF!=0,\"\",Prezentace!#REF!)","v":{"$error":"#REF!"}},{"$f":"IF(Prezentace!#REF!=0,\"\",Prezentace!#REF!)","v":{"$error":"#REF!"}},{"$f":"Prezentace!#REF!","v":{"$error":"#REF!"}},{"$f":"IF(Prezentace!#REF!=0,\"\",Prezentace!#REF!)","v":{"$error":"#REF!"}},{"$f":"IF(Prezentace!#REF!=0,\"\",Prezentace!#REF!)","v":{"$error":"#REF!"}},null,null,null,null,null,null,null,null,null,null,null,null,null,null,0]
[{"$f":"IF(Prezentace!#REF!=0,\"\",Prezentace!#REF!)","v":{"$error":"#REF!"}},{"$f":"IF(Prezentace!#REF!=0,\"\",Prezentace!#REF!)","v":{"$error":"#REF!"}},{"$f":"Prezentace!#REF!","v":{"$error":"#REF!"}},{"$f":"IF(Prezentace!#REF!=0,\"\",Prezentace!#REF!)","v":{"$error":"#REF!"}},{"$f":"IF(Prezentace!#REF!=0,\"\",Prezentace!#REF!)","v":{"$error":"#REF!"}},null,null,null,null,null,null,null,null,null,null,null,null,null,null,0]
[{"$f":"IF(Prezentace!#REF!=0,\"\",Prezentace!#REF!)","v":{"$error":"#REF!"}},{"$f":"IF(Prezentace!#REF!=0,\"\",Prezentace!#REF!)","v":{"$error":"#REF!"}},{"$f":"Prezentace!#REF!","v":{"$error":"#REF!"}},{"$f":"IF(Prezentace!#REF!=0,\"\",Prezentace!#REF!)","v":{"$error":"#REF!"}},{"$f":"IF(Prezentace!#REF!=0,\"\",Prezentace!#REF!)","v":{"$error":"#REF!"}},null,null,null,null,null,null,null,null,null,null,null,null,null,null,0]
[{"$f":"IF(Prezentace!#REF!=0,\"\",Prezentace!#REF!)","v":{"$error":"#REF!"}},{"$f":"IF(Prezentace!#REF!=0,\"\",Prezentace!#REF!)","v":{"$error":"#REF!"}},{"$f":"Prezentace!#REF!","v":{"$error":"#REF!"}},{"$f":"IF(Prezentace!#REF!=0,\"\",Prezentace!#REF!)","v":{"$error":"#REF!"}},{"$f":"IF(Prezentace!#REF!=0,\"\",Prezentace!#REF!)","v":{"$error":"#REF!"}},null,null,null,null,null,null,null,null,null,null,null,null,null,null,0]
[{"$f":"IF(Prezentace!#REF!=0,\"\",Prezentace!#REF!)","v":{"$error":"#REF!"}},{"$f":"IF(Prezentace!#REF!=0,\"\",Prezentace!#REF!)","v":{"$error":"#REF!"}},{"$f":"Prezentace!#REF!","v":{"$error":"#REF!"}},{"$f":"IF(Prezentace!#REF!=0,\"\",Prezentace!#REF!)","v":{"$error":"#REF!"}},{"$f":"IF(Prezentace!#REF!=0,\"\",Prezentace!#REF!)","v":{"$error":"#REF!"}},null,null,null,null,null,null,null,null,null,null,null,null,null,null,0]
[{"$f":"IF(Prezentace!#REF!=0,\"\",Prezentace!#REF!)","v":{"$error":"#REF!"}},{"$f":"IF(Prezentace!#REF!=0,\"\",Prezentace!#REF!)","v":{"$error":"#REF!"}},{"$f":"Prezentace!#REF!","v":{"$error":"#REF!"}},{"$f":"IF(Prezentace!#REF!=0,\"\",Prezentace!#REF!)","v":{"$error":"#REF!"}},{"$f":"IF(Prezentace!#REF!=0,\"\",Prezentace!#REF!)","v":{"$error":"#REF!"}},null,null,null,null,null,null,null,null,null,null,null,null,null,null,0]
[{"$f":"IF(Prezentace!#REF!=0,\"\",Prezentace!#REF!)","v":{"$error":"#REF!"}},{"$f":"IF(Prezentace!#REF!=0,\"\",Prezentace!#REF!)","v":{"$error":"#REF!"}},{"$f":"Prezentace!#REF!","v":{"$error":"#REF!"}},{"$f":"IF(Prezentace!#REF!=0,\"\",Prezentace!#REF!)","v":{"$error":"#REF!"}},{"$f":"IF(Prezentace!#REF!=0,\"\",Prezentace!#REF!)","v":{"$error":"#REF!"}},null,null,null,null,null,null,null,null,null,null,null,null,null,null,0]
[{"$f":"IF(Prezentace!#REF!=0,\"\",Prezentace!#REF!)","v":{"$error":"#REF!"}},{"$f":"IF(Prezentace!#REF!=0,\"\",Prezentace!#REF!)","v":{"$error":"#REF!"}},{"$f":"Prezentace!#REF!","v":{"$error":"#REF!"}},{"$f":"IF(Prezentace!#REF!=0,\"\",Prezentace!#REF!)","v":{"$error":"#REF!"}},{"$f":"IF(Prezentace!#REF!=0,\"\",Prezentace!#REF!)","v":{"$error":"#REF!"}},null,null,null,null,null,null,null,null,null,null,null,null,null,null,0]
[{"$f":"IF(Prezentace!#REF!=0,\"\",Prezentace!#REF!)","v":{"$error":"#REF!"}},{"$f":"IF(Prezentace!#REF!=0,\"\",Prezentace!#REF!)","v":{"$error":"#REF!"}},{"$f":"Prezentace!#REF!","v":{"$error":"#REF!"}},{"$f":"IF(Prezentace!#REF!=0,\"\",Prezentace!#REF!)","v":{"$error":"#REF!"}},{"$f":"IF(Prezentace!#REF!=0,\"\",Prezentace!#REF!)","v":{"$error":"#REF!"}},null,null,null,null,null,null,null,null,null,null,null,null,null,null,0]
[{"$f":"IF(Prezentace!#REF!=0,\"\",Prezentace!#REF!)","v":{"$error":"#REF!"}},{"$f":"IF(Prezentace!#REF!=0,\"\",Prezentace!#REF!)","v":{"$error":"#REF!"}},{"$f":"Prezentace!#REF!","v":{"$error":"#REF!"}},{"$f":"IF(Prezentace!#REF!=0,\"\",Prezentace!#REF!)","v":{"$error":"#REF!"}},{"$f":"IF(Prezentace!#REF!=0,\"\",Prezentace!#REF!)","v":{"$error":"#REF!"}},null,null,null,null,null,null,null,null,null,null,null,null,null,null,0]
[{"$f":"IF(Prezentace!#REF!=0,\"\",Prezentace!#REF!)","v":{"$error":"#REF!"}},{"$f":"IF(Prezentace!#REF!=0,\"\",Prezentace!#REF!)","v":{"$error":"#REF!"}},{"$f":"Prezentace!#REF!","v":{"$error":"#REF!"}},{"$f":"IF(Prezentace!#REF!=0,\"\",Prezentace!#REF!)","v":{"$error":"#REF!"}},{"$f":"IF(Prezentace!#REF!=0,\"\",Prezentace!#REF!)","v":{"$error":"#REF!"}},null,null,null,null,null,null,null,null,null,null,null,null,null,null,0]
[{"$f":"IF(Prezentace!A32=0,\"\",Prezentace!A32)","v":""},{"$f":"IF(Prezentace!B32=0,\"\",Prezentace!B32)","v":""},{"$f":"Prezentace!D32","v":"P"},{"$f":"IF(Prezentace!F32=0,\"\",Prezentace!F32)","v":""},{"$f":"IF(Prezentace!E32=0,\"\",Prezentace!E32)","v":""},null,null,null,null,null,null,null,null,null,null,null,null,null,null,0]
[{"$f":"IF(Prezentace!A33=0,\"\",Prezentace!A33)","v":""},{"$f":"IF(Prezentace!B33=0,\"\",Prezentace!B33)","v":""},{"$f":"Prezentace!D33","v":"P"},{"$f":"IF(Prezentace!F33=0,\"\",Prezentace!F33)","v":""},{"$f":"IF(Prezentace!E33=0,\"\",Prezentace!E33)","v":""},null,null,null,null,null,null,null,null,null,null,null,null,null,null,0]
[{"$f":"IF(Prezentace!A34=0,\"\",Prezentace!A34)","v":""},{"$f":"IF(Prezentace!B34=0,\"\",Prezentace!B34)","v":""},{"$f":"Prezentace!D34","v":"P"},{"$f":"IF(Prezentace!F34=0,\"\",Prezentace!F34)","v":""},{"$f":"IF(Prezentace!E34=0,\"\",Prezentace!E34)","v":""},null,null,null,null,null,null,null,null,null,null,null,null,null,null,0]
[{"$f":"IF(Prezentace!A35=0,\"\",Prezentace!A35)","v":""},{"$f":"IF(Prezentace!B35=0,\"\",Prezentace!B35)","v":""},{"$f":"Prezentace!D35","v":"P"},{"$f":"IF(Prezentace!F35=0,\"\",Prezentace!F35)","v":""},{"$f":"IF(Prezentace!E35=0,\"\",Prezentace!E35)","v":""},null,null,null,null,null,null,null,null,null,null,null,null,null,null,0]
[{"$f":"IF(Prezentace!A36=0,\"\",Prezentace!A36)","v":""},{"$f":"IF(Prezentace!B36=0,\"\",Prezentace!B36)","v":""},{"$f":"Prezentace!D36","v":"P"},{"$f":"IF(Prezentace!F36=0,\"\",Prezentace!F36)","v":""},{"$f":"IF(Prezentace!E36=0,\"\",Prezentace!E36)","v":""},null,null,null,null,null,null,null,null,null,null,null,null,null,null,0]
[{"$f":"IF(Prezentace!A37=0,\"\",Prezentace!A37)","v":""},{"$f":"IF(Prezentace!B37=0,\"\",Prezentace!B37)","v":""},{"$f":"Prezentace!D37","v":"P"},{"$f":"IF(Prezentace!F37=0,\"\",Prezentace!F37)","v":""},{"$f":"IF(Prezentace!E37=0,\"\",Prezentace!E37)","v":""},null,null,null,null,null,null,null,null,null,null,null,null,null,null,0]
[{"$f":"IF(Prezentace!A38=0,\"\",Prezentace!A38)","v":""},{"$f":"IF(Prezentace!B38=0,\"\",Prezentace!B38)","v":""},{"$f":"Prezentace!D38","v":"P"},{"$f":"IF(Prezentace!F38=0,\"\",Prezentace!F38)","v":""},{"$f":"IF(Prezentace!E38=0,\"\",Prezentace!E38)","v":""},null,null,null,null,null,null,null,null,null,null,null,null,null,null,0]
[{"$f":"IF(Prezentace!A39=0,\"\",Prezentace!A39)","v":""},{"$f":"IF(Prezentace!B39=0,\"\",Prezentace!B39)","v":""},{"$f":"Prezentace!D39","v":"P"},{"$f":"IF(Prezentace!F39=0,\"\",Prezentace!F39)","v":""},{"$f":"IF(Prezentace!E39=0,\"\",Prezentace!E39)","v":""},null,null,null,null,null,null,null,null,null,null,null,null,null,null,0]
[{"$f":"IF(Prezentace!A40=0,\"\",Prezentace!A40)","v":""},{"$f":"IF(Prezentace!B40=0,\"\",Prezentace!B40)","v":""},{"$f":"Prezentace!D40","v":"P"},{"$f":"IF(Prezentace!F40=0,\"\",Prezentace!F40)","v":""},{"$f":"IF(Prezentace!E40=0,\"\",Prezentace!E40)","v":""},null,null,null,null,null,null,null,null,null,null,null,null,null,null,0]
[{"$f":"IF(Prezentace!A41=0,\"\",Prezentace!A41)","v":""},{"$f":"IF(Prezentace!B41=0,\"\",Prezentace!B41)","v":""},{"$f":"Prezentace!D41","v":"P"},{"$f":"IF(Prezentace!F41=0,\"\",Prezentace!F41)","v":""},{"$f":"IF(Prezentace!E41=0,\"\",Prezentace!E41)","v":""},null,null,null,null,null,null,null,null,null,null,null,null,null,null,0]
[{"$f":"IF(Prezentace!A42=0,\"\",Prezentace!A42)","v":""},{"$f":"IF(Prezentace!B42=0,\"\",Prezentace!B42)","v":""},{"$f":"Prezentace!D42","v":"P"},{"$f":"IF(Prezentace!F42=0,\"\",Prezentace!F42)","v":""},{"$f":"IF(Prezentace!E42=0,\"\",Prezentace!E42)","v":""},null,null,null,null,null,null,null,null,null,null,null,null,null,null,0]
[{"$f":"IF(Prezentace!A43=0,\"\",Prezentace!A43)","v":""},{"$f":"IF(Prezentace!B43=0,\"\",Prezentace!B43)","v":""},{"$f":"Prezentace!D43","v":"P"},{"$f":"IF(Prezentace!F43=0,\"\",Prezentace!F43)","v":""},{"$f":"IF(Prezentace!E43=0,\"\",Prezentace!E43)","v":""},null,null,null,null,null,null,null,null,null,null,null,null,null,null,0]
[{"$f":"IF(Prezentace!A44=0,\"\",Prezentace!A44)","v":""},{"$f":"IF(Prezentace!B44=0,\"\",Prezentace!B44)","v":""},{"$f":"Prezentace!D44","v":"P"},{"$f":"IF(Prezentace!F44=0,\"\",Prezentace!F44)","v":""},{"$f":"IF(Prezentace!E44=0,\"\",Prezentace!E44)","v":""},null,null,null,null,null,null,null,null,null,null,null,null,null,null,0]
[{"$f":"IF(Prezentace!A45=0,\"\",Prezentace!A45)","v":""},{"$f":"IF(Prezentace!B45=0,\"\",Prezentace!B45)","v":""},{"$f":"Prezentace!D45","v":"P"},{"$f":"IF(Prezentace!F45=0,\"\",Prezentace!F45)","v":""},{"$f":"IF(Prezentace!E45=0,\"\",Prezentace!E45)","v":""},null,null,null,null,null,null,null,null,null,null,null,null,null,null,0]
[{"$f":"IF(Prezentace!A46=0,\"\",Prezentace!A46)","v":""},{"$f":"IF(Prezentace!B46=0,\"\",Prezentace!B46)","v":""},{"$f":"Prezentace!D46","v":"P"},{"$f":"IF(Prezentace!F46=0,\"\",Prezentace!F46)","v":""},{"$f":"IF(Prezentace!E46=0,\"\",Prezentace!E46)","v":""},null,null,null,null,null,null,null,null,null,null,null,null,null,null,0]
[{"$f":"IF(Prezentace!A47=0,\"\",Prezentace!A47)","v":""},{"$f":"IF(Prezentace!B47=0,\"\",Prezentace!B47)","v":""},{"$f":"Prezentace!D47","v":"P"},{"$f":"IF(Prezentace!F47=0,\"\",Prezentace!F47)","v":""},{"$f":"IF(Prezentace!E47=0,\"\",Prezentace!E47)","v":""},null,null,null,null,null,null,null,null,null,null,null,null,null,null,0]
[{"$f":"IF(Prezentace!A48=0,\"\",Prezentace!A48)","v":""},{"$f":"IF(Prezentace!B48=0,\"\",Prezentace!B48)","v":""},{"$f":"Prezentace!D48","v":"P"},{"$f":"IF(Prezentace!F48=0,\"\",Prezentace!F48)","v":""},{"$f":"IF(Prezentace!E48=0,\"\",Prezentace!E48)","v":""},null,null,null,null,null,null,null,null,null,null,null,null,null,null,0]
[{"$f":"IF(Prezentace!A49=0,\"\",Prezentace!A49)","v":""},{"$f":"IF(Prezentace!B49=0,\"\",Prezentace!B49)","v":""},{"$f":"Prezentace!D49","v":"P"},{"$f":"IF(Prezentace!F49=0,\"\",Prezentace!F49)","v":""},{"$f":"IF(Prezentace!E49=0,\"\",Prezentace!E49)","v":""},null,null,null,null,null,null,null,null,null,null,null,null,null,null,0]
[{"$f":"IF(Prezentace!A50=0,\"\",Prezentace!A50)","v":""},{"$f":"IF(Prezentace!B50=0,\"\",Prezentace!B50)","v":""},{"$f":"Prezentace!D50","v":"P"},{"$f":"IF(Prezentace!F50=0,\"\",Prezentace!F50)","v":""},{"$f":"IF(Prezentace!E50=0,\"\",Prezentace!E50)","v":""},null,null,null,null,null,null,null,null,null,null,null,null,null,null,0]
[{"$f":"IF(Prezentace!A51=0,\"\",Prezentace!A51)","v":""},{"$f":"IF(Prezentace!B51=0,\"\",Prezentace!B51)","v":""},{"$f":"Prezentace!D51","v":"P"},{"$f":"IF(Prezentace!F51=0,\"\",Prezentace!F51)","v":""},{"$f":"IF(Prezentace!E51=0,\"\",Prezentace!E51)","v":""},null,null,null,null,null,null,null,null,null,null,null,null,null,null,0]
[{"$f":"IF(Prezentace!A52=0,\"\",Prezentace!A52)","v":""},{"$f":"IF(Prezentace!B52=0,\"\",Prezentace!B52)","v":""},{"$f":"Prezentace!D52","v":"P"},{"$f":"IF(Prezentace!F52=0,\"\",Prezentace!F52)","v":""},{"$f":"IF(Prezentace!E52=0,\"\",Prezentace!E52)","v":""},null,null,null,null,null,null,null,null,null,null,null,null,null,null,0]
[{"$f":"IF(Prezentace!A53=0,\"\",Prezentace!A53)","v":""},{"$f":"IF(Prezentace!B53=0,\"\",Prezentace!B53)","v":""},{"$f":"Prezentace!D53","v":"P"},{"$f":"IF(Prezentace!F53=0,\"\",Prezentace!F53)","v":""},{"$f":"IF(Prezentace!E53=0,\"\",Prezentace!E53)","v":""},null,null,null,null,null,null,null,null,null,null,null,null,null,null,0]
[{"$f":"IF(Prezentace!A54=0,\"\",Prezentace!A54)","v":""},{"$f":"IF(Prezentace!B54=0,\"\",Prezentace!B54)","v":""},{"$f":"Prezentace!D54","v":"P"},{"$f":"IF(Prezentace!F54=0,\"\",Prezentace!F54)","v":""},{"$f":"IF(Prezentace!E54=0,\"\",Prezentace!E54)","v":""},null,null,null,null,null,null,null,null,null,null,null,null,null,null,0]
[{"$f":"IF(Prezentace!A55=0,\"\",Prezentace!A55)","v":""},{"$f":"IF(Prezentace!B55=0,\"\",Prezentace!B55)","v":""},{"$f":"Prezentace!D55","v":"P"},{"$f":"IF(Prezentace!F55=0,\"\",Prezentace!F55)","v":""},{"$f":"IF(Prezentace!E55=0,\"\",Prezentace!E55)","v":""},null,null,null,null,null,null,null,null,null,null,null,null,null,null,0]
[{"$f":"IF(Prezentace!A56=0,\"\",Prezentace!A56)","v":""},{"$f":"IF(Prezentace!B56=0,\"\",Prezentace!B56)","v":""},{"$f":"Prezentace!D56","v":"P"},{"$f":"IF(Prezentace!F56=0,\"\",Prezentace!F56)","v":""},{"$f":"IF(Prezentace!E56=0,\"\",Prezentace!E56)","v":""},null,null,null,null,null,null,null,null,null,null,null,null,null,null,0]
[{"$f":"IF(Prezentace!A57=0,\"\",Prezentace!A57)","v":""},{"$f":"IF(Prezentace!B57=0,\"\",Prezentace!B57)","v":""},{"$f":"Prezentace!D57","v":"P"},{"$f":"IF(Prezentace!F57=0,\"\",Prezentace!F57)","v":""},{"$f":"IF(Prezentace!E57=0,\"\",Prezentace!E57)","v":""},null,null,null,null,null,null,null,null,null,null,null,null,null,null,0]
[{"$f":"IF(Prezentace!A58=0,\"\",Prezentace!A58)","v":""},{"$f":"IF(Prezentace!B58=0,\"\",Prezentace!B58)","v":""},{"$f":"Prezentace!D58","v":"P"},{"$f":"IF(Prezentace!F58=0,\"\",Prezentace!F58)","v":""},{"$f":"IF(Prezentace!E58=0,\"\",Prezentace!E58)","v":""},null,null,null,null,null,null,null,null,null,null,null,null,null,null,0]
[{"$f":"IF(Prezentace!A59=0,\"\",Prezentace!A59)","v":""},{"$f":"IF(Prezentace!B59=0,\"\",Prezentace!B59)","v":""},{"$f":"Prezentace!D59","v":"P"},{"$f":"IF(Prezentace!F59=0,\"\",Prezentace!F59)","v":""},{"$f":"IF(Prezentace!E59=0,\"\",Prezentace!E59)","v":""},null,null,null,null,null,null,null,null,null,null,null,null,null,null,0]
[{"$f":"IF(Prezentace!A60=0,\"\",Prezentace!A60)","v":""},{"$f":"IF(Prezentace!B60=0,\"\",Prezentace!B60)","v":""},{"$f":"Prezentace!D60","v":"P"},{"$f":"IF(Prezentace!F60=0,\"\",Prezentace!F60)","v":""},{"$f":"IF(Prezentace!E60=0,\"\",Prezentace!E60)","v":""},null,null,null,null,null,null,null,null,null,null,null,null,null,null,0]
[{"$f":"IF(Prezentace!A61=0,\"\",Prezentace!A61)","v":""},{"$f":"IF(Prezentace!B61=0,\"\",Prezentace!B61)","v":""},{"$f":"Prezentace!D61","v":"P"},{"$f":"IF(Prezentace!F61=0,\"\",Prezentace!F61)","v":""},{"$f":"IF(Prezentace!E61=0,\"\",Prezentace!E61)","v":""},null,null,null,null,null,null,null,null,null,null,null,null,null,null,0]
[{"$f":"IF(Prezentace!A62=0,\"\",Prezentace!A62)","v":""},{"$f":"IF(Prezentace!B62=0,\"\",Prezentace!B62)","v":""},{"$f":"Prezentace!D62","v":"P"},{"$f":"IF(Prezentace!F62=0,\"\",Prezentace!F62)","v":""},{"$f":"IF(Prezentace!E62=0,\"\",Prezentace!E62)","v":""},null,null,null,null,null,null,null,null,null,null,null,null,null,null,0]
[{"$f":"IF(Prezentace!A63=0,\"\",Prezentace!A63)","v":""},{"$f":"IF(Prezentace!B63=0,\"\",Prezentace!B63)","v":""},{"$f":"Prezentace!D63","v":"P"},{"$f":"IF(Prezentace!F63=0,\"\",Prezentace!F63)","v":""},{"$f":"IF(Prezentace!E63=0,\"\",Prezentace!E63)","v":""},null,null,null,null,null,null,null,null,null,null,null,null,null,null,0]
[{"$f":"IF(Prezentace!A64=0,\"\",Prezentace!A64)","v":""},{"$f":"IF(Prezentace!B64=0,\"\",Prezentace!B64)","v":""},{"$f":"Prezentace!D64","v":"P"},{"$f":"IF(Prezentace!F64=0,\"\",Prezentace!F64)","v":""},{"$f":"IF(Prezentace!E64=0,\"\",Prezentace!E64)","v":""},null,null,null,null,null,null,null,null,null,null,null,null,null,null,0]
[{"$f":"IF(Prezentace!A65=0,\"\",Prezentace!A65)","v":""},{"$f":"IF(Prezentace!B65=0,\"\",Prezentace!B65)","v":""},{"$f":"Prezentace!D65","v":"P"},{"$f":"IF(Prezentace!F65=0,\"\",Prezentace!F65)","v":""},{"$f":"IF(Prezentace!E65=0,\"\",Prezentace!E65)","v":""},null,null,null,null,null,null,null,null,null,null,null,null,null,null,0]
[{"$f":"IF(Prezentace!A66=0,\"\",Prezentace!A66)","v":""},{"$f":"IF(Prezentace!B66=0,\"\",Prezentace!B66)","v":""},{"$f":"Prezentace!D66","v":"P"},{"$f":"IF(Prezentace!F66=0,\"\",Prezentace!F66)","v":""},{"$f":"IF(Prezentace!E66=0,\"\",Prezentace!E66)","v":""},null,null,null,null,null,null,null,null,null,null,null,null,null,null,0]
[{"$f":"IF(Prezentace!A67=0,\"\",Prezentace!A67)","v":""},{"$f":"IF(Prezentace!B67=0,\"\",Prezentace!B67)","v":""},{"$f":"Prezentace!D67","v":"P"},{"$f":"IF(Prezentace!F67=0,\"\",Prezentace!F67)","v":""},{"$f":"IF(Prezentace!E67=0,\"\",Prezentace!E67)","v":""},null,null,null,null,null,null,null,null,null,null,null,null,null,null,0]
[{"$f":"IF(Prezentace!A68=0,\"\",Prezentace!A68)","v":""},{"$f":"IF(Prezentace!B68=0,\"\",Prezentace!B68)","v":""},{"$f":"Prezentace!D68","v":"P"},{"$f":"IF(Prezentace!F68=0,\"\",Prezentace!F68)","v":""},{"$f":"IF(Prezentace!E68=0,\"\",Prezentace!E68)","v":""},null,null,null,null,null,null,null,null,null,null,null,null,null,null,0]
[{"$f":"IF(Prezentace!A69=0,\"\",Prezentace!A69)","v":""},{"$f":"IF(Prezentace!B69=0,\"\",Prezentace!B69)","v":""},{"$f":"Prezentace!D69","v":"P"},{"$f":"IF(Prezentace!F69=0,\"\",Prezentace!F69)","v":""},{"$f":"IF(Prezentace!E69=0,\"\",Prezentace!E69)","v":""},null,null,null,null,null,null,null,null,null,null,null,null,null,null,0]
[{"$f":"IF(Prezentace!A70=0,\"\",Prezentace!A70)","v":""},{"$f":"IF(Prezentace!B70=0,\"\",Prezentace!B70)","v":""},{"$f":"Prezentace!D70","v":"P"},{"$f":"IF(Prezentace!F70=0,\"\",Prezentace!F70)","v":""},{"$f":"IF(Prezentace!E70=0,\"\",Prezentace!E70)","v":""},null,null,null,null,null,null,null,null,null,null,null,null,null,null,0]
[{"$f":"IF(Prezentace!A71=0,\"\",Prezentace!A71)","v":""},{"$f":"IF(Prezentace!B71=0,\"\",Prezentace!B71)","v":""},{"$f":"Prezentace!D71","v":"P"},{"$f":"IF(Prezentace!F71=0,\"\",Prezentace!F71)","v":""},{"$f":"IF(Prezentace!E71=0,\"\",Prezentace!E71)","v":""},null,null,null,null,null,null,null,null,null,null,null,null,null,null,0]
[{"$f":"IF(Prezentace!A72=0,\"\",Prezentace!A72)","v":""},{"$f":"IF(Prezentace!B72=0,\"\",Prezentace!B72)","v":""},{"$f":"Prezentace!D72","v":"P"},{"$f":"IF(Prezentace!F72=0,\"\",Prezentace!F72)","v":""},{"$f":"IF(Prezentace!E72=0,\"\",Prezentace!E72)","v":""},null,null,null,null,null,null,null,null,null,null,null,null,null,null,0]
[{"$f":"IF(Prezentace!A73=0,\"\",Prezentace!A73)","v":""},{"$f":"IF(Prezentace!B73=0,\"\",Prezentace!B73)","v":""},{"$f":"Prezentace!D73","v":"P"},{"$f":"IF(Prezentace!F73=0,\"\",Prezentace!F73)","v":""},{"$f":"IF(Prezentace!E73=0,\"\",Prezentace!E73)","v":""},null,null,null,null,null,null,null,null,null,null,null,null,null,null,0]
[{"$f":"IF(Prezentace!A74=0,\"\",Prezentace!A74)","v":""},{"$f":"IF(Prezentace!B74=0,\"\",Prezentace!B74)","v":""},{"$f":"Prezentace!D74","v":"P"},{"$f":"IF(Prezentace!F74=0,\"\",Prezentace!F74)","v":""},{"$f":"IF(Prezentace!E74=0,\"\",Prezentace!E74)","v":""},null,null,null,null,null,null,null,null,null,null,null,null,null,null,0]
[{"$f":"IF(Prezentace!A75=0,\"\",Prezentace!A75)","v":""},{"$f":"IF(Prezentace!B75=0,\"\",Prezentace!B75)","v":""},{"$f":"Prezentace!D75","v":"P"},{"$f":"IF(Prezentace!F75=0,\"\",Prezentace!F75)","v":""},{"$f":"IF(Prezentace!E75=0,\"\",Prezentace!E75)","v":""},null,null,null,null,null,null,null,null,null,null,null,null,null,null,{"$f":"(SUM(F102*$F$3,G102*$G$3,H102*$H$3,I102*$I$3,J102*$J$3,K102*$K$3,L102*$L$3,M102*$M$3,N102*$N$3,O102*$O$3,P102*$P$3,Q102*$Q$3,R102*$R$3))-S102","v":0}]

{"sheet":"5","index":10,"n_rows":101,"n_cols":22,"rows_kept":101,"cut":false,"hidden":false,"merged":[[0,3,0,20],[0,0,2,0],[0,1,2,1]]}
["Druž.","Kap.",null,"Disciplina 5"]
[]
[null,null,null,null,null,"K","M",1,2,3,4,5,6,7,8,9,10,11,12,"TB","Čas","Součet"]
[{"$f":"IF(Prezentace!A6=0,\"\",Prezentace!A6)","v":""},{"$f":"IF(Prezentace!B6=0,\"\",Prezentace!B6)","v":""},{"$f":"Prezentace!D6","v":"P"},{"$f":"IF(Prezentace!F6=0,\"\",Prezentace!F6)","v":"Milan"},{"$f":"IF(Prezentace!E6=0,\"\",Prezentace!E6)","v":"Matějka st."},null,200,null,null,null,null,null,null,null,null,null,null,null,null,null,200,{"$f":"(SUM(F4:T4))-U4","v":0}]
[{"$f":"IF(Prezentace!A7=0,\"\",Prezentace!A7)","v":""},{"$f":"IF(Prezentace!B7=0,\"\",Prezentace!B7)","v":""},{"$f":"Prezentace!D7","v":"P"},{"$f":"IF(Prezentace!F7=0,\"\",Prezentace!F7)","v":"Miroslav"},{"$f":"IF(Prezentace!E7=0,\"\",Prezentace!E7)","v":"Fiala  "},null,200,null,null,null,null,null,null,null,null,null,null,null,null,null,60.24,139.76]
[{"$f":"IF(Prezentace!A8=0,\"\",Prezentace!A8)","v":""},{"$f":"IF(Prezentace!B8=0,\"\",Prezentace!B8)","v":""},{"$f":"Prezentace!D8","v":"P"},{"$f":"IF(Prezentace!F8=0,\"\",Prezentace!F8)","v":"František"},{"$f":"IF(Prezentace!E8=0,\"\",Prezentace!E8)","v":"Toman "},null,200,null,null,null,null,null,null,null,null,null,null,null,null,null,84.39,115.61]
[{"$f":"IF(Prezentace!A9=0,\"\",Prezentace!A9)","v":""},{"$f":"IF(Prezentace!B9=0,\"\",Prezentace!B9)","v":""},{"$f":"Prezentace!D9","v":"P"},{"$f":"IF(Prezentace!F9=0,\"\",Prezentace!F9)","v":"Jiří"},{"$f":"IF(Prezentace!E9=0,\"\",Prezentace!E9)","v":"Švihálek "},null,200,null,null,null,null,null,null,null,null,null,null,null,null,null,77.38,122.62]
[{"$f":"IF(Prezentace!A10=0,\"\",Prezentace!A10)","v":""},{"$f":"IF(Prezentace!B10=0,\"\",Prezentace!B10)","v":""},{"$f":"Prezentace!D10","v":"R"},{"$f":"IF(Prezentace!F10=0,\"\",Prezentace!F10)","v":"Jiří"},{"$f":"IF(Prezentace!E10=0,\"\",Prezentace!E10)","v":"Švihálek "},null,200,null,null,null,null,null,null,null,null,null,null,null,null,null,56.72,143.28]
[{"$f":"IF(Prezentace!A11=0,\"\",Prezentace!A11)","v":""},{"$f":"IF(Prezentace!B11=0,\"\",Prezentace!B11)","v":""},{"$f":"Prezentace!D11","v":"P"},{"$f":"IF(Prezentace!F11=0,\"\",Prezentace!F11)","v":"Vladimír"},{"$f":"IF(Prezentace!E11=0,\"\",Prezentace!E11)","v":"VejslíK "},null,200,null,null,null,null,null,null,null,null,null,null,null,null,null,50.65,149.35]
[{"$f":"IF(Prezentace!A12=0,\"\",Prezentace!A12)","v":""},{"$f":"IF(Prezentace!B12=0,\"\",Prezentace!B12)","v":""},{"$f":"Prezentace!D12","v":"P"},{"$f":"IF(Prezentace!F12=0,\"\",Prezentace!F12)","v":"Milan"},{"$f":"IF(Prezentace!E12=0,\"\",Prezentace!E12)","v":"Kraus "},null,200,null,null,null,null,null,null,null,null,null,null,null,null,null,91.36,108.64]
[{"$f":"IF(Prezentace!A13=0,\"\",Prezentace!A13)","v":""},{"$f":"IF(Prezentace!B13=0,\"\",Prezentace!B13)","v":""},{"$f":"Prezentace!D13","v":"P"},{"$f":"IF(Prezentace!F13=0,\"\",Prezentace!F13)","v":"Vojtěch"},{"$f":"IF(Prezentace!E13=0,\"\",Prezentace!E13)","v":"Brejžek "},null,200,null,null,null,null,null,null,null,null,null,null,null,null,null,87.9,112.1]
[{"$f":"IF(Prezentace!A14=0,\"\",Prezentace!A14)","v":""},{"$f":"IF(Prezentace!B14=0,\"\",Prezentace!B14)","v":""},{"$f":"Prezentace!D14","v":"P"},{"$f":"IF(Prezentace!F14=0,\"\",Prezentace!F14)","v":"Karel"},{"$f":"IF(Prezentace!E14=0,\"\",Prezentace!E14)","v":"Získal "},null,200,null,null,null,null,null,null,null,null,null,null,null,null,null,63.02,136.97999999999999]
[{"$f":"IF(Prezentace!A15=0,\"\",Prezentace!A15)","v":""},{"$f":"IF(Prezentace!B15=0,\"\",Prezentace!B15)","v":""},{"$f":"Prezentace!D15","v":"R"},{"$f":"IF(Prezentace!F15=0,\"\",Prezentace!F15)","v":"Karel"},{"$f":"IF(Prezentace!E15=0,\"\",Prezentace!E15)","v":"Získal "},null,200,null,null,null,null,null,null,null,null,null,null,null,null,null,59.55,140.44999999999999]
[{"$f":"IF(Prezentace!A16=0,\"\",Prezentace!A16)","v":""},{"$f":"IF(Prezentace!B16=0,\"\",Prezentace!B16)","v":""},{"$f":"Prezentace!D16","v":"P"},{"$f":"IF(Prezentace!F16=0,\"\",Prezentace!F16)","v":"Marie"},{"$f":"IF(Prezentace!E16=0,\"\",Prezentace!E16)","v":"Žemličková"},null,200,null,null,null,null,null,null,null,null,null,null,null,null,null,66.66,133.34]
[{"$f":"IF(Prezentace!A17=0,\"\",Prezentace!A17)","v":""},{"$f":"IF(Prezentace!B17=0,\"\",Prezentace!B17)","v":""},{"$f":"Prezentace!D17","v":"P"},{"$f":"IF(Prezentace!F17=0,\"\",Prezentace!F17)","v":"Ladislav"},{"$f":"IF(Prezentace!E17=0,\"\",Prezentace!E17)","v":"Žemlička "},null,200,null,null,null,null,null,null,null,null,null,null,null,null,null,76.849999999999994,123.15]
[{"$f":"IF(Prezentace!A18=0,\"\",Prezentace!A18)","v":""},{"$f":"IF(Prezentace!B18=0,\"\",Prezentace!B18)","v":""},{"$f":"Prezentace!D18","v":"P"},{"$f":"IF(Prezentace!F18=0,\"\",Prezentace!F18)","v":"Jiří"},{"$f":"IF(Prezentace!E18=0,\"\",Prezentace!E18)","v":"Janovský "},null,200,null,null,null,null,null,null,null,null,null,null,null,null,null,154.79,45.210000000000008]
[{"$f":"IF(Prezentace!A19=0,\"\",Prezentace!A19)","v":""},{"$f":"IF(Prezentace!B19=0,\"\",Prezentace!B19)","v":""},{"$f":"Prezentace!D19","v":"P"},{"$f":"IF(Prezentace!F19=0,\"\",Prezentace!F19)","v":"Mojmír"},{"$f":"IF(Prezentace!E19=0,\"\",Prezentace!E19)","v":"Janovský "},null,200,null,null,null,null,null,null,null,null,null,null,null,null,null,119.72,80.28]
[{"$f":"IF(Prezentace!A20=0,\"\",Prezentace!A20)","v":""},{"$f":"IF(Prezentace!B20=0,\"\",Prezentace!B20)","v":""},{"$f":"Prezentace!D20","v":"P"},{"$f":"IF(Prezentace!F20=0,\"\",Prezentace!F20)","v":"Bohumil"},{"$f":"IF(Prezentace!E20=0,\"\",Prezentace!E20)","v":"Herceg"},null,200,null,null,null,null,null,null,null,null,null,null,null,null,null,84.18,115.82]
[{"$f":"IF(Prezentace!A21=0,\"\",Prezentace!A21)","v":""},{"$f":"IF(Prezentace!B21=0,\"\",Prezentace!B21)","v":""},{"$f":"Prezentace!D21","v":"P"},{"$f":"IF(Prezentace!F21=0,\"\",Prezentace!F21)","v":"Michal"},{"$f":"IF(Prezentace!E21=0,\"\",Prezentace!E21)","v":"Svoboda"},null,200,null,null,null,null,null,null,null,null,null,null,null,null,null,99.48,100.52]
[{"$f":"IF(Prezentace!A22=0,\"\",Prezentace!A22)","v":""},{"$f":"IF(Prezentace!B22=0,\"\",Prezentace!B22)","v":""},{"$f":"Prezentace!D22","v":"P"},{"$f":"IF(Prezentace!F22=0,\"\",Prezentace!F22)","v":"Viktor"},{"$f":"IF(Prezentace!E22=0,\"\",Prezentace!E22)","v":"Fuksa  "},null,200,null,null,null,null,null,null,null,null,null,null,null,null,null,69.42,130.57999999999998]
[{"$f":"IF(Prezentace!A23=0,\"\",Prezentace!A23)","v":""},{"$f":"IF(Prezentace!B23=0,\"\",Prezentace!B23)","v":""},{"$f":"Prezentace!D23","v":"P"},{"$f":"IF(Prezentace!F23=0,\"\",Prezentace!F23)","v":"Miroslav"},{"$f":"IF(Prezentace!E23=0,\"\",Prezentace!E23)","v":"Koch   ml."},null,200,null,null,null,null,null,null,null,null,null,null,null,null,null,58.09,141.91]
[{"$f":"IF(Prezentace!A24=0,\"\",Prezentace!A24)","v":""},{"$f":"IF(Prezentace!B24=0,\"\",Prezentace!B24)","v":""},{"$f":"Prezentace!D24","v":"P"},{"$f":"IF(Prezentace!F24=0,\"\",Prezentace!F24)","v":"Miroslav"},{"$f":"IF(Prezentace!E24=0,\"\",Prezentace!E24)","v":"Koch  st. "},null,200,null,null,null,null,null,null,null,null,null,null,null,null,null,71.77,128.23000000000002]
[{"$f":"IF(Prezentace!A25=0,\"\",Prezentace!A25)","v":""},{"$f":"IF(Prezentace!B25=0,\"\",Prezentace!B25)","v":""},{"$f":"Prezentace!D25","v":"P"},{"$f":"IF(Prezentace!F25=0,\"\",Prezentace!F25)","v":"Jaroslav"},{"$f":"IF(Prezentace!E25=0,\"\",Prezentace!E25)","v":"Kostříž "},null,200,null,null,null,null,null,null,null,null,null,null,null,null,null,84.34,115.66]
[{"$f":"IF(Prezentace!A26=0,\"\",Prezentace!A26)","v":""},{"$f":"IF(Prezentace!B26=0,\"\",Prezentace!B26)","v":""},{"$f":"Prezentace!D26","v":"P"},{"$f":"IF(Prezentace!F26=0,\"\",Prezentace!F26)","v":"Josef"},{"$f":"IF(Prezentace!E26=0,\"\",Prezentace!E26)","v":"Čekal "},null,200,null,null,null,null,null,null,null,null,null,null,null,null,null,78.489999999999995,121.51]
[{"$f":"IF(Prezentace!A27=0,\"\",Prezentace!A27)","v":""},{"$f":"IF(Prezentace!B27=0,\"\",Prezentace!B27)","v":""},{"$f":"Prezentace!D27","v":"P"},{"$f":"IF(Prezentace!F27=0,\"\",Prezentace!F27)","v":"Miloslav"},{"$f":"IF(Prezentace!E27=0,\"\",Prezentace!E27)","v":"Petržílka"},null,200,null,null,null,null,null,null,null,null,null,null,null,null,null,61.69,138.31]
[{"$f":"IF(Prezentace!A28=0,\"\",Prezentace!A28)","v":""},{"$f":"IF(Prezentace!B28=0,\"\",Prezentace!B28)","v":""},{"$f":"Prezentace!D28","v":"P"},{"$f":"IF(Prezentace!F28=0,\"\",Prezentace!F28)","v":"Václav"},{"$f":"IF(Prezentace!E28=0,\"\",Prezentace!E28)","v":"Landkammer"},null,200,null,null,null,null,null,null,null,null,null,null,null,null,null,138.75,61.25]
[{"$f":"IF(Prezentace!A29=0,\"\",Prezentace!A29)","v":""},{"$f":"IF(Prezentace!B29=0,\"\",Prezentace!B29)","v":""},{"$f":"Prezentace!D29","v":"P"},{"$f":"IF(Prezentace!F29=0,\"\",Prezentace!F29)","v":"Albert"},{"$f":"IF(Prezentace!E29=0,\"\",Prezentace!E29)","v":"Wrzecionko"},null,200,null,null,null,null,null,null,null,null,null,null,null,null,null,93.75,106.25]
[{"$f":"IF(Prezentace!A30=0,\"\",Prezentace!A30)","v":""},{"$f":"IF(Prezentace!B30=0,\"\",Prezentace!B30)","v":""},{"$f":"Prezentace!D30","v":"P"},{"$f":"IF(Prezentace!F30=0,\"\",Prezentace!F30)","v":"Michaela"},{"$f":"IF(Prezentace!E30=0,\"\",Prezentace!E30)","v":"Reisnerová"},null,200,null,null,null,null,null,null,null,null,null,null,null,null,null,102.54,97.46]
[{"$f":"IF(Prezentace!A31=0,\"\",Prezentace!A31)","v":""},{"$f":"IF(Prezentace!B31=0,\"\",Prezentace!B31)","v":""},{"$f":"Prezentace!D31","v":"P"},{"$f":"IF(Prezentace!F31=0,\"\",Prezentace!F31)","v":"Antonín"},{"$f":"IF(Prezentace!E31=0,\"\",Prezentace!E31)","v":"Urbanec  "},null,200,null,null,null,null,null,null,null,null,null,null,null,null,null,102.97,97.03]
[{"$f":"IF(Prezentace!#REF!=0,\"\",Prezentace!#REF!)","v":{"$error":"#REF!"}},{"$f":"IF(Prezentace!#REF!=0,\"\",Prezentace!#REF!)","v":{"$error":"#REF!"}},{"$f":"Prezentace!#REF!","v":{"$error":"#REF!"}},{"$f":"IF(Prezentace!#REF!=0,\"\",Prezentace!#REF!)","v":{"$error":"#REF!"}},{"$f":"IF(Prezentace!#REF!=0,\"\",Prezentace!#REF!)","v":{"$error":"#REF!"}},null,null,null,null,null,null,null,null,null,null,null,null,null,null,null,null,0]
[{"$f":"IF(Prezentace!#REF!=0,\"\",Prezentace!#REF!)","v":{"$error":"#REF!"}},{"$f":"IF(Prezentace!#REF!=0,\"\",Prezentace!#REF!)","v":{"$error":"#REF!"}},{"$f":"Prezentace!#REF!","v":{"$error":"#REF!"}},{"$f":"IF(Prezentace!#REF!=0,\"\",Prezentace!#REF!)","v":{"$error":"#REF!"}},{"$f":"IF(Prezentace!#REF!=0,\"\",Prezentace!#REF!)","v":{"$error":"#REF!"}},null,null,null,null,null,null,null,null,null,null,null,null,null,null,null,null,0]
[{"$f":"IF(Prezentace!#REF!=0,\"\",Prezentace!#REF!)","v":{"$error":"#REF!"}},{"$f":"IF(Prezentace!#REF!=0,\"\",Prezentace!#REF!)","v":{"$error":"#REF!"}},{"$f":"Prezentace!#REF!","v":{"$error":"#REF!"}},{"$f":"IF(Prezentace!#REF!=0,\"\",Prezentace!#REF!)","v":{"$error":"#REF!"}},{"$f":"IF(Prezentace!#REF!=0,\"\",Prezentace!#REF!)","v":{"$error":"#REF!"}},null,null,null,null,null,null,null,null,null,null,null,null,null,null,null,null,0]
[{"$f":"IF(Prezentace!#REF!=0,\"\",Prezentace!#REF!)","v":{"$error":"#REF!"}},{"$f":"IF(Prezentace!#REF!=0,\"\",Prezentace!#REF!)","v":{"$error":"#REF!"}},{"$f":"Prezentace!#REF!","v":{"$error":"#REF!"}},{"$f":"IF(Prezentace!#REF!=0,\"\",Prezentace!#REF!)","v":{"$error":"#REF!"}},{"$f":"IF(Prezentace!#REF!=0,\"\",Prezentace!#REF!)","v":{"$error":"#REF!"}},null,null,null,null,null,null,null,null,null,null,null,null,null,null,null,null,0]
[{"$f":"IF(Prezentace!#REF!=0,\"\",Prezentace!#REF!)","v":{"$error":"#REF!"}},{"$f":"IF(Prezentace!#REF!=0,\"\",Prezentace!#REF!)","v":{"$error":"#REF!"}},{"$f":"Prezentace!#REF!","v":{"$error":"#REF!"}},{"$f":"IF(Prezentace!#REF!=0,\"\",Prezentace!#REF!)","v":{"$error":"#REF!"}},{"$f":"IF(Prezentace!#REF!=0,\"\",Prezentace!#REF!)","v":{"$error":"#REF!"}},null,null,null,null,null,null,null,null,null,null,null,null,null,null,null,null,0]
[{"$f":"IF(Prezentace!#REF!=0,\"\",Prezentace!#REF!)","v":{"$error":"#REF!"}},{"$f":"IF(Prezentace!#REF!=0,\"\",Prezentace!#REF!)","v":{"$error":"#REF!"}},{"$f":"Prezentace!#REF!","v":{"$error":"#REF!"}},{"$f":"IF(Prezentace!#REF!=0,\"\",Prezentace!#REF!)","v":{"$error":"#REF!"}},{"$f":"IF(Prezentace!#REF!=0,\"\",Prezentace!#REF!)","v":{"$error":"#REF!"}},null,null,null,null,null,null,null,null,null,null,null,null,null,null,null,null,0]
[{"$f":"IF(Prezentace!#REF!=0,\"\",Prezentace!#REF!)","v":{"$error":"#REF!"}},{"$f":"IF(Prezentace!#REF!=0,\"\",Prezentace!#REF!)","v":{"$error":"#REF!"}},{"$f":"Prezentace!#REF!","v":{"$error":"#REF!"}},{"$f":"IF(Prezentace!#REF!=0,\"\",Prezentace!#REF!)","v":{"$error":"#REF!"}},{"$f":"IF(Prezentace!#REF!=0,\"\",Prezentace!#REF!)","v":{"$error":"#REF!"}},null,null,null,null,null,null,null,null,null,null,null,null,null,null,null,null,{"$f":"(SUM(F36:T36))-U36","v":0}]
[{"$f":"IF(Prezentace!#REF!=0,\"\",Prezentace!#REF!)","v":{"$error":"#REF!"}},{"$f":"IF(Prezentace!#REF!=0,\"\",Prezentace!#REF!)","v":{"$error":"#REF!"}},{"$f":"Prezentace!#REF!","v":{"$error":"#REF!"}},{"$f":"IF(Prezentace!#REF!=0,\"\",Prezentace!#REF!)","v":{"$error":"#REF!"}},{"$f":"IF(Prezentace!#REF!=0,\"\",Prezentace!#REF!)","v":{"$error":"#REF!"}},null,null,null,null,null,null,null,null,null,null,null,null,null,null,null,null,0]
[{"$f":"IF(Prezentace!#REF!=0,\"\",Prezentace!#REF!)","v":{"$error":"#REF!"}},{"$f":"IF(Prezentace!#REF!=0,\"\",Prezentace!#REF!)","v":{"$error":"#REF!"}},{"$f":"Prezentace!#REF!","v":{"$error":"#REF!"}},{"$f":"IF(Prezentace!#REF!=0,\"\",Prezentace!#REF!)","v":{"$error":"#REF!"}},{"$f":"IF(Prezentace!#REF!=0,\"\",Prezentace!#REF!)","v":{"$error":"#REF!"}},null,null,null,null,null,null,null,null,null,null,null,null,null,null,null,null,0]
[{"$f":"IF(Prezentace!#REF!=0,\"\",Prezentace!#REF!)","v":{"$error":"#REF!"}},{"$f":"IF(Prezentace!#REF!=0,\"\",Prezentace!#REF!)","v":{"$error":"#REF!"}},{"$f":"Prezentace!#REF!","v":{"$error":"#REF!"}},{"$f":"IF(Prezentace!#REF!=0,\"\",Prezentace!#REF!)","v":{"$error":"#REF!"}},{"$f":"IF(Prezentace!#REF!=0,\"\",Prezentace!#REF!)","v":{"$error":"#REF!"}},null,null,null,null,null,null,null,null,null,null,null,null,null,null,null,null,0]
[{"$f":"IF(Prezentace!#REF!=0,\"\",Prezentace!#REF!)","v":{"$error":"#REF!"}},{"$f":"IF(Prezentace!#REF!=0,\"\",Prezentace!#REF!)","v":{"$error":"#REF!"}},{"$f":"Prezentace!#REF!","v":{"$error":"#REF!"}},{"$f":"IF(Prezentace!#REF!=0,\"\",Prezentace!#REF!)","v":{"$error":"#REF!"}},{"$f":"IF(Prezentace!#REF!=0,\"\",Prezentace!#REF!)","v":{"$error":"#REF!"}},null,null,null,null,null,null,null,null,null,null,null,null,null,null,null,null,0]
[{"$f":"IF(Prezentace!#REF!=0,\"\",Prezentace!#REF!)","v":{"$error":"#REF!"}},{"$f":"IF(Prezentace!#REF!=0,\"\",Prezentace!#REF!)","v":{"$error":"#REF!"}},{"$f":"Prezentace!#REF!","v":{"$error":"#REF!"}},{"$f":"IF(Prezentace!#REF!=0,\"\",Prezentace!#REF!)","v":{"$error":"#REF!"}},{"$f":"IF(Prezentace!#REF!=0,\"\",Prezentace!#REF!)","v":{"$error":"#REF!"}},null,null,null,null,null,null,null,null,null,null,null,null,null,null,null,null,0]
[{"$f":"IF(Prezentace!#REF!=0,\"\",Prezentace!#REF!)","v":{"$error":"#REF!"}},{"$f":"IF(Prezentace!#REF!=0,\"\",Prezentace!#REF!)","v":{"$error":"#REF!"}},{"$f":"Prezentace!#REF!","v":{"$error":"#REF!"}},{"$f":"IF(Prezentace!#REF!=0,\"\",Prezentace!#REF!)","v":{"$error":"#REF!"}},{"$f":"IF(Prezentace!#REF!=0,\"\",Prezentace!#REF!)","v":{"$error":"#REF!"}},null,null,null,null,null,null,null,null,null,null,null,null,null,null,null,null,0]
[{"$f":"IF(Prezentace!#REF!=0,\"\",Prezentace!#REF!)","v":{"$error":"#REF!"}},{"$f":"IF(Prezentace!#REF!=0,\"\",Prezentace!#REF!)","v":{"$error":"#REF!"}},{"$f":"Prezentace!#REF!","v":{"$error":"#REF!"}},{"$f":"IF(Prezentace!#REF!=0,\"\",Prezentace!#REF!)","v":{"$error":"#REF!"}},{"$f":"IF(Prezentace!#REF!=0,\"\",Prezentace!#REF!)","v":{"$error":"#REF!"}},null,null,null,null,null,null,null,null,null,null,null,null,null,null,null,null,0]
[{"$f":"IF(Prezentace!#REF!=0,\"\",Prezentace!#REF!)","v":{"$error":"#REF!"}},{"$f":"IF(Prezentace!#REF!=0,\"\",Prezentace!#REF!)","v":{"$error":"#REF!"}},{"$f":"Prezentace!#REF!","v":{"$error":"#REF!"}},{"$f":"IF(Prezentace!#REF!=0,\"\",Prezentace!#REF!)","v":{"$error":"#REF!"}},{"$f":"IF(Prezentace!#REF!=0,\"\",Prezentace!#REF!)","v":{"$error":"#REF!"}},null,null,null,null,null,null,null,null,null,null,null,null,null,null,null,null,0]
[{"$f":"IF(Prezentace!#REF!=0,\"\",Prezentace!#REF!)","v":{"$error":"#REF!"}},{"$f":"IF(Prezentace!#REF!=0,\"\",Prezentace!#REF!)","v":{"$error":"#REF!"}},{"$f":"Prezentace!#REF!","v":{"$error":"#REF!"}},{"$f":"IF(Prezentace!#REF!=0,\"\",Prezentace!#REF!)","v":{"$error":"#REF!"}},{"$f":"IF(Prezentace!#REF!=0,\"\",Prezentace!#REF!)","v":{"$error":"#REF!"}},null,null,null,null,null,null,null,null,null,null,null,null,null,null,null,null,0]
[{"$f":"IF(Prezentace!#REF!=0,\"\",Prezentace!#REF!)","v":{"$error":"#REF!"}},{"$f":"IF(Prezentace!#REF!=0,\"\",Prezentace!#REF!)","v":{"$error":"#REF!"}},{"$f":"Prezentace!#REF!","v":{"$error":"#REF!"}},{"$f":"IF(Prezentace!#REF!=0,\"\",Prezentace!#REF!)","v":{"$error":"#REF!"}},{"$f":"IF(Prezentace!#REF!=0,\"\",Prezentace!#REF!)","v":{"$error":"#REF!"}},null,null,null,null,null,null,null,null,null,null,null,null,null,null,null,null,0]
[{"$f":"IF(Prezentace!#REF!=0,\"\",Prezentace!#REF!)","v":{"$error":"#REF!"}},{"$f":"IF(Prezentace!#REF!=0,\"\",Prezentace!#REF!)","v":{"$error":"#REF!"}},{"$f":"Prezentace!#REF!","v":{"$error":"#REF!"}},{"$f":"IF(Prezentace!#REF!=0,\"\",Prezentace!#REF!)","v":{"$error":"#REF!"}},{"$f":"IF(Prezentace!#REF!=0,\"\",Prezentace!#REF!)","v":{"$error":"#REF!"}},null,null,null,null,null,null,null,null,null,null,null,null,null,null,null,null,0]
[{"$f":"IF(Prezentace!#REF!=0,\"\",Prezentace!#REF!)","v":{"$error":"#REF!"}},{"$f":"IF(Prezentace!#REF!=0,\"\",Prezentace!#REF!)","v":{"$error":"#REF!"}},{"$f":"Prezentace!#REF!","v":{"$error":"#REF!"}},{"$f":"IF(Prezentace!#REF!=0,\"\",Prezentace!#REF!)","v":{"$error":"#REF!"}},{"$f":"IF(Prezentace!#REF!=0,\"\",Prezentace!#REF!)","v":{"$error":"#REF!"}},null,null,null,null,null,null,null,null,null,null,null,null,null,null,null,null,0]
[{"$f":"IF(Prezentace!#REF!=0,\"\",Prezentace!#REF!)","v":{"$error":"#REF!"}},{"$f":"IF(Prezentace!#REF!=0,\"\",Prezentace!#REF!)","v":{"$error":"#REF!"}},{"$f":"Prezentace!#REF!","v":{"$error":"#REF!"}},{"$f":"IF(Prezentace!#REF!=0,\"\",Prezentace!#REF!)","v":{"$error":"#REF!"}},{"$f":"IF(Prezentace!#REF!=0,\"\",Prezentace!#REF!)","v":{"$error":"#REF!"}},null,null,null,null,null,null,null,null,null,null,null,null,null,null,null,null,0]
[{"$f":"IF(Prezentace!#REF!=0,\"\",Prezentace!#REF!)","v":{"$error":"#REF!"}},{"$f":"IF(Prezentace!#REF!=0,\"\",Prezentace!#REF!)","v":{"$error":"#REF!"}},{"$f":"Prezentace!#REF!","v":{"$error":"#REF!"}},{"$f":"IF(Prezentace!#REF!=0,\"\",Prezentace!#REF!)","v":{"$error":"#REF!"}},{"$f":"IF(Prezentace!#REF!=0,\"\",Prezentace!#REF!)","v":{"$error":"#REF!"}},null,null,null,null,null,null,null,null,null,null,null,null,null,null,null,null,0]
[{"$f":"IF(Prezentace!#REF!=0,\"\",Prezentace!#REF!)","v":{"$error":"#REF!"}},{"$f":"IF(Prezentace!#REF!=0,\"\",Prezentace!#REF!)","v":{"$error":"#REF!"}},{"$f":"Prezentace!#REF!","v":{"$error":"#REF!"}},{"$f":"IF(Prezentace!#REF!=0,\"\",Prezentace!#REF!)","v":{"$error":"#REF!"}},{"$f":"IF(Prezentace!#REF!=0,\"\",Prezentace!#REF!)","v":{"$error":"#REF!"}},null,null,null,null,null,null,null,null,null,null,null,null,null,null,null,null,0]
[{"$f":"IF(Prezentace!#REF!=0,\"\",Prezentace!#REF!)","v":{"$error":"#REF!"}},{"$f":"IF(Prezentace!#REF!=0,\"\",Prezentace!#REF!)","v":{"$error":"#REF!"}},{"$f":"Prezentace!#REF!","v":{"$error":"#REF!"}},{"$f":"IF(Prezentace!#REF!=0,\"\",Prezentace!#REF!)","v":{"$error":"#REF!"}},{"$f":"IF(Prezentace!#REF!=0,\"\",Prezentace!#REF!)","v":{"$error":"#REF!"}},null,null,null,null,null,null,null,null,null,null,null,null,null,null,null,null,0]
[{"$f":"IF(Prezentace!#REF!=0,\"\",Prezentace!#REF!)","v":{"$error":"#REF!"}},{"$f":"IF(Prezentace!#REF!=0,\"\",Prezentace!#REF!)","v":{"$error":"#REF!"}},{"$f":"Prezentace!#REF!","v":{"$error":"#REF!"}},{"$f":"IF(Prezentace!#REF!=0,\"\",Prezentace!#REF!)","v":{"$error":"#REF!"}},{"$f":"IF(Prezentace!#REF!=0,\"\",Prezentace!#REF!)","v":{"$error":"#REF!"}},null,null,null,null,null,null,null,null,null,null,null,null,null,null,null,null,0]
[{"$f":"IF(Prezentace!#REF!=0,\"\",Prezentace!#REF!)","v":{"$error":"#REF!"}},{"$f":"IF(Prezentace!#REF!=0,\"\",Prezentace!#REF!)","v":{"$error":"#REF!"}},{"$f":"Prezentace!#REF!","v":{"$error":"#REF!"}},{"$f":"IF(Prezentace!#REF!=0,\"\",Prezentace!#REF!)","v":{"$error":"#REF!"}},{"$f":"IF(Prezentace!#REF!=0,\"\",Prezentace!#REF!)","v":{"$error":"#REF!"}},null,null,null,null,null,null,null,null,null,null,null,null,null,null,null,null,0]
[{"$f":"IF(Prezentace!#REF!=0,\"\",Prezentace!#REF!)","v":{"$error":"#REF!"}},{"$f":"IF(Prezentace!#REF!=0,\"\",Prezentace!#REF!)","v":{"$error":"#REF!"}},{"$f":"Prezentace!#REF!","v":{"$error":"#REF!"}},{"$f":"IF(Prezentace!#REF!=0,\"\",Prezentace!#REF!)","v":{"$error":"#REF!"}},{"$f":"IF(Prezentace!#REF!=0,\"\",Prezentace!#REF!)","v":{"$error":"#REF!"}},null,null,null,null,null,null,null,null,null,null,null,null,null,null,null,null,0]
[{"$f":"IF(Prezentace!#REF!=0,\"\",Prezentace!#REF!)","v":{"$error":"#REF!"}},{"$f":"IF(Prezentace!#REF!=0,\"\",Prezentace!#REF!)","v":{"$error":"#REF!"}},{"$f":"Prezentace!#REF!","v":{"$error":"#REF!"}},{"$f":"IF(Prezentace!#REF!=0,\"\",Prezentace!#REF!)","v":{"$error":"#REF!"}},{"$f":"IF(Prezentace!#REF!=0,\"\",Prezentace!#REF!)","v":{"$error":"#REF!"}},null,null,null,null,null,null,null,null,null,null,null,null,null,null,null,null,0]
[{"$f":"IF(Prezentace!#REF!=0,\"\",Prezentace!#REF!)","v":{"$error":"#REF!"}},{"$f":"IF(Prezentace!#REF!=0,\"\",Prezentace!#REF!)","v":{"$error":"#REF!"}},{"$f":"Prezentace!#REF!","v":{"$error":"#REF!"}},{"$f":"IF(Prezentace!#REF!=0,\"\",Prezentace!#REF!)","v":{"$error":"#REF!"}},{"$f":"IF(Prezentace!#REF!=0,\"\",Prezentace!#REF!)","v":{"$error":"#REF!"}},null,null,null,null,null,null,null,null,null,null,null,null,null,null,null,null,0]
[{"$f":"IF(Prezentace!A32=0,\"\",Prezentace!A32)","v":""},{"$f":"IF(Prezentace!B32=0,\"\",Prezentace!B32)","v":""},{"$f":"Prezentace!D32","v":"P"},{"$f":"IF(Prezentace!F32=0,\"\",Prezentace!F32)","v":""},{"$f":"IF(Prezentace!E32=0,\"\",Prezentace!E32)","v":""},null,null,null,null,null,null,null,null,null,null,null,null,null,null,null,null,0]
[{"$f":"IF(Prezentace!A33=0,\"\",Prezentace!A33)","v":""},{"$f":"IF(Prezentace!B33=0,\"\",Prezentace!B33)","v":""},{"$f":"Prezentace!D33","v":"P"},{"$f":"IF(Prezentace!F33=0,\"\",Prezentace!F33)","v":""},{"$f":"IF(Prezentace!E33=0,\"\",Prezentace!E33)","v":""},null,null,null,null,null,null,null,null,null,null,null,null,null,null,null,null,0]
[{"$f":"IF(Prezentace!A34=0,\"\",Prezentace!A34)","v":""},{"$f":"IF(Prezentace!B34=0,\"\",Prezentace!B34)","v":""},{"$f":"Prezentace!D34","v":"P"},{"$f":"IF(Prezentace!F34=0,\"\",Prezentace!F34)","v":""},{"$f":"IF(Prezentace!E34=0,\"\",Prezentace!E34)","v":""},null,null,null,null,null,null,null,null,null,null,null,null,null,null,null,null,0]
[{"$f":"IF(Prezentace!A35=0,\"\",Prezentace!A35)","v":""},{"$f":"IF(Prezentace!B35=0,\"\",Prezentace!B35)","v":""},{"$f":"Prezentace!D35","v":"P"},{"$f":"IF(Prezentace!F35=0,\"\",Prezentace!F35)","v":""},{"$f":"IF(Prezentace!E35=0,\"\",Prezentace!E35)","v":""},null,null,null,null,null,null,null,null,null,null,null,null,null,null,null,null,0]
[{"$f":"IF(Prezentace!A36=0,\"\",Prezentace!A36)","v":""},{"$f":"IF(Prezentace!B36=0,\"\",Prezentace!B36)","v":""},{"$f":"Prezentace!D36","v":"P"},{"$f":"IF(Prezentace!F36=0,\"\",Prezentace!F36)","v":""},{"$f":"IF(Prezentace!E36=0,\"\",Prezentace!E36)","v":""},null,null,null,null,null,null,null,null,null,null,null,null,null,null,null,null,0]
[{"$f":"IF(Prezentace!A37=0,\"\",Prezentace!A37)","v":""},{"$f":"IF(Prezentace!B37=0,\"\",Prezentace!B37)","v":""},{"$f":"Prezentace!D37","v":"P"},{"$f":"IF(Prezentace!F37=0,\"\",Prezentace!F37)","v":""},{"$f":"IF(Prezentace!E37=0,\"\",Prezentace!E37)","v":""},null,null,null,null,null,null,null,null,null,null,null,null,null,null,null,null,0]
[{"$f":"IF(Prezentace!A38=0,\"\",Prezentace!A38)","v":""},{"$f":"IF(Prezentace!B38=0,\"\",Prezentace!B38)","v":""},{"$f":"Prezentace!D38","v":"P"},{"$f":"IF(Prezentace!F38=0,\"\",Prezentace!F38)","v":""},{"$f":"IF(Prezentace!E38=0,\"\",Prezentace!E38)","v":""},null,null,null,null,null,null,null,null,null,null,null,null,null,null,null,null,0]
[{"$f":"IF(Prezentace!A39=0,\"\",Prezentace!A39)","v":""},{"$f":"IF(Prezentace!B39=0,\"\",Prezentace!B39)","v":""},{"$f":"Prezentace!D39","v":"P"},{"$f":"IF(Prezentace!F39=0,\"\",Prezentace!F39)","v":""},{"$f":"IF(Prezentace!E39=0,\"\",Prezentace!E39)","v":""},null,null,null,null,null,null,null,null,null,null,null,null,null,null,null,null,0]
[{"$f":"IF(Prezentace!A40=0,\"\",Prezentace!A40)","v":""},{"$f":"IF(Prezentace!B40=0,\"\",Prezentace!B40)","v":""},{"$f":"Prezentace!D40","v":"P"},{"$f":"IF(Prezentace!F40=0,\"\",Prezentace!F40)","v":""},{"$f":"IF(Prezentace!E40=0,\"\",Prezentace!E40)","v":""},null,null,null,null,null,null,null,null,null,null,null,null,null,null,null,null,0]
[{"$f":"IF(Prezentace!A41=0,\"\",Prezentace!A41)","v":""},{"$f":"IF(Prezentace!B41=0,\"\",Prezentace!B41)","v":""},{"$f":"Prezentace!D41","v":"P"},{"$f":"IF(Prezentace!F41=0,\"\",Prezentace!F41)","v":""},{"$f":"IF(Prezentace!E41=0,\"\",Prezentace!E41)","v":""},null,null,null,null,null,null,null,null,null,null,null,null,null,null,null,null,0]
[{"$f":"IF(Prezentace!A42=0,\"\",Prezentace!A42)","v":""},{"$f":"IF(Prezentace!B42=0,\"\",Prezentace!B42)","v":""},{"$f":"Prezentace!D42","v":"P"},{"$f":"IF(Prezentace!F42=0,\"\",Prezentace!F42)","v":""},{"$f":"IF(Prezentace!E42=0,\"\",Prezentace!E42)","v":""},null,null,null,null,null,null,null,null,null,null,null,null,null,null,null,null,{"$f":"(SUM(F68:T68))-U68","v":0}]
[{"$f":"IF(Prezentace!A43=0,\"\",Prezentace!A43)","v":""},{"$f":"IF(Prezentace!B43=0,\"\",Prezentace!B43)","v":""},{"$f":"Prezentace!D43","v":"P"},{"$f":"IF(Prezentace!F43=0,\"\",Prezentace!F43)","v":""},{"$f":"IF(Prezentace!E43=0,\"\",Prezentace!E43)","v":""},null,null,null,null,null,null,null,null,null,null,null,null,null,null,null,null,0]
[{"$f":"IF(Prezentace!A44=0,\"\",Prezentace!A44)","v":""},{"$f":"IF(Prezentace!B44=0,\"\",Prezentace!B44)","v":""},{"$f":"Prezentace!D44","v":"P"},{"$f":"IF(Prezentace!F44=0,\"\",Prezentace!F44)","v":""},{"$f":"IF(Prezentace!E44=0,\"\",Prezentace!E44)","v":""},null,null,null,null,null,null,null,null,null,null,null,null,null,null,null,null,0]
[{"$f":"IF(Prezentace!A45=0,\"\",Prezentace!A45)","v":""},{"$f":"IF(Prezentace!B45=0,\"\",Prezentace!B45)","v":""},{"$f":"Prezentace!D45","v":"P"},{"$f":"IF(Prezentace!F45=0,\"\",Prezentace!F45)","v":""},{"$f":"IF(Prezentace!E45=0,\"\",Prezentace!E45)","v":""},null,null,null,null,null,null,null,null,null,null,null,null,null,null,null,null,0]
[{"$f":"IF(Prezentace!A46=0,\"\",Prezentace!A46)","v":""},{"$f":"IF(Prezentace!B46=0,\"\",Prezentace!B46)","v":""},{"$f":"Prezentace!D46","v":"P"},{"$f":"IF(Prezentace!F46=0,\"\",Prezentace!F46)","v":""},{"$f":"IF(Prezentace!E46=0,\"\",Prezentace!E46)","v":""},null,null,null,null,null,null,null,null,null,null,null,null,null,null,null,null,0]
[{"$f":"IF(Prezentace!A47=0,\"\",Prezentace!A47)","v":""},{"$f":"IF(Prezentace!B47=0,\"\",Prezentace!B47)","v":""},{"$f":"Prezentace!D47","v":"P"},{"$f":"IF(Prezentace!F47=0,\"\",Prezentace!F47)","v":""},{"$f":"IF(Prezentace!E47=0,\"\",Prezentace!E47)","v":""},null,null,null,null,null,null,null,null,null,null,null,null,null,null,null,null,0]
[{"$f":"IF(Prezentace!A48=0,\"\",Prezentace!A48)","v":""},{"$f":"IF(Prezentace!B48=0,\"\",Prezentace!B48)","v":""},{"$f":"Prezentace!D48","v":"P"},{"$f":"IF(Prezentace!F48=0,\"\",Prezentace!F48)","v":""},{"$f":"IF(Prezentace!E48=0,\"\",Prezentace!E48)","v":""},null,null,null,null,null,null,null,null,null,null,null,null,null,null,null,null,0]
[{"$f":"IF(Prezentace!A49=0,\"\",Prezentace!A49)","v":""},{"$f":"IF(Prezentace!B49=0,\"\",Prezentace!B49)","v":""},{"$f":"Prezentace!D49","v":"P"},{"$f":"IF(Prezentace!F49=0,\"\",Prezentace!F49)","v":""},{"$f":"IF(Prezentace!E49=0,\"\",Prezentace!E49)","v":""},null,null,null,null,null,null,null,null,null,null,null,null,null,null,null,null,0]
[{"$f":"IF(Prezentace!A50=0,\"\",Prezentace!A50)","v":""},{"$f":"IF(Prezentace!B50=0,\"\",Prezentace!B50)","v":""},{"$f":"Prezentace!D50","v":"P"},{"$f":"IF(Prezentace!F50=0,\"\",Prezentace!F50)","v":""},{"$f":"IF(Prezentace!E50=0,\"\",Prezentace!E50)","v":""},null,null,null,null,null,null,null,null,null,null,null,null,null,null,null,null,0]
[{"$f":"IF(Prezentace!A51=0,\"\",Prezentace!A51)","v":""},{"$f":"IF(Prezentace!B51=0,\"\",Prezentace!B51)","v":""},{"$f":"Prezentace!D51","v":"P"},{"$f":"IF(Prezentace!F51=0,\"\",Prezentace!F51)","v":""},{"$f":"IF(Prezentace!E51=0,\"\",Prezentace!E51)","v":""},null,null,null,null,null,null,null,null,null,null,null,null,null,null,null,null,0]
[{"$f":"IF(Prezentace!A52=0,\"\",Prezentace!A52)","v":""},{"$f":"IF(Prezentace!B52=0,\"\",Prezentace!B52)","v":""},{"$f":"Prezentace!D52","v":"P"},{"$f":"IF(Prezentace!F52=0,\"\",Prezentace!F52)","v":""},{"$f":"IF(Prezentace!E52=0,\"\",Prezentace!E52)","v":""},null,null,null,null,null,null,null,null,null,null,null,null,null,null,null,null,0]
[{"$f":"IF(Prezentace!A53=0,\"\",Prezentace!A53)","v":""},{"$f":"IF(Prezentace!B53=0,\"\",Prezentace!B53)","v":""},{"$f":"Prezentace!D53","v":"P"},{"$f":"IF(Prezentace!F53=0,\"\",Prezentace!F53)","v":""},{"$f":"IF(Prezentace!E53=0,\"\",Prezentace!E53)","v":""},null,null,null,null,null,null,null,null,null,null,null,null,null,null,null,null,0]
[{"$f":"IF(Prezentace!A54=0,\"\",Prezentace!A54)","v":""},{"$f":"IF(Prezentace!B54=0,\"\",Prezentace!B54)","v":""},{"$f":"Prezentace!D54","v":"P"},{"$f":"IF(Prezentace!F54=0,\"\",Prezentace!F54)","v":""},{"$f":"IF(Prezentace!E54=0,\"\",Prezentace!E54)","v":""},null,null,null,null,null,null,null,null,null,null,null,null,null,null,null,null,0]
[{"$f":"IF(Prezentace!A55=0,\"\",Prezentace!A55)","v":""},{"$f":"IF(Prezentace!B55=0,\"\",Prezentace!B55)","v":""},{"$f":"Prezentace!D55","v":"P"},{"$f":"IF(Prezentace!F55=0,\"\",Prezentace!F55)","v":""},{"$f":"IF(Prezentace!E55=0,\"\",Prezentace!E55)","v":""},null,null,null,null,null,null,null,null,null,null,null,null,null,null,null,null,0]
[{"$f":"IF(Prezentace!A56=0,\"\",Prezentace!A56)","v":""},{"$f":"IF(Prezentace!B56=0,\"\",Prezentace!B56)","v":""},{"$f":"Prezentace!D56","v":"P"},{"$f":"IF(Prezentace!F56=0,\"\",Prezentace!F56)","v":""},{"$f":"IF(Prezentace!E56=0,\"\",Prezentace!E56)","v":""},null,null,null,null,null,null,null,null,null,null,null,null,null,null,null,null,0]
[{"$f":"IF(Prezentace!A57=0,\"\",Prezentace!A57)","v":""},{"$f":"IF(Prezentace!B57=0,\"\",Prezentace!B57)","v":""},{"$f":"Prezentace!D57","v":"P"},{"$f":"IF(Prezentace!F57=0,\"\",Prezentace!F57)","v":""},{"$f":"IF(Prezentace!E57=0,\"\",Prezentace!E57)","v":""},null,null,null,null,null,null,null,null,null,null,null,null,null,null,null,null,0]
[{"$f":"IF(Prezentace!A58=0,\"\",Prezentace!A58)","v":""},{"$f":"IF(Prezentace!B58=0,\"\",Prezentace!B58)","v":""},{"$f":"Prezentace!D58","v":"P"},{"$f":"IF(Prezentace!F58=0,\"\",Prezentace!F58)","v":""},{"$f":"IF(Prezentace!E58=0,\"\",Prezentace!E58)","v":""},null,null,null,null,null,null,null,null,null,null,null,null,null,null,null,null,0]
[{"$f":"IF(Prezentace!A59=0,\"\",Prezentace!A59)","v":""},{"$f":"IF(Prezentace!B59=0,\"\",Prezentace!B59)","v":""},{"$f":"Prezentace!D59","v":"P"},{"$f":"IF(Prezentace!F59=0,\"\",Prezentace!F59)","v":""},{"$f":"IF(Prezentace!E59=0,\"\",Prezentace!E59)","v":""},null,null,null,null,null,null,null,null,null,null,null,null,null,null,null,null,0]
[{"$f":"IF(Prezentace!A60=0,\"\",Prezentace!A60)","v":""},{"$f":"IF(Prezentace!B60=0,\"\",Prezentace!B60)","v":""},{"$f":"Prezentace!D60","v":"P"},{"$f":"IF(Prezentace!F60=0,\"\",Prezentace!F60)","v":""},{"$f":"IF(Prezentace!E60=0,\"\",Prezentace!E60)","v":""},null,null,null,null,null,null,null,null,null,null,null,null,null,null,null,null,0]
[{"$f":"IF(Prezentace!A61=0,\"\",Prezentace!A61)","v":""},{"$f":"IF(Prezentace!B61=0,\"\",Prezentace!B61)","v":""},{"$f":"Prezentace!D61","v":"P"},{"$f":"IF(Prezentace!F61=0,\"\",Prezentace!F61)","v":""},{"$f":"IF(Prezentace!E61=0,\"\",Prezentace!E61)","v":""},null,null,null,null,null,null,null,null,null,null,null,null,null,null,null,null,0]
[{"$f":"IF(Prezentace!A62=0,\"\",Prezentace!A62)","v":""},{"$f":"IF(Prezentace!B62=0,\"\",Prezentace!B62)","v":""},{"$f":"Prezentace!D62","v":"P"},{"$f":"IF(Prezentace!F62=0,\"\",Prezentace!F62)","v":""},{"$f":"IF(Prezentace!E62=0,\"\",Prezentace!E62)","v":""},null,null,null,null,null,null,null,null,null,null,null,null,null,null,null,null,0]
[{"$f":"IF(Prezentace!A63=0,\"\",Prezentace!A63)","v":""},{"$f":"IF(Prezentace!B63=0,\"\",Prezentace!B63)","v":""},{"$f":"Prezentace!D63","v":"P"},{"$f":"IF(Prezentace!F63=0,\"\",Prezentace!F63)","v":""},{"$f":"IF(Prezentace!E63=0,\"\",Prezentace!E63)","v":""},null,null,null,null,null,null,null,null,null,null,null,null,null,null,null,null,0]
[{"$f":"IF(Prezentace!A64=0,\"\",Prezentace!A64)","v":""},{"$f":"IF(Prezentace!B64=0,\"\",Prezentace!B64)","v":""},{"$f":"Prezentace!D64","v":"P"},{"$f":"IF(Prezentace!F64=0,\"\",Prezentace!F64)","v":""},{"$f":"IF(Prezentace!E64=0,\"\",Prezentace!E64)","v":""},null,null,null,null,null,null,null,null,null,null,null,null,null,null,null,null,0]
[{"$f":"IF(Prezentace!A65=0,\"\",Prezentace!A65)","v":""},{"$f":"IF(Prezentace!B65=0,\"\",Prezentace!B65)","v":""},{"$f":"Prezentace!D65","v":"P"},{"$f":"IF(Prezentace!F65=0,\"\",Prezentace!F65)","v":""},{"$f":"IF(Prezentace!E65=0,\"\",Prezentace!E65)","v":""},null,null,null,null,null,null,null,null,null,null,null,null,null,null,null,null,0]
[{"$f":"IF(Prezentace!A66=0,\"\",Prezentace!A66)","v":""},{"$f":"IF(Prezentace!B66=0,\"\",Prezentace!B66)","v":""},{"$f":"Prezentace!D66","v":"P"},{"$f":"IF(Prezentace!F66=0,\"\",Prezentace!F66)","v":""},{"$f":"IF(Prezentace!E66=0,\"\",Prezentace!E66)","v":""},null,null,null,null,null,null,null,null,null,null,null,null,null,null,null,null,0]
[{"$f":"IF(Prezentace!A67=0,\"\",Prezentace!A67)","v":""},{"$f":"IF(Prezentace!B67=0,\"\",Prezentace!B67)","v":""},{"$f":"Prezentace!D67","v":"P"},{"$f":"IF(Prezentace!F67=0,\"\",Prezentace!F67)","v":""},{"$f":"IF(Prezentace!E67=0,\"\",Prezentace!E67)","v":""},null,null,null,null,null,null,null,null,null,null,null,null,null,null,null,null,0]
[{"$f":"IF(Prezentace!A68=0,\"\",Prezentace!A68)","v":""},{"$f":"IF(Prezentace!B68=0,\"\",Prezentace!B68)","v":""},{"$f":"Prezentace!D68","v":"P"},{"$f":"IF(Prezentace!F68=0,\"\",Prezentace!F68)","v":""},{"$f":"IF(Prezentace!E68=0,\"\",Prezentace!E68)","v":""},null,null,null,null,null,null,null,null,null,null,null,null,null,null,null,null,0]
[{"$f":"IF(Prezentace!A69=0,\"\",Prezentace!A69)","v":""},{"$f":"IF(Prezentace!B69=0,\"\",Prezentace!B69)","v":""},{"$f":"Prezentace!D69","v":"P"},{"$f":"IF(Prezentace!F69=0,\"\",Prezentace!F69)","v":""},{"$f":"IF(Prezentace!E69=0,\"\",Prezentace!E69)","v":""},null,null,null,null,null,null,null,null,null,null,null,null,null,null,null,null,0]
[{"$f":"IF(Prezentace!A70=0,\"\",Prezentace!A70)","v":""},{"$f":"IF(Prezentace!B70=0,\"\",Prezentace!B70)","v":""},{"$f":"Prezentace!D70","v":"P"},{"$f":"IF(Prezentace!F70=0,\"\",Prezentace!F70)","v":""},{"$f":"IF(Prezentace!E70=0,\"\",Prezentace!E70)","v":""},null,null,null,null,null,null,null,null,null,null,null,null,null,null,null,null,0]
[{"$f":"IF(Prezentace!A71=0,\"\",Prezentace!A71)","v":""},{"$f":"IF(Prezentace!B71=0,\"\",Prezentace!B71)","v":""},{"$f":"Prezentace!D71","v":"P"},{"$f":"IF(Prezentace!F71=0,\"\",Prezentace!F71)","v":""},{"$f":"IF(Prezentace!E71=0,\"\",Prezentace!E71)","v":""},null,null,null,null,null,null,null,null,null,null,null,null,null,null,null,null,0]
[{"$f":"IF(Prezentace!A72=0,\"\",Prezentace!A72)","v":""},{"$f":"IF(Prezentace!B72=0,\"\",Prezentace!B72)","v":""},{"$f":"Prezentace!D72","v":"P"},{"$f":"IF(Prezentace!F72=0,\"\",Prezentace!F72)","v":""},{"$f":"IF(Prezentace!E72=0,\"\",Prezentace!E72)","v":""},null,null,null,null,null,null,null,null,null,null,null,null,null,null,null,null,0]
[{"$f":"IF(Prezentace!A73=0,\"\",Prezentace!A73)","v":""},{"$f":"IF(Prezentace!B73=0,\"\",Prezentace!B73)","v":""},{"$f":"Prezentace!D73","v":"P"},{"$f":"IF(Prezentace!F73=0,\"\",Prezentace!F73)","v":""},{"$f":"IF(Prezentace!E73=0,\"\",Prezentace!E73)","v":""},null,null,null,null,null,null,null,null,null,null,null,null,null,null,null,null,0]
[{"$f":"IF(Prezentace!A74=0,\"\",Prezentace!A74)","v":""},{"$f":"IF(Prezentace!B74=0,\"\",Prezentace!B74)","v":""},{"$f":"Prezentace!D74","v":"P"},{"$f":"IF(Prezentace!F74=0,\"\",Prezentace!F74)","v":""},{"$f":"IF(Prezentace!E74=0,\"\",Prezentace!E74)","v":""},null,null,null,null,null,null,null,null,null,null,null,null,null,null,null,null,{"$f":"(SUM(F100:T100))-U100","v":0}]
[{"$f":"IF(Prezentace!A75=0,\"\",Prezentace!A75)","v":""},{"$f":"IF(Prezentace!B75=0,\"\",Prezentace!B75)","v":""},{"$f":"Prezentace!D75","v":"P"},{"$f":"IF(Prezentace!F75=0,\"\",Prezentace!F75)","v":""},{"$f":"IF(Prezentace!E75=0,\"\",Prezentace!E75)","v":""},null,null,null,null,null,null,null,null,null,null,null,null,null,null,null,null,0]

{"sheet":"5(M)","index":11,"n_rows":102,"n_cols":20,"rows_kept":102,"cut":false,"hidden":true,"merged":[[0,3,0,18],[0,0,2,0],[0,1,2,1]]}
["Druž.","Kap.",null,"Disciplina 5"]
[]
[null,null,null,null,null,0,1,2,3,4,5,6,7,8,9,10,12,15,"Čas","Součet"]
[{"$f":"IF(Prezentace!A6=0,\"\",Prezentace!A6)","v":""},{"$f":"IF(Prezentace!B6=0,\"\",Prezentace!B6)","v":""},{"$f":"Prezentace!D6","v":"P"},{"$f":"IF(Prezentace!F6=0,\"\",Prezentace!F6)","v":"Milan"},{"$f":"IF(Prezentace!E6=0,\"\",Prezentace!E6)","v":"Matějka st."},null,null,null,null,null,null,null,null,null,null,null,null,null,null,{"$f":"(SUM(F4*$F$3,G4*$G$3,H4*$H$3,I4*$I$3,J4*$J$3,K4*$K$3,L4*$L$3,M4*$M$3,N4*$N$3,O4*$O$3,P4*$P$3,Q4*$Q$3,R4*$R$3))-S4","v":0}]
[{"$f":"IF(Prezentace!A7=0,\"\",Prezentace!A7)","v":""},{"$f":"IF(Prezentace!B7=0,\"\",Prezentace!B7)","v":""},{"$f":"Prezentace!D7","v":"P"},{"$f":"IF(Prezentace!F7=0,\"\",Prezentace!F7)","v":"Miroslav"},{"$f":"IF(Prezentace!E7=0,\"\",Prezentace!E7)","v":"Fiala  "},null,null,null,null,null,null,null,null,null,null,null,null,null,null,{"$f":"(SUM(F5*$F$3,G5*$G$3,H5*$H$3,I5*$I$3,J5*$J$3,K5*$K$3,L5*$L$3,M5*$M$3,N5*$N$3,O5*$O$3,P5*$P$3,Q5*$Q$3,R5*$R$3))-S5","v":0}]
[{"$f":"IF(Prezentace!A8=0,\"\",Prezentace!A8)","v":""},{"$f":"IF(Prezentace!B8=0,\"\",Prezentace!B8)","v":""},{"$f":"Prezentace!D8","v":"P"},{"$f":"IF(Prezentace!F8=0,\"\",Prezentace!F8)","v":"František"},{"$f":"IF(Prezentace!E8=0,\"\",Prezentace!E8)","v":"Toman "},null,null,null,null,null,null,null,null,null,null,null,null,null,null,0]
[{"$f":"IF(Prezentace!A9=0,\"\",Prezentace!A9)","v":""},{"$f":"IF(Prezentace!B9=0,\"\",Prezentace!B9)","v":""},{"$f":"Prezentace!D9","v":"P"},{"$f":"IF(Prezentace!F9=0,\"\",Prezentace!F9)","v":"Jiří"},{"$f":"IF(Prezentace!E9=0,\"\",Prezentace!E9)","v":"Švihálek "},null,null,null,null,null,null,null,null,null,null,null,null,null,null,0]
[{"$f":"IF(Prezentace!A10=0,\"\",Prezentace!A10)","v":""},{"$f":"IF(Prezentace!B10=0,\"\",Prezentace!B10)","v":""},{"$f":"Prezentace!D10","v":"R"},{"$f":"IF(Prezentace!F10=0,\"\",Prezentace!F10)","v":"Jiří"},{"$f":"IF(Prezentace!E10=0,\"\",Prezentace!E10)","v":"Švihálek "},null,null,null,null,null,null,null,null,null,null,null,null,null,null,0]
[{"$f":"IF(Prezentace!A11=0,\"\",Prezentace!A11)","v":""},{"$f":"IF(Prezentace!B11=0,\"\",Prezentace!B11)","v":""},{"$f":"Prezentace!D11","v":"P"},{"$f":"IF(Prezentace!F11=0,\"\",Prezentace!F11)","v":"Vladimír"},{"$f":"IF(Prezentace!E11=0,\"\",Prezentace!E11)","v":"VejslíK "},null,null,null,null,null,null,null,null,null,null,null,null,null,null,0]
[{"$f":"IF(Prezentace!A12=0,\"\",Prezentace!A12)","v":""},{"$f":"IF(Prezentace!B12=0,\"\",Prezentace!B12)","v":""},{"$f":"Prezentace!D12","v":"P"},{"$f":"IF(Prezentace!F12=0,\"\",Prezentace!F12)","v":"Milan"},{"$f":"IF(Prezentace!E12=0,\"\",Prezentace!E12)","v":"Kraus "},null,null,null,null,null,null,null,null,null,null,null,null,null,null,0]
[{"$f":"IF(Prezentace!#REF!=0,\"\",Prezentace!#REF!)","v":{"$error":"#REF!"}},{"$f":"IF(Prezentace!#REF!=0,\"\",Prezentace!#REF!)","v":{"$error":"#REF!"}},{"$f":"Prezentace!#REF!","v":{"$error":"#REF!"}},{"$f":"IF(Prezentace!#REF!=0,\"\",Prezentace!#REF!)","v":{"$error":"#REF!"}},{"$f":"IF(Prezentace!#REF!=0,\"\",Prezentace!#REF!)","v":{"$error":"#REF!"}},null,null,null,null,null,null,null,null,null,null,null,null,null,null,0]
[{"$f":"IF(Prezentace!A13=0,\"\",Prezentace!A13)","v":""},{"$f":"IF(Prezentace!B13=0,\"\",Prezentace!B13)","v":""},{"$f":"Prezentace!D13","v":"P"},{"$f":"IF(Prezentace!F13=0,\"\",Prezentace!F13)","v":"Vojtěch"},{"$f":"IF(Prezentace!E13=0,\"\",Prezentace!E13)","v":"Brejžek "},null,null,null,null,null,null,null,null,null,null,null,null,null,null,0]
[{"$f":"IF(Prezentace!A14=0,\"\",Prezentace!A14)","v":""},{"$f":"IF(Prezentace!B14=0,\"\",Prezentace!B14)","v":""},{"$f":"Prezentace!D14","v":"P"},{"$f":"IF(Prezentace!F14=0,\"\",Prezentace!F14)","v":"Karel"},{"$f":"IF(Prezentace!E14=0,\"\",Prezentace!E14)","v":"Získal "},null,null,null,null,null,null,null,null,null,null,null,null,null,null,0]
[{"$f":"IF(Prezentace!A15=0,\"\",Prezentace!A15)","v":""},{"$f":"IF(Prezentace!B15=0,\"\",Prezentace!B15)","v":""},{"$f":"Prezentace!D15","v":"R"},{"$f":"IF(Prezentace!F15=0,\"\",Prezentace!F15)","v":"Karel"},{"$f":"IF(Prezentace!E15=0,\"\",Prezentace!E15)","v":"Získal "},null,null,null,null,null,null,null,null,null,null,null,null,null,null,0]
[{"$f":"IF(Prezentace!A16=0,\"\",Prezentace!A16)","v":""},{"$f":"IF(Prezentace!B16=0,\"\",Prezentace!B16)","v":""},{"$f":"Prezentace!D16","v":"P"},{"$f":"IF(Prezentace!F16=0,\"\",Prezentace!F16)","v":"Marie"},{"$f":"IF(Prezentace!E16=0,\"\",Prezentace!E16)","v":"Žemličková"},null,null,null,null,null,null,null,null,null,null,null,null,null,null,0]
[{"$f":"IF(Prezentace!A17=0,\"\",Prezentace!A17)","v":""},{"$f":"IF(Prezentace!B17=0,\"\",Prezentace!B17)","v":""},{"$f":"Prezentace!D17","v":"P"},{"$f":"IF(Prezentace!F17=0,\"\",Prezentace!F17)","v":"Ladislav"},{"$f":"IF(Prezentace!E17=0,\"\",Prezentace!E17)","v":"Žemlička "},null,null,null,null,null,null,null,null,null,null,null,null,null,null,0]
[{"$f":"IF(Prezentace!A18=0,\"\",Prezentace!A18)","v":""},{"$f":"IF(Prezentace!B18=0,\"\",Prezentace!B18)","v":""},{"$f":"Prezentace!D18","v":"P"},{"$f":"IF(Prezentace!F18=0,\"\",Prezentace!F18)","v":"Jiří"},{"$f":"IF(Prezentace!E18=0,\"\",Prezentace!E18)","v":"Janovský "},null,null,null,null,null,null,null,null,null,null,null,null,null,null,0]
[{"$f":"IF(Prezentace!A19=0,\"\",Prezentace!A19)","v":""},{"$f":"IF(Prezentace!B19=0,\"\",Prezentace!B19)","v":""},{"$f":"Prezentace!D19","v":"P"},{"$f":"IF(Prezentace!F19=0,\"\",Prezentace!F19)","v":"Mojmír"},{"$f":"IF(Prezentace!E19=0,\"\",Prezentace!E19)","v":"Janovský "},null,null,null,null,null,null,null,null,null,null,null,null,null,null,0]
[{"$f":"IF(Prezentace!A20=0,\"\",Prezentace!A20)","v":""},{"$f":"IF(Prezentace!B20=0,\"\",Prezentace!B20)","v":""},{"$f":"Prezentace!D20","v":"P"},{"$f":"IF(Prezentace!F20=0,\"\",Prezentace!F20)","v":"Bohumil"},{"$f":"IF(Prezentace!E20=0,\"\",Prezentace!E20)","v":"Herceg"},null,null,null,null,null,null,null,null,null,null,null,null,null,null,0]
[{"$f":"IF(Prezentace!A21=0,\"\",Prezentace!A21)","v":""},{"$f":"IF(Prezentace!B21=0,\"\",Prezentace!B21)","v":""},{"$f":"Prezentace!D21","v":"P"},{"$f":"IF(Prezentace!F21=0,\"\",Prezentace!F21)","v":"Michal"},{"$f":"IF(Prezentace!E21=0,\"\",Prezentace!E21)","v":"Svoboda"},null,null,null,null,null,null,null,null,null,null,null,null,null,null,0]
[{"$f":"IF(Prezentace!A22=0,\"\",Prezentace!A22)","v":""},{"$f":"IF(Prezentace!B22=0,\"\",Prezentace!B22)","v":""},{"$f":"Prezentace!D22","v":"P"},{"$f":"IF(Prezentace!F22=0,\"\",Prezentace!F22)","v":"Viktor"},{"$f":"IF(Prezentace!E22=0,\"\",Prezentace!E22)","v":"Fuksa  "},null,null,null,null,null,null,null,null,null,null,null,null,null,null,0]
[{"$f":"IF(Prezentace!A23=0,\"\",Prezentace!A23)","v":""},{"$f":"IF(Prezentace!B23=0,\"\",Prezentace!B23)","v":""},{"$f":"Prezentace!D23","v":"P"},{"$f":"IF(Prezentace!F23=0,\"\",Prezentace!F23)","v":"Miroslav"},{"$f":"IF(Prezentace!E23=0,\"\",Prezentace!E23)","v":"Koch   ml."},null,null,null,null,null,null,null,null,null,null,null,null,null,null,0]
[{"$f":"IF(Prezentace!A24=0,\"\",Prezentace!A24)","v":""},{"$f":"IF(Prezentace!B24=0,\"\",Prezentace!B24)","v":""},{"$f":"Prezentace!D24","v":"P"},{"$f":"IF(Prezentace!F24=0,\"\",Prezentace!F24)","v":"Miroslav"},{"$f":"IF(Prezentace!E24=0,\"\",Prezentace!E24)","v":"Koch  st. "},null,null,null,null,null,null,null,null,null,null,null,null,null,null,0]
[{"$f":"IF(Prezentace!A25=0,\"\",Prezentace!A25)","v":""},{"$f":"IF(Prezentace!B25=0,\"\",Prezentace!B25)","v":""},{"$f":"Prezentace!D25","v":"P"},{"$f":"IF(Prezentace!F25=0,\"\",Prezentace!F25)","v":"Jaroslav"},{"$f":"IF(Prezentace!E25=0,\"\",Prezentace!E25)","v":"Kostříž "},null,null,null,null,null,null,null,null,null,null,null,null,null,null,0]
[{"$f":"IF(Prezentace!A26=0,\"\",Prezentace!A26)","v":""},{"$f":"IF(Prezentace!B26=0,\"\",Prezentace!B26)","v":""},{"$f":"Prezentace!D26","v":"P"},{"$f":"IF(Prezentace!F26=0,\"\",Prezentace!F26)","v":"Josef"},{"$f":"IF(Prezentace!E26=0,\"\",Prezentace!E26)","v":"Čekal "},null,null,null,null,null,null,null,null,null,null,null,null,null,null,0]
[{"$f":"IF(Prezentace!A27=0,\"\",Prezentace!A27)","v":""},{"$f":"IF(Prezentace!B27=0,\"\",Prezentace!B27)","v":""},{"$f":"Prezentace!D27","v":"P"},{"$f":"IF(Prezentace!F27=0,\"\",Prezentace!F27)","v":"Miloslav"},{"$f":"IF(Prezentace!E27=0,\"\",Prezentace!E27)","v":"Petržílka"},null,null,null,null,null,null,null,null,null,null,null,null,null,null,0]
[{"$f":"IF(Prezentace!A28=0,\"\",Prezentace!A28)","v":""},{"$f":"IF(Prezentace!B28=0,\"\",Prezentace!B28)","v":""},{"$f":"Prezentace!D28","v":"P"},{"$f":"IF(Prezentace!F28=0,\"\",Prezentace!F28)","v":"Václav"},{"$f":"IF(Prezentace!E28=0,\"\",Prezentace!E28)","v":"Landkammer"},null,null,null,null,null,null,null,null,null,null,null,null,null,null,0]
[{"$f":"IF(Prezentace!A29=0,\"\",Prezentace!A29)","v":""},{"$f":"IF(Prezentace!B29=0,\"\",Prezentace!B29)","v":""},{"$f":"Prezentace!D29","v":"P"},{"$f":"IF(Prezentace!F29=0,\"\",Prezentace!F29)","v":"Albert"},{"$f":"IF(Prezentace!E29=0,\"\",Prezentace!E29)","v":"Wrzecionko"},null,null,null,null,null,null,null,null,null,null,null,null,null,null,0]
[{"$f":"IF(Prezentace!A30=0,\"\",Prezentace!A30)","v":""},{"$f":"IF(Prezentace!B30=0,\"\",Prezentace!B30)","v":""},{"$f":"Prezentace!D30","v":"P"},{"$f":"IF(Prezentace!F30=0,\"\",Prezentace!F30)","v":"Michaela"},{"$f":"IF(Prezentace!E30=0,\"\",Prezentace!E30)","v":"Reisnerová"},null,null,null,null,null,null,null,null,null,null,null,null,null,null,0]
[{"$f":"IF(Prezentace!A31=0,\"\",Prezentace!A31)","v":""},{"$f":"IF(Prezentace!B31=0,\"\",Prezentace!B31)","v":""},{"$f":"Prezentace!D31","v":"P"},{"$f":"IF(Prezentace!F31=0,\"\",Prezentace!F31)","v":"Antonín"},{"$f":"IF(Prezentace!E31=0,\"\",Prezentace!E31)","v":"Urbanec  "},null,null,null,null,null,null,null,null,null,null,null,null,null,null,0]
[{"$f":"IF(Prezentace!#REF!=0,\"\",Prezentace!#REF!)","v":{"$error":"#REF!"}},{"$f":"IF(Prezentace!#REF!=0,\"\",Prezentace!#REF!)","v":{"$error":"#REF!"}},{"$f":"Prezentace!#REF!","v":{"$error":"#REF!"}},{"$f":"IF(Prezentace!#REF!=0,\"\",Prezentace!#REF!)","v":{"$error":"#REF!"}},{"$f":"IF(Prezentace!#REF!=0,\"\",Prezentace!#REF!)","v":{"$error":"#REF!"}},null,null,null,null,null,null,null,null,null,null,null,null,null,null,0]
[{"$f":"IF(Prezentace!#REF!=0,\"\",Prezentace!#REF!)","v":{"$error":"#REF!"}},{"$f":"IF(Prezentace!#REF!=0,\"\",Prezentace!#REF!)","v":{"$error":"#REF!"}},{"$f":"Prezentace!#REF!","v":{"$error":"#REF!"}},{"$f":"IF(Prezentace!#REF!=0,\"\",Prezentace!#REF!)","v":{"$error":"#REF!"}},{"$f":"IF(Prezentace!#REF!=0,\"\",Prezentace!#REF!)","v":{"$error":"#REF!"}},null,null,null,null,null,null,null,null,null,null,null,null,null,null,0]
[{"$f":"IF(Prezentace!#REF!=0,\"\",Prezentace!#REF!)","v":{"$error":"#REF!"}},{"$f":"IF(Prezentace!#REF!=0,\"\",Prezentace!#REF!)","v":{"$error":"#REF!"}},{"$f":"Prezentace!#REF!","v":{"$error":"#REF!"}},{"$f":"IF(Prezentace!#REF!=0,\"\",Prezentace!#REF!)","v":{"$error":"#REF!"}},{"$f":"IF(Prezentace!#REF!=0,\"\",Prezentace!#REF!)","v":{"$error":"#REF!"}},null,null,null,null,null,null,null,null,null,null,null,null,null,null,0]
[{"$f":"IF(Prezentace!#REF!=0,\"\",Prezentace!#REF!)","v":{"$error":"#REF!"}},{"$f":"IF(Prezentace!#REF!=0,\"\",Prezentace!#REF!)","v":{"$error":"#REF!"}},{"$f":"Prezentace!#REF!","v":{"$error":"#REF!"}},{"$f":"IF(Prezentace!#REF!=0,\"\",Prezentace!#REF!)","v":{"$error":"#REF!"}},{"$f":"IF(Prezentace!#REF!=0,\"\",Prezentace!#REF!)","v":{"$error":"#REF!"}},null,null,null,null,null,null,null,null,null,null,null,null,null,null,0]
[{"$f":"IF(Prezentace!#REF!=0,\"\",Prezentace!#REF!)","v":{"$error":"#REF!"}},{"$f":"IF(Prezentace!#REF!=0,\"\",Prezentace!#REF!)","v":{"$error":"#REF!"}},{"$f":"Prezentace!#REF!","v":{"$error":"#REF!"}},{"$f":"IF(Prezentace!#REF!=0,\"\",Prezentace!#REF!)","v":{"$error":"#REF!"}},{"$f":"IF(Prezentace!#REF!=0,\"\",Prezentace!#REF!)","v":{"$error":"#REF!"}},null,null,null,null,null,null,null,null,null,null,null,null,null,null,0]
[{"$f":"IF(Prezentace!#REF!=0,\"\",Prezentace!#REF!)","v":{"$error":"#REF!"}},{"$f":"IF(Prezentace!#REF!=0,\"\",Prezentace!#REF!)","v":{"$error":"#REF!"}},{"$f":"Prezentace!#REF!","v":{"$error":"#REF!"}},{"$f":"IF(Prezentace!#REF!=0,\"\",Prezentace!#REF!)","v":{"$error":"#REF!"}},{"$f":"IF(Prezentace!#REF!=0,\"\",Prezentace!#REF!)","v":{"$error":"#REF!"}},null,null,null,null,null,null,null,null,null,null,null,null,null,null,0]
[{"$f":"IF(Prezentace!#REF!=0,\"\",Prezentace!#REF!)","v":{"$error":"#REF!"}},{"$f":"IF(Prezentace!#REF!=0,\"\",Prezentace!#REF!)","v":{"$error":"#REF!"}},{"$f":"Prezentace!#REF!","v":{"$error":"#REF!"}},{"$f":"IF(Prezentace!#REF!=0,\"\",Prezentace!#REF!)","v":{"$error":"#REF!"}},{"$f":"IF(Prezentace!#REF!=0,\"\",Prezentace!#REF!)","v":{"$error":"#REF!"}},null,null,null,null,null,null,null,null,null,null,null,null,null,null,0]
[{"$f":"IF(Prezentace!#REF!=0,\"\",Prezentace!#REF!)","v":{"$error":"#REF!"}},{"$f":"IF(Prezentace!#REF!=0,\"\",Prezentace!#REF!)","v":{"$error":"#REF!"}},{"$f":"Prezentace!#REF!","v":{"$error":"#REF!"}},{"$f":"IF(Prezentace!#REF!=0,\"\",Prezentace!#REF!)","v":{"$error":"#REF!"}},{"$f":"IF(Prezentace!#REF!=0,\"\",Prezentace!#REF!)","v":{"$error":"#REF!"}},null,null,null,null,null,null,null,null,null,null,null,null,null,null,{"$f":"(SUM(F38*$F$3,G38*$G$3,H38*$H$3,I38*$I$3,J38*$J$3,K38*$K$3,L38*$L$3,M38*$M$3,N38*$N$3,O38*$O$3,P38*$P$3,Q38*$Q$3,R38*$R$3))-S38","v":0}]
[{"$f":"IF(Prezentace!#REF!=0,\"\",Prezentace!#REF!)","v":{"$error":"#REF!"}},{"$f":"IF(Prezentace!#REF!=0,\"\",Prezentace!#REF!)","v":{"$error":"#REF!"}},{"$f":"Prezentace!#REF!","v":{"$error":"#REF!"}},{"$f":"IF(Prezentace!#REF!=0,\"\",Prezentace!#REF!)","v":{"$error":"#REF!"}},{"$f":"IF(Prezentace!#REF!=0,\"\",Prezentace!#REF!)","v":{"$error":"#REF!"}},null,null,null,null,null,null,null,null,null,null,null,null,null,null,0]
[{"$f":"IF(Prezentace!#REF!=0,\"\",Prezentace!#REF!)","v":{"$error":"#REF!"}},{"$f":"IF(Prezentace!#REF!=0,\"\",Prezentace!#REF!)","v":{"$error":"#REF!"}},{"$f":"Prezentace!#REF!","v":{"$error":"#REF!"}},{"$f":"IF(Prezentace!#REF!=0,\"\",Prezentace!#REF!)","v":{"$error":"#REF!"}},{"$f":"IF(Prezentace!#REF!=0,\"\",Prezentace!#REF!)","v":{"$error":"#REF!"}},null,null,null,null,null,null,null,null,null,null,null,null,null,null,0]
[{"$f":"IF(Prezentace!#REF!=0,\"\",Prezentace!#REF!)","v":{"$error":"#REF!"}},{"$f":"IF(Prezentace!#REF!=0,\"\",Prezentace!#REF!)","v":{"$error":"#REF!"}},{"$f":"Prezentace!#REF!","v":{"$error":"#REF!"}},{"$f":"IF(Prezentace!#REF!=0,\"\",Prezentace!#REF!)","v":{"$error":"#REF!"}},{"$f":"IF(Prezentace!#REF!=0,\"\",Prezentace!#REF!)","v":{"$error":"#REF!"}},null,null,null,null,null,null,null,null,null,null,null,null,null,null,0]
[{"$f":"IF(Prezentace!#REF!=0,\"\",Prezentace!#REF!)","v":{"$error":"#REF!"}},{"$f":"IF(Prezentace!#REF!=0,\"\",Prezentace!#REF!)","v":{"$error":"#REF!"}},{"$f":"Prezentace!#REF!","v":{"$error":"#REF!"}},{"$f":"IF(Prezentace!#REF!=0,\"\",Prezentace!#REF!)","v":{"$error":"#REF!"}},{"$f":"IF(Prezentace!#REF!=0,\"\",Prezentace!#REF!)","v":{"$error":"#REF!"}},null,null,null,null,null,null,null,null,null,null,null,null,null,null,0]
[{"$f":"IF(Prezentace!#REF!=0,\"\",Prezentace!#REF!)","v":{"$error":"#REF!"}},{"$f":"IF(Prezentace!#REF!=0,\"\",Prezentace!#REF!)","v":{"$error":"#REF!"}},{"$f":"Prezentace!#REF!","v":{"$error":"#REF!"}},{"$f":"IF(Prezentace!#REF!=0,\"\",Prezentace!#REF!)","v":{"$error":"#REF!"}},{"$f":"IF(Prezentace!#REF!=0,\"\",Prezentace!#REF!)","v":{"$error":"#REF!"}},null,null,null,null,null,null,null,null,null,null,null,null,null,null,0]
[{"$f":"IF(Prezentace!#REF!=0,\"\",Prezentace!#REF!)","v":{"$error":"#REF!"}},{"$f":"IF(Prezentace!#REF!=0,\"\",Prezentace!#REF!)","v":{"$error":"#REF!"}},{"$f":"Prezentace!#REF!","v":{"$error":"#REF!"}},{"$f":"IF(Prezentace!#REF!=0,\"\",Prezentace!#REF!)","v":{"$error":"#REF!"}},{"$f":"IF(Prezentace!#REF!=0,\"\",Prezentace!#REF!)","v":{"$error":"#REF!"}},null,null,null,null,null,null,null,null,null,null,null,null,null,null,0]
[{"$f":"IF(Prezentace!#REF!=0,\"\",Prezentace!#REF!)","v":{"$error":"#REF!"}},{"$f":"IF(Prezentace!#REF!=0,\"\",Prezentace!#REF!)","v":{"$error":"#REF!"}},{"$f":"Prezentace!#REF!","v":{"$error":"#REF!"}},{"$f":"IF(Prezentace!#REF!=0,\"\",Prezentace!#REF!)","v":{"$error":"#REF!"}},{"$f":"IF(Prezentace!#REF!=0,\"\",Prezentace!#REF!)","v":{"$error":"#REF!"}},null,null,null,null,null,null,null,null,null,null,null,null,null,null,0]
[{"$f":"IF(Prezentace!#REF!=0,\"\",Prezentace!#REF!)","v":{"$error":"#REF!"}},{"$f":"IF(Prezentace!#REF!=0,\"\",Prezentace!#REF!)","v":{"$error":"#REF!"}},{"$f":"Prezentace!#REF!","v":{"$error":"#REF!"}},{"$f":"IF(Prezentace!#REF!=0,\"\",Prezentace!#REF!)","v":{"$error":"#REF!"}},{"$f":"IF(Prezentace!#REF!=0,\"\",Prezentace!#REF!)","v":{"$error":"#REF!"}},null,null,null,null,null,null,null,null,null,null,null,null,null,null,0]
[{"$f":"IF(Prezentace!#REF!=0,\"\",Prezentace!#REF!)","v":{"$error":"#REF!"}},{"$f":"IF(Prezentace!#REF!=0,\"\",Prezentace!#REF!)","v":{"$error":"#REF!"}},{"$f":"Prezentace!#REF!","v":{"$error":"#REF!"}},{"$f":"IF(Prezentace!#REF!=0,\"\",Prezentace!#REF!)","v":{"$error":"#REF!"}},{"$f":"IF(Prezentace!#REF!=0,\"\",Prezentace!#REF!)","v":{"$error":"#REF!"}},null,null,null,null,null,null,null,null,null,null,null,null,null,null,0]
[{"$f":"IF(Prezentace!#REF!=0,\"\",Prezentace!#REF!)","v":{"$error":"#REF!"}},{"$f":"IF(Prezentace!#REF!=0,\"\",Prezentace!#REF!)","v":{"$error":"#REF!"}},{"$f":"Prezentace!#REF!","v":{"$error":"#REF!"}},{"$f":"IF(Prezentace!#REF!=0,\"\",Prezentace!#REF!)","v":{"$error":"#REF!"}},{"$f":"IF(Prezentace!#REF!=0,\"\",Prezentace!#REF!)","v":{"$error":"#REF!"}},null,null,null,null,null,null,null,null,null,null,null,null,null,null,0]
[{"$f":"IF(Prezentace!#REF!=0,\"\",Prezentace!#REF!)","v":{"$error":"#REF!"}},{"$f":"IF(Prezentace!#REF!=0,\"\",Prezentace!#REF!)","v":{"$error":"#REF!"}},{"$f":"Prezentace!#REF!","v":{"$error":"#REF!"}},{"$f":"IF(Prezentace!#REF!=0,\"\",Prezentace!#REF!)","v":{"$error":"#REF!"}},{"$f":"IF(Prezentace!#REF!=0,\"\",Prezentace!#REF!)","v":{"$error":"#REF!"}},null,null,null,null,null,null,null,null,null,null,null,null,null,null,0]
[{"$f":"IF(Prezentace!#REF!=0,\"\",Prezentace!#REF!)","v":{"$error":"#REF!"}},{"$f":"IF(Prezentace!#REF!=0,\"\",Prezentace!#REF!)","v":{"$error":"#REF!"}},{"$f":"Prezentace!#REF!","v":{"$error":"#REF!"}},{"$f":"IF(Prezentace!#REF!=0,\"\",Prezentace!#REF!)","v":{"$error":"#REF!"}},{"$f":"IF(Prezentace!#REF!=0,\"\",Prezentace!#REF!)","v":{"$error":"#REF!"}},null,null,null,null,null,null,null,null,null,null,null,null,null,null,0]
[{"$f":"IF(Prezentace!#REF!=0,\"\",Prezentace!#REF!)","v":{"$error":"#REF!"}},{"$f":"IF(Prezentace!#REF!=0,\"\",Prezentace!#REF!)","v":{"$error":"#REF!"}},{"$f":"Prezentace!#REF!","v":{"$error":"#REF!"}},{"$f":"IF(Prezentace!#REF!=0,\"\",Prezentace!#REF!)","v":{"$error":"#REF!"}},{"$f":"IF(Prezentace!#REF!=0,\"\",Prezentace!#REF!)","v":{"$error":"#REF!"}},null,null,null,null,null,null,null,null,null,null,null,null,null,null,0]
[{"$f":"IF(Prezentace!#REF!=0,\"\",Prezentace!#REF!)","v":{"$error":"#REF!"}},{"$f":"IF(Prezentace!#REF!=0,\"\",Prezentace!#REF!)","v":{"$error":"#REF!"}},{"$f":"Prezentace!#REF!","v":{"$error":"#REF!"}},{"$f":"IF(Prezentace!#REF!=0,\"\",Prezentace!#REF!)","v":{"$error":"#REF!"}},{"$f":"IF(Prezentace!#REF!=0,\"\",Prezentace!#REF!)","v":{"$error":"#REF!"}},null,null,null,null,null,null,null,null,null,null,null,null,null,null,0]
[{"$f":"IF(Prezentace!#REF!=0,\"\",Prezentace!#REF!)","v":{"$error":"#REF!"}},{"$f":"IF(Prezentace!#REF!=0,\"\",Prezentace!#REF!)","v":{"$error":"#REF!"}},{"$f":"Prezentace!#REF!","v":{"$error":"#REF!"}},{"$f":"IF(Prezentace!#REF!=0,\"\",Prezentace!#REF!)","v":{"$error":"#REF!"}},{"$f":"IF(Prezentace!#REF!=0,\"\",Prezentace!#REF!)","v":{"$error":"#REF!"}},null,null,null,null,null,null,null,null,null,null,null,null,null,null,0]
[{"$f":"IF(Prezentace!#REF!=0,\"\",Prezentace!#REF!)","v":{"$error":"#REF!"}},{"$f":"IF(Prezentace!#REF!=0,\"\",Prezentace!#REF!)","v":{"$error":"#REF!"}},{"$f":"Prezentace!#REF!","v":{"$error":"#REF!"}},{"$f":"IF(Prezentace!#REF!=0,\"\",Prezentace!#REF!)","v":{"$error":"#REF!"}},{"$f":"IF(Prezentace!#REF!=0,\"\",Prezentace!#REF!)","v":{"$error":"#REF!"}},null,null,null,null,null,null,null,null,null,null,null,null,null,null,0]
[{"$f":"IF(Prezentace!#REF!=0,\"\",Prezentace!#REF!)","v":{"$error":"#REF!"}},{"$f":"IF(Prezentace!#REF!=0,\"\",Prezentace!#REF!)","v":{"$error":"#REF!"}},{"$f":"Prezentace!#REF!","v":{"$error":"#REF!"}},{"$f":"IF(Prezentace!#REF!=0,\"\",Prezentace!#REF!)","v":{"$error":"#REF!"}},{"$f":"IF(Prezentace!#REF!=0,\"\",Prezentace!#REF!)","v":{"$error":"#REF!"}},null,null,null,null,null,null,null,null,null,null,null,null,null,null,0]
[{"$f":"IF(Prezentace!#REF!=0,\"\",Prezentace!#REF!)","v":{"$error":"#REF!"}},{"$f":"IF(Prezentace!#REF!=0,\"\",Prezentace!#REF!)","v":{"$error":"#REF!"}},{"$f":"Prezentace!#REF!","v":{"$error":"#REF!"}},{"$f":"IF(Prezentace!#REF!=0,\"\",Prezentace!#REF!)","v":{"$error":"#REF!"}},{"$f":"IF(Prezentace!#REF!=0,\"\",Prezentace!#REF!)","v":{"$error":"#REF!"}},null,null,null,null,null,null,null,null,null,null,null,null,null,null,0]
[{"$f":"IF(Prezentace!#REF!=0,\"\",Prezentace!#REF!)","v":{"$error":"#REF!"}},{"$f":"IF(Prezentace!#REF!=0,\"\",Prezentace!#REF!)","v":{"$error":"#REF!"}},{"$f":"Prezentace!#REF!","v":{"$error":"#REF!"}},{"$f":"IF(Prezentace!#REF!=0,\"\",Prezentace!#REF!)","v":{"$error":"#REF!"}},{"$f":"IF(Prezentace!#REF!=0,\"\",Prezentace!#REF!)","v":{"$error":"#REF!"}},null,null,null,null,null,null,null,null,null,null,null,null,null,null,0]
[{"$f":"IF(Prezentace!#REF!=0,\"\",Prezentace!#REF!)","v":{"$error":"#REF!"}},{"$f":"IF(Prezentace!#REF!=0,\"\",Prezentace!#REF!)","v":{"$error":"#REF!"}},{"$f":"Prezentace!#REF!","v":{"$error":"#REF!"}},{"$f":"IF(Prezentace!#REF!=0,\"\",Prezentace!#REF!)","v":{"$error":"#REF!"}},{"$f":"IF(Prezentace!#REF!=0,\"\",Prezentace!#REF!)","v":{"$error":"#REF!"}},null,null,null,null,null,null,null,null,null,null,null,null,null,null,0]
[{"$f":"IF(Prezentace!A32=0,\"\",Prezentace!A32)","v":""},{"$f":"IF(Prezentace!B32=0,\"\",Prezentace!B32)","v":""},{"$f":"Prezentace!D32","v":"P"},{"$f":"IF(Prezentace!F32=0,\"\",Prezentace!F32)","v":""},{"$f":"IF(Prezentace!E32=0,\"\",Prezentace!E32)","v":""},null,null,null,null,null,null,null,null,null,null,null,null,null,null,0]
[{"$f":"IF(Prezentace!A33=0,\"\",Prezentace!A33)","v":""},{"$f":"IF(Prezentace!B33=0,\"\",Prezentace!B33)","v":""},{"$f":"Prezentace!D33","v":"P"},{"$f":"IF(Prezentace!F33=0,\"\",Prezentace!F33)","v":""},{"$f":"IF(Prezentace!E33=0,\"\",Prezentace!E33)","v":""},null,null,null,null,null,null,null,null,null,null,null,null,null,null,0]
[{"$f":"IF(Prezentace!A34=0,\"\",Prezentace!A34)","v":""},{"$f":"IF(Prezentace!B34=0,\"\",Prezentace!B34)","v":""},{"$f":"Prezentace!D34","v":"P"},{"$f":"IF(Prezentace!F34=0,\"\",Prezentace!F34)","v":""},{"$f":"IF(Prezentace!E34=0,\"\",Prezentace!E34)","v":""},null,null,null,null,null,null,null,null,null,null,null,null,null,null,0]
[{"$f":"IF(Prezentace!A35=0,\"\",Prezentace!A35)","v":""},{"$f":"IF(Prezentace!B35=0,\"\",Prezentace!B35)","v":""},{"$f":"Prezentace!D35","v":"P"},{"$f":"IF(Prezentace!F35=0,\"\",Prezentace!F35)","v":""},{"$f":"IF(Prezentace!E35=0,\"\",Prezentace!E35)","v":""},null,null,null,null,null,null,null,null,null,null,null,null,null,null,0]
[{"$f":"IF(Prezentace!A36=0,\"\",Prezentace!A36)","v":""},{"$f":"IF(Prezentace!B36=0,\"\",Prezentace!B36)","v":""},{"$f":"Prezentace!D36","v":"P"},{"$f":"IF(Prezentace!F36=0,\"\",Prezentace!F36)","v":""},{"$f":"IF(Prezentace!E36=0,\"\",Prezentace!E36)","v":""},null,null,null,null,null,null,null,null,null,null,null,null,null,null,0]
[{"$f":"IF(Prezentace!A37=0,\"\",Prezentace!A37)","v":""},{"$f":"IF(Prezentace!B37=0,\"\",Prezentace!B37)","v":""},{"$f":"Prezentace!D37","v":"P"},{"$f":"IF(Prezentace!F37=0,\"\",Prezentace!F37)","v":""},{"$f":"IF(Prezentace!E37=0,\"\",Prezentace!E37)","v":""},null,null,null,null,null,null,null,null,null,null,null,null,null,null,0]
[{"$f":"IF(Prezentace!A38=0,\"\",Prezentace!A38)","v":""},{"$f":"IF(Prezentace!B38=0,\"\",Prezentace!B38)","v":""},{"$f":"Prezentace!D38","v":"P"},{"$f":"IF(Prezentace!F38=0,\"\",Prezentace!F38)","v":""},{"$f":"IF(Prezentace!E38=0,\"\",Prezentace!E38)","v":""},null,null,null,null,null,null,null,null,null,null,null,null,null,null,0]
[{"$f":"IF(Prezentace!A39=0,\"\",Prezentace!A39)","v":""},{"$f":"IF(Prezentace!B39=0,\"\",Prezentace!B39)","v":""},{"$f":"Prezentace!D39","v":"P"},{"$f":"IF(Prezentace!F39=0,\"\",Prezentace!F39)","v":""},{"$f":"IF(Prezentace!E39=0,\"\",Prezentace!E39)","v":""},null,null,null,null,null,null,null,null,null,null,null,null,null,null,0]
[{"$f":"IF(Prezentace!A40=0,\"\",Prezentace!A40)","v":""},{"$f":"IF(Prezentace!B40=0,\"\",Prezentace!B40)","v":""},{"$f":"Prezentace!D40","v":"P"},{"$f":"IF(Prezentace!F40=0,\"\",Prezentace!F40)","v":""},{"$f":"IF(Prezentace!E40=0,\"\",Prezentace!E40)","v":""},null,null,null,null,null,null,null,null,null,null,null,null,null,null,0]
[{"$f":"IF(Prezentace!A41=0,\"\",Prezentace!A41)","v":""},{"$f":"IF(Prezentace!B41=0,\"\",Prezentace!B41)","v":""},{"$f":"Prezentace!D41","v":"P"},{"$f":"IF(Prezentace!F41=0,\"\",Prezentace!F41)","v":""},{"$f":"IF(Prezentace!E41=0,\"\",Prezentace!E41)","v":""},null,null,null,null,null,null,null,null,null,null,null,null,null,null,0]
[{"$f":"IF(Prezentace!A42=0,\"\",Prezentace!A42)","v":""},{"$f":"IF(Prezentace!B42=0,\"\",Prezentace!B42)","v":""},{"$f":"Prezentace!D42","v":"P"},{"$f":"IF(Prezentace!F42=0,\"\",Prezentace!F42)","v":""},{"$f":"IF(Prezentace!E42=0,\"\",Prezentace!E42)","v":""},null,null,null,null,null,null,null,null,null,null,null,null,null,null,0]
[{"$f":"IF(Prezentace!A43=0,\"\",Prezentace!A43)","v":""},{"$f":"IF(Prezentace!B43=0,\"\",Prezentace!B43)","v":""},{"$f":"Prezentace!D43","v":"P"},{"$f":"IF(Prezentace!F43=0,\"\",Prezentace!F43)","v":""},{"$f":"IF(Prezentace!E43=0,\"\",Prezentace!E43)","v":""},null,null,null,null,null,null,null,null,null,null,null,null,null,null,0]
[{"$f":"IF(Prezentace!A44=0,\"\",Prezentace!A44)","v":""},{"$f":"IF(Prezentace!B44=0,\"\",Prezentace!B44)","v":""},{"$f":"Prezentace!D44","v":"P"},{"$f":"IF(Prezentace!F44=0,\"\",Prezentace!F44)","v":""},{"$f":"IF(Prezentace!E44=0,\"\",Prezentace!E44)","v":""},null,null,null,null,null,null,null,null,null,null,null,null,null,null,0]
[{"$f":"IF(Prezentace!A45=0,\"\",Prezentace!A45)","v":""},{"$f":"IF(Prezentace!B45=0,\"\",Prezentace!B45)","v":""},{"$f":"Prezentace!D45","v":"P"},{"$f":"IF(Prezentace!F45=0,\"\",Prezentace!F45)","v":""},{"$f":"IF(Prezentace!E45=0,\"\",Prezentace!E45)","v":""},null,null,null,null,null,null,null,null,null,null,null,null,null,null,0]
[{"$f":"IF(Prezentace!A46=0,\"\",Prezentace!A46)","v":""},{"$f":"IF(Prezentace!B46=0,\"\",Prezentace!B46)","v":""},{"$f":"Prezentace!D46","v":"P"},{"$f":"IF(Prezentace!F46=0,\"\",Prezentace!F46)","v":""},{"$f":"IF(Prezentace!E46=0,\"\",Prezentace!E46)","v":""},null,null,null,null,null,null,null,null,null,null,null,null,null,null,0]
[{"$f":"IF(Prezentace!A47=0,\"\",Prezentace!A47)","v":""},{"$f":"IF(Prezentace!B47=0,\"\",Prezentace!B47)","v":""},{"$f":"Prezentace!D47","v":"P"},{"$f":"IF(Prezentace!F47=0,\"\",Prezentace!F47)","v":""},{"$f":"IF(Prezentace!E47=0,\"\",Prezentace!E47)","v":""},null,null,null,null,null,null,null,null,null,null,null,null,null,null,0]
[{"$f":"IF(Prezentace!A48=0,\"\",Prezentace!A48)","v":""},{"$f":"IF(Prezentace!B48=0,\"\",Prezentace!B48)","v":""},{"$f":"Prezentace!D48","v":"P"},{"$f":"IF(Prezentace!F48=0,\"\",Prezentace!F48)","v":""},{"$f":"IF(Prezentace!E48=0,\"\",Prezentace!E48)","v":""},null,null,null,null,null,null,null,null,null,null,null,null,null,null,0]
[{"$f":"IF(Prezentace!A49=0,\"\",Prezentace!A49)","v":""},{"$f":"IF(Prezentace!B49=0,\"\",Prezentace!B49)","v":""},{"$f":"Prezentace!D49","v":"P"},{"$f":"IF(Prezentace!F49=0,\"\",Prezentace!F49)","v":""},{"$f":"IF(Prezentace!E49=0,\"\",Prezentace!E49)","v":""},null,null,null,null,null,null,null,null,null,null,null,null,null,null,0]
[{"$f":"IF(Prezentace!A50=0,\"\",Prezentace!A50)","v":""},{"$f":"IF(Prezentace!B50=0,\"\",Prezentace!B50)","v":""},{"$f":"Prezentace!D50","v":"P"},{"$f":"IF(Prezentace!F50=0,\"\",Prezentace!F50)","v":""},{"$f":"IF(Prezentace!E50=0,\"\",Prezentace!E50)","v":""},null,null,null,null,null,null,null,null,null,null,null,null,null,null,0]
[{"$f":"IF(Prezentace!A51=0,\"\",Prezentace!A51)","v":""},{"$f":"IF(Prezentace!B51=0,\"\",Prezentace!B51)","v":""},{"$f":"Prezentace!D51","v":"P"},{"$f":"IF(Prezentace!F51=0,\"\",Prezentace!F51)","v":""},{"$f":"IF(Prezentace!E51=0,\"\",Prezentace!E51)","v":""},null,null,null,null,null,null,null,null,null,null,null,null,null,null,0]
[{"$f":"IF(Prezentace!A52=0,\"\",Prezentace!A52)","v":""},{"$f":"IF(Prezentace!B52=0,\"\",Prezentace!B52)","v":""},{"$f":"Prezentace!D52","v":"P"},{"$f":"IF(Prezentace!F52=0,\"\",Prezentace!F52)","v":""},{"$f":"IF(Prezentace!E52=0,\"\",Prezentace!E52)","v":""},null,null,null,null,null,null,null,null,null,null,null,null,null,null,0]
[{"$f":"IF(Prezentace!A53=0,\"\",Prezentace!A53)","v":""},{"$f":"IF(Prezentace!B53=0,\"\",Prezentace!B53)","v":""},{"$f":"Prezentace!D53","v":"P"},{"$f":"IF(Prezentace!F53=0,\"\",Prezentace!F53)","v":""},{"$f":"IF(Prezentace!E53=0,\"\",Prezentace!E53)","v":""},null,null,null,null,null,null,null,null,null,null,null,null,null,null,0]
[{"$f":"IF(Prezentace!A54=0,\"\",Prezentace!A54)","v":""},{"$f":"IF(Prezentace!B54=0,\"\",Prezentace!B54)","v":""},{"$f":"Prezentace!D54","v":"P"},{"$f":"IF(Prezentace!F54=0,\"\",Prezentace!F54)","v":""},{"$f":"IF(Prezentace!E54=0,\"\",Prezentace!E54)","v":""},null,null,null,null,null,null,null,null,null,null,null,null,null,null,0]
[{"$f":"IF(Prezentace!A55=0,\"\",Prezentace!A55)","v":""},{"$f":"IF(Prezentace!B55=0,\"\",Prezentace!B55)","v":""},{"$f":"Prezentace!D55","v":"P"},{"$f":"IF(Prezentace!F55=0,\"\",Prezentace!F55)","v":""},{"$f":"IF(Prezentace!E55=0,\"\",Prezentace!E55)","v":""},null,null,null,null,null,null,null,null,null,null,null,null,null,null,0]
[{"$f":"IF(Prezentace!A56=0,\"\",Prezentace!A56)","v":""},{"$f":"IF(Prezentace!B56=0,\"\",Prezentace!B56)","v":""},{"$f":"Prezentace!D56","v":"P"},{"$f":"IF(Prezentace!F56=0,\"\",Prezentace!F56)","v":""},{"$f":"IF(Prezentace!E56=0,\"\",Prezentace!E56)","v":""},null,null,null,null,null,null,null,null,null,null,null,null,null,null,0]
[{"$f":"IF(Prezentace!A57=0,\"\",Prezentace!A57)","v":""},{"$f":"IF(Prezentace!B57=0,\"\",Prezentace!B57)","v":""},{"$f":"Prezentace!D57","v":"P"},{"$f":"IF(Prezentace!F57=0,\"\",Prezentace!F57)","v":""},{"$f":"IF(Prezentace!E57=0,\"\",Prezentace!E57)","v":""},null,null,null,null,null,null,null,null,null,null,null,null,null,null,0]
[{"$f":"IF(Prezentace!A58=0,\"\",Prezentace!A58)","v":""},{"$f":"IF(Prezentace!B58=0,\"\",Prezentace!B58)","v":""},{"$f":"Prezentace!D58","v":"P"},{"$f":"IF(Prezentace!F58=0,\"\",Prezentace!F58)","v":""},{"$f":"IF(Prezentace!E58=0,\"\",Prezentace!E58)","v":""},null,null,null,null,null,null,null,null,null,null,null,null,null,null,0]
[{"$f":"IF(Prezentace!A59=0,\"\",Prezentace!A59)","v":""},{"$f":"IF(Prezentace!B59=0,\"\",Prezentace!B59)","v":""},{"$f":"Prezentace!D59","v":"P"},{"$f":"IF(Prezentace!F59=0,\"\",Prezentace!F59)","v":""},{"$f":"IF(Prezentace!E59=0,\"\",Prezentace!E59)","v":""},null,null,null,null,null,null,null,null,null,null,null,null,null,null,0]
[{"$f":"IF(Prezentace!A60=0,\"\",Prezentace!A60)","v":""},{"$f":"IF(Prezentace!B60=0,\"\",Prezentace!B60)","v":""},{"$f":"Prezentace!D60","v":"P"},{"$f":"IF(Prezentace!F60=0,\"\",Prezentace!F60)","v":""},{"$f":"IF(Prezentace!E60=0,\"\",Prezentace!E60)","v":""},null,null,null,null,null,null,null,null,null,null,null,null,null,null,0]
[{"$f":"IF(Prezentace!A61=0,\"\",Prezentace!A61)","v":""},{"$f":"IF(Prezentace!B61=0,\"\",Prezentace!B61)","v":""},{"$f":"Prezentace!D61","v":"P"},{"$f":"IF(Prezentace!F61=0,\"\",Prezentace!F61)","v":""},{"$f":"IF(Prezentace!E61=0,\"\",Prezentace!E61)","v":""},null,null,null,null,null,null,null,null,null,null,null,null,null,null,0]
[{"$f":"IF(Prezentace!A62=0,\"\",Prezentace!A62)","v":""},{"$f":"IF(Prezentace!B62=0,\"\",Prezentace!B62)","v":""},{"$f":"Prezentace!D62","v":"P"},{"$f":"IF(Prezentace!F62=0,\"\",Prezentace!F62)","v":""},{"$f":"IF(Prezentace!E62=0,\"\",Prezentace!E62)","v":""},null,null,null,null,null,null,null,null,null,null,null,null,null,null,0]
[{"$f":"IF(Prezentace!A63=0,\"\",Prezentace!A63)","v":""},{"$f":"IF(Prezentace!B63=0,\"\",Prezentace!B63)","v":""},{"$f":"Prezentace!D63","v":"P"},{"$f":"IF(Prezentace!F63=0,\"\",Prezentace!F63)","v":""},{"$f":"IF(Prezentace!E63=0,\"\",Prezentace!E63)","v":""},null,null,null,null,null,null,null,null,null,null,null,null,null,null,0]
[{"$f":"IF(Prezentace!A64=0,\"\",Prezentace!A64)","v":""},{"$f":"IF(Prezentace!B64=0,\"\",Prezentace!B64)","v":""},{"$f":"Prezentace!D64","v":"P"},{"$f":"IF(Prezentace!F64=0,\"\",Prezentace!F64)","v":""},{"$f":"IF(Prezentace!E64=0,\"\",Prezentace!E64)","v":""},null,null,null,null,null,null,null,null,null,null,null,null,null,null,0]
[{"$f":"IF(Prezentace!A65=0,\"\",Prezentace!A65)","v":""},{"$f":"IF(Prezentace!B65=0,\"\",Prezentace!B65)","v":""},{"$f":"Prezentace!D65","v":"P"},{"$f":"IF(Prezentace!F65=0,\"\",Prezentace!F65)","v":""},{"$f":"IF(Prezentace!E65=0,\"\",Prezentace!E65)","v":""},null,null,null,null,null,null,null,null,null,null,null,null,null,null,0]
[{"$f":"IF(Prezentace!A66=0,\"\",Prezentace!A66)","v":""},{"$f":"IF(Prezentace!B66=0,\"\",Prezentace!B66)","v":""},{"$f":"Prezentace!D66","v":"P"},{"$f":"IF(Prezentace!F66=0,\"\",Prezentace!F66)","v":""},{"$f":"IF(Prezentace!E66=0,\"\",Prezentace!E66)","v":""},null,null,null,null,null,null,null,null,null,null,null,null,null,null,0]
[{"$f":"IF(Prezentace!A67=0,\"\",Prezentace!A67)","v":""},{"$f":"IF(Prezentace!B67=0,\"\",Prezentace!B67)","v":""},{"$f":"Prezentace!D67","v":"P"},{"$f":"IF(Prezentace!F67=0,\"\",Prezentace!F67)","v":""},{"$f":"IF(Prezentace!E67=0,\"\",Prezentace!E67)","v":""},null,null,null,null,null,null,null,null,null,null,null,null,null,null,0]
[{"$f":"IF(Prezentace!A68=0,\"\",Prezentace!A68)","v":""},{"$f":"IF(Prezentace!B68=0,\"\",Prezentace!B68)","v":""},{"$f":"Prezentace!D68","v":"P"},{"$f":"IF(Prezentace!F68=0,\"\",Prezentace!F68)","v":""},{"$f":"IF(Prezentace!E68=0,\"\",Prezentace!E68)","v":""},null,null,null,null,null,null,null,null,null,null,null,null,null,null,0]
[{"$f":"IF(Prezentace!A69=0,\"\",Prezentace!A69)","v":""},{"$f":"IF(Prezentace!B69=0,\"\",Prezentace!B69)","v":""},{"$f":"Prezentace!D69","v":"P"},{"$f":"IF(Prezentace!F69=0,\"\",Prezentace!F69)","v":""},{"$f":"IF(Prezentace!E69=0,\"\",Prezentace!E69)","v":""},null,null,null,null,null,null,null,null,null,null,null,null,null,null,0]
[{"$f":"IF(Prezentace!A70=0,\"\",Prezentace!A70)","v":""},{"$f":"IF(Prezentace!B70=0,\"\",Prezentace!B70)","v":""},{"$f":"Prezentace!D70","v":"P"},{"$f":"IF(Prezentace!F70=0,\"\",Prezentace!F70)","v":""},{"$f":"IF(Prezentace!E70=0,\"\",Prezentace!E70)","v":""},null,null,null,null,null,null,null,null,null,null,null,null,null,null,0]
[{"$f":"IF(Prezentace!A71=0,\"\",Prezentace!A71)","v":""},{"$f":"IF(Prezentace!B71=0,\"\",Prezentace!B71)","v":""},{"$f":"Prezentace!D71","v":"P"},{"$f":"IF(Prezentace!F71=0,\"\",Prezentace!F71)","v":""},{"$f":"IF(Prezentace!E71=0,\"\",Prezentace!E71)","v":""},null,null,null,null,null,null,null,null,null,null,null,null,null,null,0]
[{"$f":"IF(Prezentace!A72=0,\"\",Prezentace!A72)","v":""},{"$f":"IF(Prezentace!B72=0,\"\",Prezentace!B72)","v":""},{"$f":"Prezentace!D72","v":"P"},{"$f":"IF(Prezentace!F72=0,\"\",Prezentace!F72)","v":""},{"$f":"IF(Prezentace!E72=0,\"\",Prezentace!E72)","v":""},null,null,null,null,null,null,null,null,null,null,null,null,null,null,0]
[{"$f":"IF(Prezentace!A73=0,\"\",Prezentace!A73)","v":""},{"$f":"IF(Prezentace!B73=0,\"\",Prezentace!B73)","v":""},{"$f":"Prezentace!D73","v":"P"},{"$f":"IF(Prezentace!F73=0,\"\",Prezentace!F73)","v":""},{"$f":"IF(Prezentace!E73=0,\"\",Prezentace!E73)","v":""},null,null,null,null,null,null,null,null,null,null,null,null,null,null,0]
[{"$f":"IF(Prezentace!A74=0,\"\",Prezentace!A74)","v":""},{"$f":"IF(Prezentace!B74=0,\"\",Prezentace!B74)","v":""},{"$f":"Prezentace!D74","v":"P"},{"$f":"IF(Prezentace!F74=0,\"\",Prezentace!F74)","v":""},{"$f":"IF(Prezentace!E74=0,\"\",Prezentace!E74)","v":""},null,null,null,null,null,null,null,null,null,null,null,null,null,null,0]
[{"$f":"IF(Prezentace!A75=0,\"\",Prezentace!A75)","v":""},{"$f":"IF(Prezentace!B75=0,\"\",Prezentace!B75)","v":""},{"$f":"Prezentace!D75","v":"P"},{"$f":"IF(Prezentace!F75=0,\"\",Prezentace!F75)","v":""},{"$f":"IF(Prezentace!E75=0,\"\",Prezentace!E75)","v":""},null,null,null,null,null,null,null,null,null,null,null,null,null,null,{"$f":"(SUM(F102*$F$3,G102*$G$3,H102*$H$3,I102*$I$3,J102*$J$3,K102*$K$3,L102*$L$3,M102*$M$3,N102*$N$3,O102*$O$3,P102*$P$3,Q102*$Q$3,R102*$R$3))-S102","v":0}]

{"sheet":"6","index":12,"n_rows":102,"n_cols":22,"rows_kept":102,"cut":false,"hidden":true,"merged":[[0,3,0,20],[0,0,2,0],[0,1,2,1]]}
["Druž.","Kap.",null,"Disciplina 6"]
[]
[null,null,null,null,null,"K","M",1,2,3,4,5,6,7,8,9,10,11,12,"TB","Čas","Součet"]
[{"$f":"IF(Prezentace!A6=0,\"\",Prezentace!A6)","v":""},{"$f":"IF(Prezentace!B6=0,\"\",Prezentace!B6)","v":""},{"$f":"Prezentace!D6","v":"P"},{"$f":"IF(Prezentace!F6=0,\"\",Prezentace!F6)","v":"Milan"},{"$f":"IF(Prezentace!E6=0,\"\",Prezentace!E6)","v":"Matějka st."},null,null,null,null,null,null,null,null,null,null,null,null,null,null,null,null,{"$f":"(SUM(F4:T4))-U4","v":0}]
[{"$f":"IF(Prezentace!A7=0,\"\",Prezentace!A7)","v":""},{"$f":"IF(Prezentace!B7=0,\"\",Prezentace!B7)","v":""},{"$f":"Prezentace!D7","v":"P"},{"$f":"IF(Prezentace!F7=0,\"\",Prezentace!F7)","v":"Miroslav"},{"$f":"IF(Prezentace!E7=0,\"\",Prezentace!E7)","v":"Fiala  "},null,null,null,null,null,null,null,null,null,null,null,null,null,null,null,null,{"$f":"(SUM(F5:T5))-U5","v":0}]
[{"$f":"IF(Prezentace!A8=0,\"\",Prezentace!A8)","v":""},{"$f":"IF(Prezentace!B8=0,\"\",Prezentace!B8)","v":""},{"$f":"Prezentace!D8","v":"P"},{"$f":"IF(Prezentace!F8=0,\"\",Prezentace!F8)","v":"František"},{"$f":"IF(Prezentace!E8=0,\"\",Prezentace!E8)","v":"Toman "},null,null,null,null,null,null,null,null,null,null,null,null,null,null,null,null,0]
[{"$f":"IF(Prezentace!A9=0,\"\",Prezentace!A9)","v":""},{"$f":"IF(Prezentace!B9=0,\"\",Prezentace!B9)","v":""},{"$f":"Prezentace!D9","v":"P"},{"$f":"IF(Prezentace!F9=0,\"\",Prezentace!F9)","v":"Jiří"},{"$f":"IF(Prezentace!E9=0,\"\",Prezentace!E9)","v":"Švihálek "},null,null,null,null,null,null,null,null,null,null,null,null,null,null,null,null,0]
[{"$f":"IF(Prezentace!A10=0,\"\",Prezentace!A10)","v":""},{"$f":"IF(Prezentace!B10=0,\"\",Prezentace!B10)","v":""},{"$f":"Prezentace!D10","v":"R"},{"$f":"IF(Prezentace!F10=0,\"\",Prezentace!F10)","v":"Jiří"},{"$f":"IF(Prezentace!E10=0,\"\",Prezentace!E10)","v":"Švihálek "},null,null,null,null,null,null,null,null,null,null,null,null,null,null,null,null,0]
[{"$f":"IF(Prezentace!A11=0,\"\",Prezentace!A11)","v":""},{"$f":"IF(Prezentace!B11=0,\"\",Prezentace!B11)","v":""},{"$f":"Prezentace!D11","v":"P"},{"$f":"IF(Prezentace!F11=0,\"\",Prezentace!F11)","v":"Vladimír"},{"$f":"IF(Prezentace!E11=0,\"\",Prezentace!E11)","v":"VejslíK "},null,null,null,null,null,null,null,null,null,null,null,null,null,null,null,null,0]
[{"$f":"IF(Prezentace!A12=0,\"\",Prezentace!A12)","v":""},{"$f":"IF(Prezentace!B12=0,\"\",Prezentace!B12)","v":""},{"$f":"Prezentace!D12","v":"P"},{"$f":"IF(Prezentace!F12=0,\"\",Prezentace!F12)","v":"Milan"},{"$f":"IF(Prezentace!E12=0,\"\",Prezentace!E12)","v":"Kraus "},null,null,null,null,null,null,null,null,null,null,null,null,null,null,null,null,0]
[{"$f":"IF(Prezentace!#REF!=0,\"\",Prezentace!#REF!)","v":{"$error":"#REF!"}},{"$f":"IF(Prezentace!#REF!=0,\"\",Prezentace!#REF!)","v":{"$error":"#REF!"}},{"$f":"Prezentace!#REF!","v":{"$error":"#REF!"}},{"$f":"IF(Prezentace!#REF!=0,\"\",Prezentace!#REF!)","v":{"$error":"#REF!"}},{"$f":"IF(Prezentace!#REF!=0,\"\",Prezentace!#REF!)","v":{"$error":"#REF!"}},null,null,null,null,null,null,null,null,null,null,null,null,null,null,null,null,0]
[{"$f":"IF(Prezentace!A13=0,\"\",Prezentace!A13)","v":""},{"$f":"IF(Prezentace!B13=0,\"\",Prezentace!B13)","v":""},{"$f":"Prezentace!D13","v":"P"},{"$f":"IF(Prezentace!F13=0,\"\",Prezentace!F13)","v":"Vojtěch"},{"$f":"IF(Prezentace!E13=0,\"\",Prezentace!E13)","v":"Brejžek "},null,null,null,null,null,null,null,null,null,null,null,null,null,null,null,null,0]
[{"$f":"IF(Prezentace!A14=0,\"\",Prezentace!A14)","v":""},{"$f":"IF(Prezentace!B14=0,\"\",Prezentace!B14)","v":""},{"$f":"Prezentace!D14","v":"P"},{"$f":"IF(Prezentace!F14=0,\"\",Prezentace!F14)","v":"Karel"},{"$f":"IF(Prezentace!E14=0,\"\",Prezentace!E14)","v":"Získal "},null,null,null,null,null,null,null,null,null,null,null,null,null,null,null,null,0]
[{"$f":"IF(Prezentace!A15=0,\"\",Prezentace!A15)","v":""},{"$f":"IF(Prezentace!B15=0,\"\",Prezentace!B15)","v":""},{"$f":"Prezentace!D15","v":"R"},{"$f":"IF(Prezentace!F15=0,\"\",Prezentace!F15)","v":"Karel"},{"$f":"IF(Prezentace!E15=0,\"\",Prezentace!E15)","v":"Získal "},null,null,null,null,null,null,null,null,null,null,null,null,null,null,null,null,0]
[{"$f":"IF(Prezentace!A16=0,\"\",Prezentace!A16)","v":""},{"$f":"IF(Prezentace!B16=0,\"\",Prezentace!B16)","v":""},{"$f":"Prezentace!D16","v":"P"},{"$f":"IF(Prezentace!F16=0,\"\",Prezentace!F16)","v":"Marie"},{"$f":"IF(Prezentace!E16=0,\"\",Prezentace!E16)","v":"Žemličková"},null,null,null,null,null,null,null,null,null,null,null,null,null,null,null,null,0]
[{"$f":"IF(Prezentace!A17=0,\"\",Prezentace!A17)","v":""},{"$f":"IF(Prezentace!B17=0,\"\",Prezentace!B17)","v":""},{"$f":"Prezentace!D17","v":"P"},{"$f":"IF(Prezentace!F17=0,\"\",Prezentace!F17)","v":"Ladislav"},{"$f":"IF(Prezentace!E17=0,\"\",Prezentace!E17)","v":"Žemlička "},null,null,null,null,null,null,null,null,null,null,null,null,null,null,null,null,0]
[{"$f":"IF(Prezentace!A18=0,\"\",Prezentace!A18)","v":""},{"$f":"IF(Prezentace!B18=0,\"\",Prezentace!B18)","v":""},{"$f":"Prezentace!D18","v":"P"},{"$f":"IF(Prezentace!F18=0,\"\",Prezentace!F18)","v":"Jiří"},{"$f":"IF(Prezentace!E18=0,\"\",Prezentace!E18)","v":"Janovský "},null,null,null,null,null,null,null,null,null,null,null,null,null,null,null,null,0]
[{"$f":"IF(Prezentace!A19=0,\"\",Prezentace!A19)","v":""},{"$f":"IF(Prezentace!B19=0,\"\",Prezentace!B19)","v":""},{"$f":"Prezentace!D19","v":"P"},{"$f":"IF(Prezentace!F19=0,\"\",Prezentace!F19)","v":"Mojmír"},{"$f":"IF(Prezentace!E19=0,\"\",Prezentace!E19)","v":"Janovský "},null,null,null,null,null,null,null,null,null,null,null,null,null,null,null,null,0]
[{"$f":"IF(Prezentace!A20=0,\"\",Prezentace!A20)","v":""},{"$f":"IF(Prezentace!B20=0,\"\",Prezentace!B20)","v":""},{"$f":"Prezentace!D20","v":"P"},{"$f":"IF(Prezentace!F20=0,\"\",Prezentace!F20)","v":"Bohumil"},{"$f":"IF(Prezentace!E20=0,\"\",Prezentace!E20)","v":"Herceg"},null,null,null,null,null,null,null,null,null,null,null,null,null,null,null,null,0]
[{"$f":"IF(Prezentace!A21=0,\"\",Prezentace!A21)","v":""},{"$f":"IF(Prezentace!B21=0,\"\",Prezentace!B21)","v":""},{"$f":"Prezentace!D21","v":"P"},{"$f":"IF(Prezentace!F21=0,\"\",Prezentace!F21)","v":"Michal"},{"$f":"IF(Prezentace!E21=0,\"\",Prezentace!E21)","v":"Svoboda"},null,null,null,null,null,null,null,null,null,null,null,null,null,null,null,null,0]
[{"$f":"IF(Prezentace!A22=0,\"\",Prezentace!A22)","v":""},{"$f":"IF(Prezentace!B22=0,\"\",Prezentace!B22)","v":""},{"$f":"Prezentace!D22","v":"P"},{"$f":"IF(Prezentace!F22=0,\"\",Prezentace!F22)","v":"Viktor"},{"$f":"IF(Prezentace!E22=0,\"\",Prezentace!E22)","v":"Fuksa  "},null,null,null,null,null,null,null,null,null,null,null,null,null,null,null,null,0]
[{"$f":"IF(Prezentace!A23=0,\"\",Prezentace!A23)","v":""},{"$f":"IF(Prezentace!B23=0,\"\",Prezentace!B23)","v":""},{"$f":"Prezentace!D23","v":"P"},{"$f":"IF(Prezentace!F23=0,\"\",Prezentace!F23)","v":"Miroslav"},{"$f":"IF(Prezentace!E23=0,\"\",Prezentace!E23)","v":"Koch   ml."},null,null,null,null,null,null,null,null,null,null,null,null,null,null,null,null,0]
[{"$f":"IF(Prezentace!A24=0,\"\",Prezentace!A24)","v":""},{"$f":"IF(Prezentace!B24=0,\"\",Prezentace!B24)","v":""},{"$f":"Prezentace!D24","v":"P"},{"$f":"IF(Prezentace!F24=0,\"\",Prezentace!F24)","v":"Miroslav"},{"$f":"IF(Prezentace!E24=0,\"\",Prezentace!E24)","v":"Koch  st. "},null,null,null,null,null,null,null,null,null,null,null,null,null,null,null,null,0]
[{"$f":"IF(Prezentace!A25=0,\"\",Prezentace!A25)","v":""},{"$f":"IF(Prezentace!B25=0,\"\",Prezentace!B25)","v":""},{"$f":"Prezentace!D25","v":"P"},{"$f":"IF(Prezentace!F25=0,\"\",Prezentace!F25)","v":"Jaroslav"},{"$f":"IF(Prezentace!E25=0,\"\",Prezentace!E25)","v":"Kostříž "},null,null,null,null,null,null,null,null,null,null,null,null,null,null,null,null,0]
[{"$f":"IF(Prezentace!A26=0,\"\",Prezentace!A26)","v":""},{"$f":"IF(Prezentace!B26=0,\"\",Prezentace!B26)","v":""},{"$f":"Prezentace!D26","v":"P"},{"$f":"IF(Prezentace!F26=0,\"\",Prezentace!F26)","v":"Josef"},{"$f":"IF(Prezentace!E26=0,\"\",Prezentace!E26)","v":"Čekal "},null,null,null,null,null,null,null,null,null,null,null,null,null,null,null,null,0]
[{"$f":"IF(Prezentace!A27=0,\"\",Prezentace!A27)","v":""},{"$f":"IF(Prezentace!B27=0,\"\",Prezentace!B27)","v":""},{"$f":"Prezentace!D27","v":"P"},{"$f":"IF(Prezentace!F27=0,\"\",Prezentace!F27)","v":"Miloslav"},{"$f":"IF(Prezentace!E27=0,\"\",Prezentace!E27)","v":"Petržílka"},null,null,null,null,null,null,null,null,null,null,null,null,null,null,null,null,0]
[{"$f":"IF(Prezentace!A28=0,\"\",Prezentace!A28)","v":""},{"$f":"IF(Prezentace!B28=0,\"\",Prezentace!B28)","v":""},{"$f":"Prezentace!D28","v":"P"},{"$f":"IF(Prezentace!F28=0,\"\",Prezentace!F28)","v":"Václav"},{"$f":"IF(Prezentace!E28=0,\"\",Prezentace!E28)","v":"Landkammer"},null,null,null,null,null,null,null,null,null,null,null,null,null,null,null,null,0]
[{"$f":"IF(Prezentace!A29=0,\"\",Prezentace!A29)","v":""},{"$f":"IF(Prezentace!B29=0,\"\",Prezentace!B29)","v":""},{"$f":"Prezentace!D29","v":"P"},{"$f":"IF(Prezentace!F29=0,\"\",Prezentace!F29)","v":"Albert"},{"$f":"IF(Prezentace!E29=0,\"\",Prezentace!E29)","v":"Wrzecionko"},null,null,null,null,null,null,null,null,null,null,null,null,null,null,null,null,0]
[{"$f":"IF(Prezentace!A30=0,\"\",Prezentace!A30)","v":""},{"$f":"IF(Prezentace!B30=0,\"\",Prezentace!B30)","v":""},{"$f":"Prezentace!D30","v":"P"},{"$f":"IF(Prezentace!F30=0,\"\",Prezentace!F30)","v":"Michaela"},{"$f":"IF(Prezentace!E30=0,\"\",Prezentace!E30)","v":"Reisnerová"},null,null,null,null,null,null,null,null,null,null,null,null,null,null,null,null,0]
[{"$f":"IF(Prezentace!A31=0,\"\",Prezentace!A31)","v":""},{"$f":"IF(Prezentace!B31=0,\"\",Prezentace!B31)","v":""},{"$f":"Prezentace!D31","v":"P"},{"$f":"IF(Prezentace!F31=0,\"\",Prezentace!F31)","v":"Antonín"},{"$f":"IF(Prezentace!E31=0,\"\",Prezentace!E31)","v":"Urbanec  "},null,null,null,null,null,null,null,null,null,null,null,null,null,null,null,null,0]
[{"$f":"IF(Prezentace!#REF!=0,\"\",Prezentace!#REF!)","v":{"$error":"#REF!"}},{"$f":"IF(Prezentace!#REF!=0,\"\",Prezentace!#REF!)","v":{"$error":"#REF!"}},{"$f":"Prezentace!#REF!","v":{"$error":"#REF!"}},{"$f":"IF(Prezentace!#REF!=0,\"\",Prezentace!#REF!)","v":{"$error":"#REF!"}},{"$f":"IF(Prezentace!#REF!=0,\"\",Prezentace!#REF!)","v":{"$error":"#REF!"}},null,null,null,null,null,null,null,null,null,null,null,null,null,null,null,null,0]
[{"$f":"IF(Prezentace!#REF!=0,\"\",Prezentace!#REF!)","v":{"$error":"#REF!"}},{"$f":"IF(Prezentace!#REF!=0,\"\",Prezentace!#REF!)","v":{"$error":"#REF!"}},{"$f":"Prezentace!#REF!","v":{"$error":"#REF!"}},{"$f":"IF(Prezentace!#REF!=0,\"\",Prezentace!#REF!)","v":{"$error":"#REF!"}},{"$f":"IF(Prezentace!#REF!=0,\"\",Prezentace!#REF!)","v":{"$error":"#REF!"}},null,null,null,null,null,null,null,null,null,null,null,null,null,null,null,null,0]
[{"$f":"IF(Prezentace!#REF!=0,\"\",Prezentace!#REF!)","v":{"$error":"#REF!"}},{"$f":"IF(Prezentace!#REF!=0,\"\",Prezentace!#REF!)","v":{"$error":"#REF!"}},{"$f":"Prezentace!#REF!","v":{"$error":"#REF!"}},{"$f":"IF(Prezentace!#REF!=0,\"\",Prezentace!#REF!)","v":{"$error":"#REF!"}},{"$f":"IF(Prezentace!#REF!=0,\"\",Prezentace!#REF!)","v":{"$error":"#REF!"}},null,null,null,null,null,null,null,null,null,null,null,null,null,null,null,null,0]
[{"$f":"IF(Prezentace!#REF!=0,\"\",Prezentace!#REF!)","v":{"$error":"#REF!"}},{"$f":"IF(Prezentace!#REF!=0,\"\",Prezentace!#REF!)","v":{"$error":"#REF!"}},{"$f":"Prezentace!#REF!","v":{"$error":"#REF!"}},{"$f":"IF(Prezentace!#REF!=0,\"\",Prezentace!#REF!)","v":{"$error":"#REF!"}},{"$f":"IF(Prezentace!#REF!=0,\"\",Prezentace!#REF!)","v":{"$error":"#REF!"}},null,null,null,null,null,null,null,null,null,null,null,null,null,null,null,null,0]
[{"$f":"IF(Prezentace!#REF!=0,\"\",Prezentace!#REF!)","v":{"$error":"#REF!"}},{"$f":"IF(Prezentace!#REF!=0,\"\",Prezentace!#REF!)","v":{"$error":"#REF!"}},{"$f":"Prezentace!#REF!","v":{"$error":"#REF!"}},{"$f":"IF(Prezentace!#REF!=0,\"\",Prezentace!#REF!)","v":{"$error":"#REF!"}},{"$f":"IF(Prezentace!#REF!=0,\"\",Prezentace!#REF!)","v":{"$error":"#REF!"}},null,null,null,null,null,null,null,null,null,null,null,null,null,null,null,null,0]
[{"$f":"IF(Prezentace!#REF!=0,\"\",Prezentace!#REF!)","v":{"$error":"#REF!"}},{"$f":"IF(Prezentace!#REF!=0,\"\",Prezentace!#REF!)","v":{"$error":"#REF!"}},{"$f":"Prezentace!#REF!","v":{"$error":"#REF!"}},{"$f":"IF(Prezentace!#REF!=0,\"\",Prezentace!#REF!)","v":{"$error":"#REF!"}},{"$f":"IF(Prezentace!#REF!=0,\"\",Prezentace!#REF!)","v":{"$error":"#REF!"}},null,null,null,null,null,null,null,null,null,null,null,null,null,null,null,null,0]
[{"$f":"IF(Prezentace!#REF!=0,\"\",Prezentace!#REF!)","v":{"$error":"#REF!"}},{"$f":"IF(Prezentace!#REF!=0,\"\",Prezentace!#REF!)","v":{"$error":"#REF!"}},{"$f":"Prezentace!#REF!","v":{"$error":"#REF!"}},{"$f":"IF(Prezentace!#REF!=0,\"\",Prezentace!#REF!)","v":{"$error":"#REF!"}},{"$f":"IF(Prezentace!#REF!=0,\"\",Prezentace!#REF!)","v":{"$error":"#REF!"}},null,null,null,null,null,null,null,null,null,null,null,null,null,null,null,null,0]
[{"$f":"IF(Prezentace!#REF!=0,\"\",Prezentace!#REF!)","v":{"$error":"#REF!"}},{"$f":"IF(Prezentace!#REF!=0,\"\",Prezentace!#REF!)","v":{"$error":"#REF!"}},{"$f":"Prezentace!#REF!","v":{"$error":"#REF!"}},{"$f":"IF(Prezentace!#REF!=0,\"\",Prezentace!#REF!)","v":{"$error":"#REF!"}},{"$f":"IF(Prezentace!#REF!=0,\"\",Prezentace!#REF!)","v":{"$error":"#REF!"}},null,null,null,null,null,null,null,null,null,null,null,null,null,null,null,null,{"$f":"(SUM(F38:T38))-U38","v":0}]
[{"$f":"IF(Prezentace!#REF!=0,\"\",Prezentace!#REF!)","v":{"$error":"#REF!"}},{"$f":"IF(Prezentace!#REF!=0,\"\",Prezentace!#REF!)","v":{"$error":"#REF!"}},{"$f":"Prezentace!#REF!","v":{"$error":"#REF!"}},{"$f":"IF(Prezentace!#REF!=0,\"\",Prezentace!#REF!)","v":{"$error":"#REF!"}},{"$f":"IF(Prezentace!#REF!=0,\"\",Prezentace!#REF!)","v":{"$error":"#REF!"}},null,null,null,null,null,null,null,null,null,null,null,null,null,null,null,null,0]
[{"$f":"IF(Prezentace!#REF!=0,\"\",Prezentace!#REF!)","v":{"$error":"#REF!"}},{"$f":"IF(Prezentace!#REF!=0,\"\",Prezentace!#REF!)","v":{"$error":"#REF!"}},{"$f":"Prezentace!#REF!","v":{"$error":"#REF!"}},{"$f":"IF(Prezentace!#REF!=0,\"\",Prezentace!#REF!)","v":{"$error":"#REF!"}},{"$f":"IF(Prezentace!#REF!=0,\"\",Prezentace!#REF!)","v":{"$error":"#REF!"}},null,null,null,null,null,null,null,null,null,null,null,null,null,null,null,null,0]
[{"$f":"IF(Prezentace!#REF!=0,\"\",Prezentace!#REF!)","v":{"$error":"#REF!"}},{"$f":"IF(Prezentace!#REF!=0,\"\",Prezentace!#REF!)","v":{"$error":"#REF!"}},{"$f":"Prezentace!#REF!","v":{"$error":"#REF!"}},{"$f":"IF(Prezentace!#REF!=0,\"\",Prezentace!#REF!)","v":{"$error":"#REF!"}},{"$f":"IF(Prezentace!#REF!=0,\"\",Prezentace!#REF!)","v":{"$error":"#REF!"}},null,null,null,null,null,null,null,null,null,null,null,null,null,null,null,null,0]
[{"$f":"IF(Prezentace!#REF!=0,\"\",Prezentace!#REF!)","v":{"$error":"#REF!"}},{"$f":"IF(Prezentace!#REF!=0,\"\",Prezentace!#REF!)","v":{"$error":"#REF!"}},{"$f":"Prezentace!#REF!","v":{"$error":"#REF!"}},{"$f":"IF(Prezentace!#REF!=0,\"\",Prezentace!#REF!)","v":{"$error":"#REF!"}},{"$f":"IF(Prezentace!#REF!=0,\"\",Prezentace!#REF!)","v":{"$error":"#REF!"}},null,null,null,null,null,null,null,null,null,null,null,null,null,null,null,null,0]
[{"$f":"IF(Prezentace!#REF!=0,\"\",Prezentace!#REF!)","v":{"$error":"#REF!"}},{"$f":"IF(Prezentace!#REF!=0,\"\",Prezentace!#REF!)","v":{"$error":"#REF!"}},{"$f":"Prezentace!#REF!","v":{"$error":"#REF!"}},{"$f":"IF(Prezentace!#REF!=0,\"\",Prezentace!#REF!)","v":{"$error":"#REF!"}},{"$f":"IF(Prezentace!#REF!=0,\"\",Prezentace!#REF!)","v":{"$error":"#REF!"}},null,null,null,null,null,null,null,null,null,null,null,null,null,null,null,null,0]
[{"$f":"IF(Prezentace!#REF!=0,\"\",Prezentace!#REF!)","v":{"$error":"#REF!"}},{"$f":"IF(Prezentace!#REF!=0,\"\",Prezentace!#REF!)","v":{"$error":"#REF!"}},{"$f":"Prezentace!#REF!","v":{"$error":"#REF!"}},{"$f":"IF(Prezentace!#REF!=0,\"\",Prezentace!#REF!)","v":{"$error":"#REF!"}},{"$f":"IF(Prezentace!#REF!=0,\"\",Prezentace!#REF!)","v":{"$error":"#REF!"}},null,null,null,null,null,null,null,null,null,null,null,null,null,null,null,null,0]
[{"$f":"IF(Prezentace!#REF!=0,\"\",Prezentace!#REF!)","v":{"$error":"#REF!"}},{"$f":"IF(Prezentace!#REF!=0,\"\",Prezentace!#REF!)","v":{"$error":"#REF!"}},{"$f":"Prezentace!#REF!","v":{"$error":"#REF!"}},{"$f":"IF(Prezentace!#REF!=0,\"\",Prezentace!#REF!)","v":{"$error":"#REF!"}},{"$f":"IF(Prezentace!#REF!=0,\"\",Prezentace!#REF!)","v":{"$error":"#REF!"}},null,null,null,null,null,null,null,null,null,null,null,null,null,null,null,null,0]
[{"$f":"IF(Prezentace!#REF!=0,\"\",Prezentace!#REF!)","v":{"$error":"#REF!"}},{"$f":"IF(Prezentace!#REF!=0,\"\",Prezentace!#REF!)","v":{"$error":"#REF!"}},{"$f":"Prezentace!#REF!","v":{"$error":"#REF!"}},{"$f":"IF(Prezentace!#REF!=0,\"\",Prezentace!#REF!)","v":{"$error":"#REF!"}},{"$f":"IF(Prezentace!#REF!=0,\"\",Prezentace!#REF!)","v":{"$error":"#REF!"}},null,null,null,null,null,null,null,null,null,null,null,null,null,null,null,null,0]
[{"$f":"IF(Prezentace!#REF!=0,\"\",Prezentace!#REF!)","v":{"$error":"#REF!"}},{"$f":"IF(Prezentace!#REF!=0,\"\",Prezentace!#REF!)","v":{"$error":"#REF!"}},{"$f":"Prezentace!#REF!","v":{"$error":"#REF!"}},{"$f":"IF(Prezentace!#REF!=0,\"\",Prezentace!#REF!)","v":{"$error":"#REF!"}},{"$f":"IF(Prezentace!#REF!=0,\"\",Prezentace!#REF!)","v":{"$error":"#REF!"}},null,null,null,null,null,null,null,null,null,null,null,null,null,null,null,null,0]
[{"$f":"IF(Prezentace!#REF!=0,\"\",Prezentace!#REF!)","v":{"$error":"#REF!"}},{"$f":"IF(Prezentace!#REF!=0,\"\",Prezentace!#REF!)","v":{"$error":"#REF!"}},{"$f":"Prezentace!#REF!","v":{"$error":"#REF!"}},{"$f":"IF(Prezentace!#REF!=0,\"\",Prezentace!#REF!)","v":{"$error":"#REF!"}},{"$f":"IF(Prezentace!#REF!=0,\"\",Prezentace!#REF!)","v":{"$error":"#REF!"}},null,null,null,null,null,null,null,null,null,null,null,null,null,null,null,null,0]
[{"$f":"IF(Prezentace!#REF!=0,\"\",Prezentace!#REF!)","v":{"$error":"#REF!"}},{"$f":"IF(Prezentace!#REF!=0,\"\",Prezentace!#REF!)","v":{"$error":"#REF!"}},{"$f":"Prezentace!#REF!","v":{"$error":"#REF!"}},{"$f":"IF(Prezentace!#REF!=0,\"\",Prezentace!#REF!)","v":{"$error":"#REF!"}},{"$f":"IF(Prezentace!#REF!=0,\"\",Prezentace!#REF!)","v":{"$error":"#REF!"}},null,null,null,null,null,null,null,null,null,null,null,null,null,null,null,null,0]
[{"$f":"IF(Prezentace!#REF!=0,\"\",Prezentace!#REF!)","v":{"$error":"#REF!"}},{"$f":"IF(Prezentace!#REF!=0,\"\",Prezentace!#REF!)","v":{"$error":"#REF!"}},{"$f":"Prezentace!#REF!","v":{"$error":"#REF!"}},{"$f":"IF(Prezentace!#REF!=0,\"\",Prezentace!#REF!)","v":{"$error":"#REF!"}},{"$f":"IF(Prezentace!#REF!=0,\"\",Prezentace!#REF!)","v":{"$error":"#REF!"}},null,null,null,null,null,null,null,null,null,null,null,null,null,null,null,null,0]
[{"$f":"IF(Prezentace!#REF!=0,\"\",Prezentace!#REF!)","v":{"$error":"#REF!"}},{"$f":"IF(Prezentace!#REF!=0,\"\",Prezentace!#REF!)","v":{"$error":"#REF!"}},{"$f":"Prezentace!#REF!","v":{"$error":"#REF!"}},{"$f":"IF(Prezentace!#REF!=0,\"\",Prezentace!#REF!)","v":{"$error":"#REF!"}},{"$f":"IF(Prezentace!#REF!=0,\"\",Prezentace!#REF!)","v":{"$error":"#REF!"}},null,null,null,null,null,null,null,null,null,null,null,null,null,null,null,null,0]
[{"$f":"IF(Prezentace!#REF!=0,\"\",Prezentace!#REF!)","v":{"$error":"#REF!"}},{"$f":"IF(Prezentace!#REF!=0,\"\",Prezentace!#REF!)","v":{"$error":"#REF!"}},{"$f":"Prezentace!#REF!","v":{"$error":"#REF!"}},{"$f":"IF(Prezentace!#REF!=0,\"\",Prezentace!#REF!)","v":{"$error":"#REF!"}},{"$f":"IF(Prezentace!#REF!=0,\"\",Prezentace!#REF!)","v":{"$error":"#REF!"}},null,null,null,null,null,null,null,null,null,null,null,null,null,null,null,null,0]
[{"$f":"IF(Prezentace!#REF!=0,\"\",Prezentace!#REF!)","v":{"$error":"#REF!"}},{"$f":"IF(Prezentace!#REF!=0,\"\",Prezentace!#REF!)","v":{"$error":"#REF!"}},{"$f":"Prezentace!#REF!","v":{"$error":"#REF!"}},{"$f":"IF(Prezentace!#REF!=0,\"\",Prezentace!#REF!)","v":{"$error":"#REF!"}},{"$f":"IF(Prezentace!#REF!=0,\"\",Prezentace!#REF!)","v":{"$error":"#REF!"}},null,null,null,null,null,null,null,null,null,null,null,null,null,null,null,null,0]
[{"$f":"IF(Prezentace!#REF!=0,\"\",Prezentace!#REF!)","v":{"$error":"#REF!"}},{"$f":"IF(Prezentace!#REF!=0,\"\",Prezentace!#REF!)","v":{"$error":"#REF!"}},{"$f":"Prezentace!#REF!","v":{"$error":"#REF!"}},{"$f":"IF(Prezentace!#REF!=0,\"\",Prezentace!#REF!)","v":{"$error":"#REF!"}},{"$f":"IF(Prezentace!#REF!=0,\"\",Prezentace!#REF!)","v":{"$error":"#REF!"}},null,null,null,null,null,null,null,null,null,null,null,null,null,null,null,null,0]
[{"$f":"IF(Prezentace!#REF!=0,\"\",Prezentace!#REF!)","v":{"$error":"#REF!"}},{"$f":"IF(Prezentace!#REF!=0,\"\",Prezentace!#REF!)","v":{"$error":"#REF!"}},{"$f":"Prezentace!#REF!","v":{"$error":"#REF!"}},{"$f":"IF(Prezentace!#REF!=0,\"\",Prezentace!#REF!)","v":{"$error":"#REF!"}},{"$f":"IF(Prezentace!#REF!=0,\"\",Prezentace!#REF!)","v":{"$error":"#REF!"}},null,null,null,null,null,null,null,null,null,null,null,null,null,null,null,null,0]
[{"$f":"IF(Prezentace!#REF!=0,\"\",Prezentace!#REF!)","v":{"$error":"#REF!"}},{"$f":"IF(Prezentace!#REF!=0,\"\",Prezentace!#REF!)","v":{"$error":"#REF!"}},{"$f":"Prezentace!#REF!","v":{"$error":"#REF!"}},{"$f":"IF(Prezentace!#REF!=0,\"\",Prezentace!#REF!)","v":{"$error":"#REF!"}},{"$f":"IF(Prezentace!#REF!=0,\"\",Prezentace!#REF!)","v":{"$error":"#REF!"}},null,null,null,null,null,null,null,null,null,null,null,null,null,null,null,null,0]
[{"$f":"IF(Prezentace!#REF!=0,\"\",Prezentace!#REF!)","v":{"$error":"#REF!"}},{"$f":"IF(Prezentace!#REF!=0,\"\",Prezentace!#REF!)","v":{"$error":"#REF!"}},{"$f":"Prezentace!#REF!","v":{"$error":"#REF!"}},{"$f":"IF(Prezentace!#REF!=0,\"\",Prezentace!#REF!)","v":{"$error":"#REF!"}},{"$f":"IF(Prezentace!#REF!=0,\"\",Prezentace!#REF!)","v":{"$error":"#REF!"}},null,null,null,null,null,null,null,null,null,null,null,null,null,null,null,null,0]
[{"$f":"IF(Prezentace!#REF!=0,\"\",Prezentace!#REF!)","v":{"$error":"#REF!"}},{"$f":"IF(Prezentace!#REF!=0,\"\",Prezentace!#REF!)","v":{"$error":"#REF!"}},{"$f":"Prezentace!#REF!","v":{"$error":"#REF!"}},{"$f":"IF(Prezentace!#REF!=0,\"\",Prezentace!#REF!)","v":{"$error":"#REF!"}},{"$f":"IF(Prezentace!#REF!=0,\"\",Prezentace!#REF!)","v":{"$error":"#REF!"}},null,null,null,null,null,null,null,null,null,null,null,null,null,null,null,null,0]
[{"$f":"IF(Prezentace!A32=0,\"\",Prezentace!A32)","v":""},{"$f":"IF(Prezentace!B32=0,\"\",Prezentace!B32)","v":""},{"$f":"Prezentace!D32","v":"P"},{"$f":"IF(Prezentace!F32=0,\"\",Prezentace!F32)","v":""},{"$f":"IF(Prezentace!E32=0,\"\",Prezentace!E32)","v":""},null,null,null,null,null,null,null,null,null,null,null,null,null,null,null,null,0]
[{"$f":"IF(Prezentace!A33=0,\"\",Prezentace!A33)","v":""},{"$f":"IF(Prezentace!B33=0,\"\",Prezentace!B33)","v":""},{"$f":"Prezentace!D33","v":"P"},{"$f":"IF(Prezentace!F33=0,\"\",Prezentace!F33)","v":""},{"$f":"IF(Prezentace!E33=0,\"\",Prezentace!E33)","v":""},null,null,null,null,null,null,null,null,null,null,null,null,null,null,null,null,0]
[{"$f":"IF(Prezentace!A34=0,\"\",Prezentace!A34)","v":""},{"$f":"IF(Prezentace!B34=0,\"\",Prezentace!B34)","v":""},{"$f":"Prezentace!D34","v":"P"},{"$f":"IF(Prezentace!F34=0,\"\",Prezentace!F34)","v":""},{"$f":"IF(Prezentace!E34=0,\"\",Prezentace!E34)","v":""},null,null,null,null,null,null,null,null,null,null,null,null,null,null,null,null,0]
[{"$f":"IF(Prezentace!A35=0,\"\",Prezentace!A35)","v":""},{"$f":"IF(Prezentace!B35=0,\"\",Prezentace!B35)","v":""},{"$f":"Prezentace!D35","v":"P"},{"$f":"IF(Prezentace!F35=0,\"\",Prezentace!F35)","v":""},{"$f":"IF(Prezentace!E35=0,\"\",Prezentace!E35)","v":""},null,null,null,null,null,null,null,null,null,null,null,null,null,null,null,null,0]
[{"$f":"IF(Prezentace!A36=0,\"\",Prezentace!A36)","v":""},{"$f":"IF(Prezentace!B36=0,\"\",Prezentace!B36)","v":""},{"$f":"Prezentace!D36","v":"P"},{"$f":"IF(Prezentace!F36=0,\"\",Prezentace!F36)","v":""},{"$f":"IF(Prezentace!E36=0,\"\",Prezentace!E36)","v":""},null,null,null,null,null,null,null,null,null,null,null,null,null,null,null,null,0]
[{"$f":"IF(Prezentace!A37=0,\"\",Prezentace!A37)","v":""},{"$f":"IF(Prezentace!B37=0,\"\",Prezentace!B37)","v":""},{"$f":"Prezentace!D37","v":"P"},{"$f":"IF(Prezentace!F37=0,\"\",Prezentace!F37)","v":""},{"$f":"IF(Prezentace!E37=0,\"\",Prezentace!E37)","v":""},null,null,null,null,null,null,null,null,null,null,null,null,null,null,null,null,0]
[{"$f":"IF(Prezentace!A38=0,\"\",Prezentace!A38)","v":""},{"$f":"IF(Prezentace!B38=0,\"\",Prezentace!B38)","v":""},{"$f":"Prezentace!D38","v":"P"},{"$f":"IF(Prezentace!F38=0,\"\",Prezentace!F38)","v":""},{"$f":"IF(Prezentace!E38=0,\"\",Prezentace!E38)","v":""},null,null,null,null,null,null,null,null,null,null,null,null,null,null,null,null,0]
[{"$f":"IF(Prezentace!A39=0,\"\",Prezentace!A39)","v":""},{"$f":"IF(Prezentace!B39=0,\"\",Prezentace!B39)","v":""},{"$f":"Prezentace!D39","v":"P"},{"$f":"IF(Prezentace!F39=0,\"\",Prezentace!F39)","v":""},{"$f":"IF(Prezentace!E39=0,\"\",Prezentace!E39)","v":""},null,null,null,null,null,null,null,null,null,null,null,null,null,null,null,null,0]
[{"$f":"IF(Prezentace!A40=0,\"\",Prezentace!A40)","v":""},{"$f":"IF(Prezentace!B40=0,\"\",Prezentace!B40)","v":""},{"$f":"Prezentace!D40","v":"P"},{"$f":"IF(Prezentace!F40=0,\"\",Prezentace!F40)","v":""},{"$f":"IF(Prezentace!E40=0,\"\",Prezentace!E40)","v":""},null,null,null,null,null,null,null,null,null,null,null,null,null,null,null,null,0]
[{"$f":"IF(Prezentace!A41=0,\"\",Prezentace!A41)","v":""},{"$f":"IF(Prezentace!B41=0,\"\",Prezentace!B41)","v":""},{"$f":"Prezentace!D41","v":"P"},{"$f":"IF(Prezentace!F41=0,\"\",Prezentace!F41)","v":""},{"$f":"IF(Prezentace!E41=0,\"\",Prezentace!E41)","v":""},null,null,null,null,null,null,null,null,null,null,null,null,null,null,null,null,0]
[{"$f":"IF(Prezentace!A42=0,\"\",Prezentace!A42)","v":""},{"$f":"IF(Prezentace!B42=0,\"\",Prezentace!B42)","v":""},{"$f":"Prezentace!D42","v":"P"},{"$f":"IF(Prezentace!F42=0,\"\",Prezentace!F42)","v":""},{"$f":"IF(Prezentace!E42=0,\"\",Prezentace!E42)","v":""},null,null,null,null,null,null,null,null,null,null,null,null,null,null,null,null,0]
[{"$f":"IF(Prezentace!A43=0,\"\",Prezentace!A43)","v":""},{"$f":"IF(Prezentace!B43=0,\"\",Prezentace!B43)","v":""},{"$f":"Prezentace!D43","v":"P"},{"$f":"IF(Prezentace!F43=0,\"\",Prezentace!F43)","v":""},{"$f":"IF(Prezentace!E43=0,\"\",Prezentace!E43)","v":""},null,null,null,null,null,null,null,null,null,null,null,null,null,null,null,null,0]
[{"$f":"IF(Prezentace!A44=0,\"\",Prezentace!A44)","v":""},{"$f":"IF(Prezentace!B44=0,\"\",Prezentace!B44)","v":""},{"$f":"Prezentace!D44","v":"P"},{"$f":"IF(Prezentace!F44=0,\"\",Prezentace!F44)","v":""},{"$f":"IF(Prezentace!E44=0,\"\",Prezentace!E44)","v":""},null,null,null,null,null,null,null,null,null,null,null,null,null,null,null,null,0]
[{"$f":"IF(Prezentace!A45=0,\"\",Prezentace!A45)","v":""},{"$f":"IF(Prezentace!B45=0,\"\",Prezentace!B45)","v":""},{"$f":"Prezentace!D45","v":"P"},{"$f":"IF(Prezentace!F45=0,\"\",Prezentace!F45)","v":""},{"$f":"IF(Prezentace!E45=0,\"\",Prezentace!E45)","v":""},null,null,null,null,null,null,null,null,null,null,null,null,null,null,null,null,0]
[{"$f":"IF(Prezentace!A46=0,\"\",Prezentace!A46)","v":""},{"$f":"IF(Prezentace!B46=0,\"\",Prezentace!B46)","v":""},{"$f":"Prezentace!D46","v":"P"},{"$f":"IF(Prezentace!F46=0,\"\",Prezentace!F46)","v":""},{"$f":"IF(Prezentace!E46=0,\"\",Prezentace!E46)","v":""},null,null,null,null,null,null,null,null,null,null,null,null,null,null,null,null,0]
[{"$f":"IF(Prezentace!A47=0,\"\",Prezentace!A47)","v":""},{"$f":"IF(Prezentace!B47=0,\"\",Prezentace!B47)","v":""},{"$f":"Prezentace!D47","v":"P"},{"$f":"IF(Prezentace!F47=0,\"\",Prezentace!F47)","v":""},{"$f":"IF(Prezentace!E47=0,\"\",Prezentace!E47)","v":""},null,null,null,null,null,null,null,null,null,null,null,null,null,null,null,null,0]
[{"$f":"IF(Prezentace!A48=0,\"\",Prezentace!A48)","v":""},{"$f":"IF(Prezentace!B48=0,\"\",Prezentace!B48)","v":""},{"$f":"Prezentace!D48","v":"P"},{"$f":"IF(Prezentace!F48=0,\"\",Prezentace!F48)","v":""},{"$f":"IF(Prezentace!E48=0,\"\",Prezentace!E48)","v":""},null,null,null,null,null,null,null,null,null,null,null,null,null,null,null,null,0]
[{"$f":"IF(Prezentace!A49=0,\"\",Prezentace!A49)","v":""},{"$f":"IF(Prezentace!B49=0,\"\",Prezentace!B49)","v":""},{"$f":"Prezentace!D49","v":"P"},{"$f":"IF(Prezentace!F49=0,\"\",Prezentace!F49)","v":""},{"$f":"IF(Prezentace!E49=0,\"\",Prezentace!E49)","v":""},null,null,null,null,null,null,null,null,null,null,null,null,null,null,null,null,0]
[{"$f":"IF(Prezentace!A50=0,\"\",Prezentace!A50)","v":""},{"$f":"IF(Prezentace!B50=0,\"\",Prezentace!B50)","v":""},{"$f":"Prezentace!D50","v":"P"},{"$f":"IF(Prezentace!F50=0,\"\",Prezentace!F50)","v":""},{"$f":"IF(Prezentace!E50=0,\"\",Prezentace!E50)","v":""},null,null,null,null,null,null,null,null,null,null,null,null,null,null,null,null,0]
[{"$f":"IF(Prezentace!A51=0,\"\",Prezentace!A51)","v":""},{"$f":"IF(Prezentace!B51=0,\"\",Prezentace!B51)","v":""},{"$f":"Prezentace!D51","v":"P"},{"$f":"IF(Prezentace!F51=0,\"\",Prezentace!F51)","v":""},{"$f":"IF(Prezentace!E51=0,\"\",Prezentace!E51)","v":""},null,null,null,null,null,null,null,null,null,null,null,null,null,null,null,null,0]
[{"$f":"IF(Prezentace!A52=0,\"\",Prezentace!A52)","v":""},{"$f":"IF(Prezentace!B52=0,\"\",Prezentace!B52)","v":""},{"$f":"Prezentace!D52","v":"P"},{"$f":"IF(Prezentace!F52=0,\"\",Prezentace!F52)","v":""},{"$f":"IF(Prezentace!E52=0,\"\",Prezentace!E52)","v":""},null,null,null,null,null,null,null,null,null,null,null,null,null,null,null,null,0]
[{"$f":"IF(Prezentace!A53=0,\"\",Prezentace!A53)","v":""},{"$f":"IF(Prezentace!B53=0,\"\",Prezentace!B53)","v":""},{"$f":"Prezentace!D53","v":"P"},{"$f":"IF(Prezentace!F53=0,\"\",Prezentace!F53)","v":""},{"$f":"IF(Prezentace!E53=0,\"\",Prezentace!E53)","v":""},null,null,null,null,null,null,null,null,null,null,null,null,null,null,null,null,0]
[{"$f":"IF(Prezentace!A54=0,\"\",Prezentace!A54)","v":""},{"$f":"IF(Prezentace!B54=0,\"\",Prezentace!B54)","v":""},{"$f":"Prezentace!D54","v":"P"},{"$f":"IF(Prezentace!F54=0,\"\",Prezentace!F54)","v":""},{"$f":"IF(Prezentace!E54=0,\"\",Prezentace!E54)","v":""},null,null,null,null,null,null,null,null,null,null,null,null,null,null,null,null,0]
[{"$f":"IF(Prezentace!A55=0,\"\",Prezentace!A55)","v":""},{"$f":"IF(Prezentace!B55=0,\"\",Prezentace!B55)","v":""},{"$f":"Prezentace!D55","v":"P"},{"$f":"IF(Prezentace!F55=0,\"\",Prezentace!F55)","v":""},{"$f":"IF(Prezentace!E55=0,\"\",Prezentace!E55)","v":""},null,null,null,null,null,null,null,null,null,null,null,null,null,null,null,null,0]
[{"$f":"IF(Prezentace!A56=0,\"\",Prezentace!A56)","v":""},{"$f":"IF(Prezentace!B56=0,\"\",Prezentace!B56)","v":""},{"$f":"Prezentace!D56","v":"P"},{"$f":"IF(Prezentace!F56=0,\"\",Prezentace!F56)","v":""},{"$f":"IF(Prezentace!E56=0,\"\",Prezentace!E56)","v":""},null,null,null,null,null,null,null,null,null,null,null,null,null,null,null,null,0]
[{"$f":"IF(Prezentace!A57=0,\"\",Prezentace!A57)","v":""},{"$f":"IF(Prezentace!B57=0,\"\",Prezentace!B57)","v":""},{"$f":"Prezentace!D57","v":"P"},{"$f":"IF(Prezentace!F57=0,\"\",Prezentace!F57)","v":""},{"$f":"IF(Prezentace!E57=0,\"\",Prezentace!E57)","v":""},null,null,null,null,null,null,null,null,null,null,null,null,null,null,null,null,0]
[{"$f":"IF(Prezentace!A58=0,\"\",Prezentace!A58)","v":""},{"$f":"IF(Prezentace!B58=0,\"\",Prezentace!B58)","v":""},{"$f":"Prezentace!D58","v":"P"},{"$f":"IF(Prezentace!F58=0,\"\",Prezentace!F58)","v":""},{"$f":"IF(Prezentace!E58=0,\"\",Prezentace!E58)","v":""},null,null,null,null,null,null,null,null,null,null,null,null,null,null,null,null,0]
[{"$f":"IF(Prezentace!A59=0,\"\",Prezentace!A59)","v":""},{"$f":"IF(Prezentace!B59=0,\"\",Prezentace!B59)","v":""},{"$f":"Prezentace!D59","v":"P"},{"$f":"IF(Prezentace!F59=0,\"\",Prezentace!F59)","v":""},{"$f":"IF(Prezentace!E59=0,\"\",Prezentace!E59)","v":""},null,null,null,null,null,null,null,null,null,null,null,null,null,null,null,null,0]
[{"$f":"IF(Prezentace!A60=0,\"\",Prezentace!A60)","v":""},{"$f":"IF(Prezentace!B60=0,\"\",Prezentace!B60)","v":""},{"$f":"Prezentace!D60","v":"P"},{"$f":"IF(Prezentace!F60=0,\"\",Prezentace!F60)","v":""},{"$f":"IF(Prezentace!E60=0,\"\",Prezentace!E60)","v":""},null,null,null,null,null,null,null,null,null,null,null,null,null,null,null,null,0]
[{"$f":"IF(Prezentace!A61=0,\"\",Prezentace!A61)","v":""},{"$f":"IF(Prezentace!B61=0,\"\",Prezentace!B61)","v":""},{"$f":"Prezentace!D61","v":"P"},{"$f":"IF(Prezentace!F61=0,\"\",Prezentace!F61)","v":""},{"$f":"IF(Prezentace!E61=0,\"\",Prezentace!E61)","v":""},null,null,null,null,null,null,null,null,null,null,null,null,null,null,null,null,0]
[{"$f":"IF(Prezentace!A62=0,\"\",Prezentace!A62)","v":""},{"$f":"IF(Prezentace!B62=0,\"\",Prezentace!B62)","v":""},{"$f":"Prezentace!D62","v":"P"},{"$f":"IF(Prezentace!F62=0,\"\",Prezentace!F62)","v":""},{"$f":"IF(Prezentace!E62=0,\"\",Prezentace!E62)","v":""},null,null,null,null,null,null,null,null,null,null,null,null,null,null,null,null,0]
[{"$f":"IF(Prezentace!A63=0,\"\",Prezentace!A63)","v":""},{"$f":"IF(Prezentace!B63=0,\"\",Prezentace!B63)","v":""},{"$f":"Prezentace!D63","v":"P"},{"$f":"IF(Prezentace!F63=0,\"\",Prezentace!F63)","v":""},{"$f":"IF(Prezentace!E63=0,\"\",Prezentace!E63)","v":""},null,null,null,null,null,null,null,null,null,null,null,null,null,null,null,null,0]
[{"$f":"IF(Prezentace!A64=0,\"\",Prezentace!A64)","v":""},{"$f":"IF(Prezentace!B64=0,\"\",Prezentace!B64)","v":""},{"$f":"Prezentace!D64","v":"P"},{"$f":"IF(Prezentace!F64=0,\"\",Prezentace!F64)","v":""},{"$f":"IF(Prezentace!E64=0,\"\",Prezentace!E64)","v":""},null,null,null,null,null,null,null,null,null,null,null,null,null,null,null,null,0]
[{"$f":"IF(Prezentace!A65=0,\"\",Prezentace!A65)","v":""},{"$f":"IF(Prezentace!B65=0,\"\",Prezentace!B65)","v":""},{"$f":"Prezentace!D65","v":"P"},{"$f":"IF(Prezentace!F65=0,\"\",Prezentace!F65)","v":""},{"$f":"IF(Prezentace!E65=0,\"\",Prezentace!E65)","v":""},null,null,null,null,null,null,null,null,null,null,null,null,null,null,null,null,0]
[{"$f":"IF(Prezentace!A66=0,\"\",Prezentace!A66)","v":""},{"$f":"IF(Prezentace!B66=0,\"\",Prezentace!B66)","v":""},{"$f":"Prezentace!D66","v":"P"},{"$f":"IF(Prezentace!F66=0,\"\",Prezentace!F66)","v":""},{"$f":"IF(Prezentace!E66=0,\"\",Prezentace!E66)","v":""},null,null,null,null,null,null,null,null,null,null,null,null,null,null,null,null,0]
[{"$f":"IF(Prezentace!A67=0,\"\",Prezentace!A67)","v":""},{"$f":"IF(Prezentace!B67=0,\"\",Prezentace!B67)","v":""},{"$f":"Prezentace!D67","v":"P"},{"$f":"IF(Prezentace!F67=0,\"\",Prezentace!F67)","v":""},{"$f":"IF(Prezentace!E67=0,\"\",Prezentace!E67)","v":""},null,null,null,null,null,null,null,null,null,null,null,null,null,null,null,null,0]
[{"$f":"IF(Prezentace!A68=0,\"\",Prezentace!A68)","v":""},{"$f":"IF(Prezentace!B68=0,\"\",Prezentace!B68)","v":""},{"$f":"Prezentace!D68","v":"P"},{"$f":"IF(Prezentace!F68=0,\"\",Prezentace!F68)","v":""},{"$f":"IF(Prezentace!E68=0,\"\",Prezentace!E68)","v":""},null,null,null,null,null,null,null,null,null,null,null,null,null,null,null,null,0]
[{"$f":"IF(Prezentace!A69=0,\"\",Prezentace!A69)","v":""},{"$f":"IF(Prezentace!B69=0,\"\",Prezentace!B69)","v":""},{"$f":"Prezentace!D69","v":"P"},{"$f":"IF(Prezentace!F69=0,\"\",Prezentace!F69)","v":""},{"$f":"IF(Prezentace!E69=0,\"\",Prezentace!E69)","v":""},null,null,null,null,null,null,null,null,null,null,null,null,null,null,null,null,0]
[{"$f":"IF(Prezentace!A70=0,\"\",Prezentace!A70)","v":""},{"$f":"IF(Prezentace!B70=0,\"\",Prezentace!B70)","v":""},{"$f":"Prezentace!D70","v":"P"},{"$f":"IF(Prezentace!F70=0,\"\",Prezentace!F70)","v":""},{"$f":"IF(Prezentace!E70=0,\"\",Prezentace!E70)","v":""},null,null,null,null,null,null,null,null,null,null,null,null,null,null,null,null,0]
[{"$f":"IF(Prezentace!A71=0,\"\",Prezentace!A71)","v":""},{"$f":"IF(Prezentace!B71=0,\"\",Prezentace!B71)","v":""},{"$f":"Prezentace!D71","v":"P"},{"$f":"IF(Prezentace!F71=0,\"\",Prezentace!F71)","v":""},{"$f":"IF(Prezentace!E71=0,\"\",Prezentace!E71)","v":""},null,null,null,null,null,null,null,null,null,null,null,null,null,null,null,null,0]
[{"$f":"IF(Prezentace!A72=0,\"\",Prezentace!A72)","v":""},{"$f":"IF(Prezentace!B72=0,\"\",Prezentace!B72)","v":""},{"$f":"Prezentace!D72","v":"P"},{"$f":"IF(Prezentace!F72=0,\"\",Prezentace!F72)","v":""},{"$f":"IF(Prezentace!E72=0,\"\",Prezentace!E72)","v":""},null,null,null,null,null,null,null,null,null,null,null,null,null,null,null,null,0]
[{"$f":"IF(Prezentace!A73=0,\"\",Prezentace!A73)","v":""},{"$f":"IF(Prezentace!B73=0,\"\",Prezentace!B73)","v":""},{"$f":"Prezentace!D73","v":"P"},{"$f":"IF(Prezentace!F73=0,\"\",Prezentace!F73)","v":""},{"$f":"IF(Prezentace!E73=0,\"\",Prezentace!E73)","v":""},null,null,null,null,null,null,null,null,null,null,null,null,null,null,null,null,0]
[{"$f":"IF(Prezentace!A74=0,\"\",Prezentace!A74)","v":""},{"$f":"IF(Prezentace!B74=0,\"\",Prezentace!B74)","v":""},{"$f":"Prezentace!D74","v":"P"},{"$f":"IF(Prezentace!F74=0,\"\",Prezentace!F74)","v":""},{"$f":"IF(Prezentace!E74=0,\"\",Prezentace!E74)","v":""},null,null,null,null,null,null,null,null,null,null,null,null,null,null,null,null,0]
[{"$f":"IF(Prezentace!A75=0,\"\",Prezentace!A75)","v":""},{"$f":"IF(Prezentace!B75=0,\"\",Prezentace!B75)","v":""},{"$f":"Prezentace!D75","v":"P"},{"$f":"IF(Prezentace!F75=0,\"\",Prezentace!F75)","v":""},{"$f":"IF(Prezentace!E75=0,\"\",Prezentace!E75)","v":""},null,null,null,null,null,null,null,null,null,null,null,null,null,null,null,null,{"$f":"(SUM(F102:T102))-U102","v":0}]

{"sheet":"6(M)","index":13,"n_rows":102,"n_cols":20,"rows_kept":102,"cut":false,"hidden":true,"merged":[[0,3,0,18],[0,0,2,0],[0,1,2,1]]}
["Druž.","Kap.",null,"Disciplina 6"]
[]
[null,null,null,null,null,0,1,2,3,4,5,6,7,8,9,10,12,15,"Čas","Součet"]
[{"$f":"IF(Prezentace!A6=0,\"\",Prezentace!A6)","v":""},{"$f":"IF(Prezentace!B6=0,\"\",Prezentace!B6)","v":""},{"$f":"Prezentace!D6","v":"P"},{"$f":"IF(Prezentace!F6=0,\"\",Prezentace!F6)","v":"Milan"},{"$f":"IF(Prezentace!E6=0,\"\",Prezentace!E6)","v":"Matějka st."},null,null,null,null,null,null,null,null,null,null,null,null,null,null,{"$f":"(SUM(F4*$F$3,G4*$G$3,H4*$H$3,I4*$I$3,J4*$J$3,K4*$K$3,L4*$L$3,M4*$M$3,N4*$N$3,O4*$O$3,P4*$P$3,Q4*$Q$3,R4*$R$3))-S4","v":0}]
[{"$f":"IF(Prezentace!A7=0,\"\",Prezentace!A7)","v":""},{"$f":"IF(Prezentace!B7=0,\"\",Prezentace!B7)","v":""},{"$f":"Prezentace!D7","v":"P"},{"$f":"IF(Prezentace!F7=0,\"\",Prezentace!F7)","v":"Miroslav"},{"$f":"IF(Prezentace!E7=0,\"\",Prezentace!E7)","v":"Fiala  "},null,null,null,null,null,null,null,null,null,null,null,null,null,null,{"$f":"(SUM(F5*$F$3,G5*$G$3,H5*$H$3,I5*$I$3,J5*$J$3,K5*$K$3,L5*$L$3,M5*$M$3,N5*$N$3,O5*$O$3,P5*$P$3,Q5*$Q$3,R5*$R$3))-S5","v":0}]
[{"$f":"IF(Prezentace!A8=0,\"\",Prezentace!A8)","v":""},{"$f":"IF(Prezentace!B8=0,\"\",Prezentace!B8)","v":""},{"$f":"Prezentace!D8","v":"P"},{"$f":"IF(Prezentace!F8=0,\"\",Prezentace!F8)","v":"František"},{"$f":"IF(Prezentace!E8=0,\"\",Prezentace!E8)","v":"Toman "},null,null,null,null,null,null,null,null,null,null,null,null,null,null,0]
[{"$f":"IF(Prezentace!A9=0,\"\",Prezentace!A9)","v":""},{"$f":"IF(Prezentace!B9=0,\"\",Prezentace!B9)","v":""},{"$f":"Prezentace!D9","v":"P"},{"$f":"IF(Prezentace!F9=0,\"\",Prezentace!F9)","v":"Jiří"},{"$f":"IF(Prezentace!E9=0,\"\",Prezentace!E9)","v":"Švihálek "},null,null,null,null,null,null,null,null,null,null,null,null,null,null,0]
[{"$f":"IF(Prezentace!A10=0,\"\",Prezentace!A10)","v":""},{"$f":"IF(Prezentace!B10=0,\"\",Prezentace!B10)","v":""},{"$f":"Prezentace!D10","v":"R"},{"$f":"IF(Prezentace!F10=0,\"\",Prezentace!F10)","v":"Jiří"},{"$f":"IF(Prezentace!E10=0,\"\",Prezentace!E10)","v":"Švihálek "},null,null,null,null,null,null,null,null,null,null,null,null,null,null,0]
[{"$f":"IF(Prezentace!A11=0,\"\",Prezentace!A11)","v":""},{"$f":"IF(Prezentace!B11=0,\"\",Prezentace!B11)","v":""},{"$f":"Prezentace!D11","v":"P"},{"$f":"IF(Prezentace!F11=0,\"\",Prezentace!F11)","v":"Vladimír"},{"$f":"IF(Prezentace!E11=0,\"\",Prezentace!E11)","v":"VejslíK "},null,null,null,null,null,null,null,null,null,null,null,null,null,null,0]
[{"$f":"IF(Prezentace!A12=0,\"\",Prezentace!A12)","v":""},{"$f":"IF(Prezentace!B12=0,\"\",Prezentace!B12)","v":""},{"$f":"Prezentace!D12","v":"P"},{"$f":"IF(Prezentace!F12=0,\"\",Prezentace!F12)","v":"Milan"},{"$f":"IF(Prezentace!E12=0,\"\",Prezentace!E12)","v":"Kraus "},null,null,null,null,null,null,null,null,null,null,null,null,null,null,0]
[{"$f":"IF(Prezentace!#REF!=0,\"\",Prezentace!#REF!)","v":{"$error":"#REF!"}},{"$f":"IF(Prezentace!#REF!=0,\"\",Prezentace!#REF!)","v":{"$error":"#REF!"}},{"$f":"Prezentace!#REF!","v":{"$error":"#REF!"}},{"$f":"IF(Prezentace!#REF!=0,\"\",Prezentace!#REF!)","v":{"$error":"#REF!"}},{"$f":"IF(Prezentace!#REF!=0,\"\",Prezentace!#REF!)","v":{"$error":"#REF!"}},null,null,null,null,null,null,null,null,null,null,null,null,null,null,0]
[{"$f":"IF(Prezentace!A13=0,\"\",Prezentace!A13)","v":""},{"$f":"IF(Prezentace!B13=0,\"\",Prezentace!B13)","v":""},{"$f":"Prezentace!D13","v":"P"},{"$f":"IF(Prezentace!F13=0,\"\",Prezentace!F13)","v":"Vojtěch"},{"$f":"IF(Prezentace!E13=0,\"\",Prezentace!E13)","v":"Brejžek "},null,null,null,null,null,null,null,null,null,null,null,null,null,null,0]
[{"$f":"IF(Prezentace!A14=0,\"\",Prezentace!A14)","v":""},{"$f":"IF(Prezentace!B14=0,\"\",Prezentace!B14)","v":""},{"$f":"Prezentace!D14","v":"P"},{"$f":"IF(Prezentace!F14=0,\"\",Prezentace!F14)","v":"Karel"},{"$f":"IF(Prezentace!E14=0,\"\",Prezentace!E14)","v":"Získal "},null,null,null,null,null,null,null,null,null,null,null,null,null,null,0]
[{"$f":"IF(Prezentace!A15=0,\"\",Prezentace!A15)","v":""},{"$f":"IF(Prezentace!B15=0,\"\",Prezentace!B15)","v":""},{"$f":"Prezentace!D15","v":"R"},{"$f":"IF(Prezentace!F15=0,\"\",Prezentace!F15)","v":"Karel"},{"$f":"IF(Prezentace!E15=0,\"\",Prezentace!E15)","v":"Získal "},null,null,null,null,null,null,null,null,null,null,null,null,null,null,0]
[{"$f":"IF(Prezentace!A16=0,\"\",Prezentace!A16)","v":""},{"$f":"IF(Prezentace!B16=0,\"\",Prezentace!B16)","v":""},{"$f":"Prezentace!D16","v":"P"},{"$f":"IF(Prezentace!F16=0,\"\",Prezentace!F16)","v":"Marie"},{"$f":"IF(Prezentace!E16=0,\"\",Prezentace!E16)","v":"Žemličková"},null,null,null,null,null,null,null,null,null,null,null,null,null,null,0]
[{"$f":"IF(Prezentace!A17=0,\"\",Prezentace!A17)","v":""},{"$f":"IF(Prezentace!B17=0,\"\",Prezentace!B17)","v":""},{"$f":"Prezentace!D17","v":"P"},{"$f":"IF(Prezentace!F17=0,\"\",Prezentace!F17)","v":"Ladislav"},{"$f":"IF(Prezentace!E17=0,\"\",Prezentace!E17)","v":"Žemlička "},null,null,null,null,null,null,null,null,null,null,null,null,null,null,0]
[{"$f":"IF(Prezentace!A18=0,\"\",Prezentace!A18)","v":""},{"$f":"IF(Prezentace!B18=0,\"\",Prezentace!B18)","v":""},{"$f":"Prezentace!D18","v":"P"},{"$f":"IF(Prezentace!F18=0,\"\",Prezentace!F18)","v":"Jiří"},{"$f":"IF(Prezentace!E18=0,\"\",Prezentace!E18)","v":"Janovský "},null,null,null,null,null,null,null,null,null,null,null,null,null,null,0]
[{"$f":"IF(Prezentace!A19=0,\"\",Prezentace!A19)","v":""},{"$f":"IF(Prezentace!B19=0,\"\",Prezentace!B19)","v":""},{"$f":"Prezentace!D19","v":"P"},{"$f":"IF(Prezentace!F19=0,\"\",Prezentace!F19)","v":"Mojmír"},{"$f":"IF(Prezentace!E19=0,\"\",Prezentace!E19)","v":"Janovský "},null,null,null,null,null,null,null,null,null,null,null,null,null,null,0]
[{"$f":"IF(Prezentace!A20=0,\"\",Prezentace!A20)","v":""},{"$f":"IF(Prezentace!B20=0,\"\",Prezentace!B20)","v":""},{"$f":"Prezentace!D20","v":"P"},{"$f":"IF(Prezentace!F20=0,\"\",Prezentace!F20)","v":"Bohumil"},{"$f":"IF(Prezentace!E20=0,\"\",Prezentace!E20)","v":"Herceg"},null,null,null,null,null,null,null,null,null,null,null,null,null,null,0]
[{"$f":"IF(Prezentace!A21=0,\"\",Prezentace!A21)","v":""},{"$f":"IF(Prezentace!B21=0,\"\",Prezentace!B21)","v":""},{"$f":"Prezentace!D21","v":"P"},{"$f":"IF(Prezentace!F21=0,\"\",Prezentace!F21)","v":"Michal"},{"$f":"IF(Prezentace!E21=0,\"\",Prezentace!E21)","v":"Svoboda"},null,null,null,null,null,null,null,null,null,null,null,null,null,null,0]
[{"$f":"IF(Prezentace!A22=0,\"\",Prezentace!A22)","v":""},{"$f":"IF(Prezentace!B22=0,\"\",Prezentace!B22)","v":""},{"$f":"Prezentace!D22","v":"P"},{"$f":"IF(Prezentace!F22=0,\"\",Prezentace!F22)","v":"Viktor"},{"$f":"IF(Prezentace!E22=0,\"\",Prezentace!E22)","v":"Fuksa  "},null,null,null,null,null,null,null,null,null,null,null,null,null,null,0]
[{"$f":"IF(Prezentace!A23=0,\"\",Prezentace!A23)","v":""},{"$f":"IF(Prezentace!B23=0,\"\",Prezentace!B23)","v":""},{"$f":"Prezentace!D23","v":"P"},{"$f":"IF(Prezentace!F23=0,\"\",Prezentace!F23)","v":"Miroslav"},{"$f":"IF(Prezentace!E23=0,\"\",Prezentace!E23)","v":"Koch   ml."},null,null,null,null,null,null,null,null,null,null,null,null,null,null,0]
[{"$f":"IF(Prezentace!A24=0,\"\",Prezentace!A24)","v":""},{"$f":"IF(Prezentace!B24=0,\"\",Prezentace!B24)","v":""},{"$f":"Prezentace!D24","v":"P"},{"$f":"IF(Prezentace!F24=0,\"\",Prezentace!F24)","v":"Miroslav"},{"$f":"IF(Prezentace!E24=0,\"\",Prezentace!E24)","v":"Koch  st. "},null,null,null,null,null,null,null,null,null,null,null,null,null,null,0]
[{"$f":"IF(Prezentace!A25=0,\"\",Prezentace!A25)","v":""},{"$f":"IF(Prezentace!B25=0,\"\",Prezentace!B25)","v":""},{"$f":"Prezentace!D25","v":"P"},{"$f":"IF(Prezentace!F25=0,\"\",Prezentace!F25)","v":"Jaroslav"},{"$f":"IF(Prezentace!E25=0,\"\",Prezentace!E25)","v":"Kostříž "},null,null,null,null,null,null,null,null,null,null,null,null,null,null,0]
[{"$f":"IF(Prezentace!A26=0,\"\",Prezentace!A26)","v":""},{"$f":"IF(Prezentace!B26=0,\"\",Prezentace!B26)","v":""},{"$f":"Prezentace!D26","v":"P"},{"$f":"IF(Prezentace!F26=0,\"\",Prezentace!F26)","v":"Josef"},{"$f":"IF(Prezentace!E26=0,\"\",Prezentace!E26)","v":"Čekal "},null,null,null,null,null,null,null,null,null,null,null,null,null,null,0]
[{"$f":"IF(Prezentace!A27=0,\"\",Prezentace!A27)","v":""},{"$f":"IF(Prezentace!B27=0,\"\",Prezentace!B27)","v":""},{"$f":"Prezentace!D27","v":"P"},{"$f":"IF(Prezentace!F27=0,\"\",Prezentace!F27)","v":"Miloslav"},{"$f":"IF(Prezentace!E27=0,\"\",Prezentace!E27)","v":"Petržílka"},null,null,null,null,null,null,null,null,null,null,null,null,null,null,0]
[{"$f":"IF(Prezentace!A28=0,\"\",Prezentace!A28)","v":""},{"$f":"IF(Prezentace!B28=0,\"\",Prezentace!B28)","v":""},{"$f":"Prezentace!D28","v":"P"},{"$f":"IF(Prezentace!F28=0,\"\",Prezentace!F28)","v":"Václav"},{"$f":"IF(Prezentace!E28=0,\"\",Prezentace!E28)","v":"Landkammer"},null,null,null,null,null,null,null,null,null,null,null,null,null,null,0]
[{"$f":"IF(Prezentace!A29=0,\"\",Prezentace!A29)","v":""},{"$f":"IF(Prezentace!B29=0,\"\",Prezentace!B29)","v":""},{"$f":"Prezentace!D29","v":"P"},{"$f":"IF(Prezentace!F29=0,\"\",Prezentace!F29)","v":"Albert"},{"$f":"IF(Prezentace!E29=0,\"\",Prezentace!E29)","v":"Wrzecionko"},null,null,null,null,null,null,null,null,null,null,null,null,null,null,0]
[{"$f":"IF(Prezentace!A30=0,\"\",Prezentace!A30)","v":""},{"$f":"IF(Prezentace!B30=0,\"\",Prezentace!B30)","v":""},{"$f":"Prezentace!D30","v":"P"},{"$f":"IF(Prezentace!F30=0,\"\",Prezentace!F30)","v":"Michaela"},{"$f":"IF(Prezentace!E30=0,\"\",Prezentace!E30)","v":"Reisnerová"},null,null,null,null,null,null,null,null,null,null,null,null,null,null,0]
[{"$f":"IF(Prezentace!A31=0,\"\",Prezentace!A31)","v":""},{"$f":"IF(Prezentace!B31=0,\"\",Prezentace!B31)","v":""},{"$f":"Prezentace!D31","v":"P"},{"$f":"IF(Prezentace!F31=0,\"\",Prezentace!F31)","v":"Antonín"},{"$f":"IF(Prezentace!E31=0,\"\",Prezentace!E31)","v":"Urbanec  "},null,null,null,null,null,null,null,null,null,null,null,null,null,null,0]
[{"$f":"IF(Prezentace!#REF!=0,\"\",Prezentace!#REF!)","v":{"$error":"#REF!"}},{"$f":"IF(Prezentace!#REF!=0,\"\",Prezentace!#REF!)","v":{"$error":"#REF!"}},{"$f":"Prezentace!#REF!","v":{"$error":"#REF!"}},{"$f":"IF(Prezentace!#REF!=0,\"\",Prezentace!#REF!)","v":{"$error":"#REF!"}},{"$f":"IF(Prezentace!#REF!=0,\"\",Prezentace!#REF!)","v":{"$error":"#REF!"}},null,null,null,null,null,null,null,null,null,null,null,null,null,null,0]
[{"$f":"IF(Prezentace!#REF!=0,\"\",Prezentace!#REF!)","v":{"$error":"#REF!"}},{"$f":"IF(Prezentace!#REF!=0,\"\",Prezentace!#REF!)","v":{"$error":"#REF!"}},{"$f":"Prezentace!#REF!","v":{"$error":"#REF!"}},{"$f":"IF(Prezentace!#REF!=0,\"\",Prezentace!#REF!)","v":{"$error":"#REF!"}},{"$f":"IF(Prezentace!#REF!=0,\"\",Prezentace!#REF!)","v":{"$error":"#REF!"}},null,null,null,null,null,null,null,null,null,null,null,null,null,null,0]
[{"$f":"IF(Prezentace!#REF!=0,\"\",Prezentace!#REF!)","v":{"$error":"#REF!"}},{"$f":"IF(Prezentace!#REF!=0,\"\",Prezentace!#REF!)","v":{"$error":"#REF!"}},{"$f":"Prezentace!#REF!","v":{"$error":"#REF!"}},{"$f":"IF(Prezentace!#REF!=0,\"\",Prezentace!#REF!)","v":{"$error":"#REF!"}},{"$f":"IF(Prezentace!#REF!=0,\"\",Prezentace!#REF!)","v":{"$error":"#REF!"}},null,null,null,null,null,null,null,null,null,null,null,null,null,null,0]
[{"$f":"IF(Prezentace!#REF!=0,\"\",Prezentace!#REF!)","v":{"$error":"#REF!"}},{"$f":"IF(Prezentace!#REF!=0,\"\",Prezentace!#REF!)","v":{"$error":"#REF!"}},{"$f":"Prezentace!#REF!","v":{"$error":"#REF!"}},{"$f":"IF(Prezentace!#REF!=0,\"\",Prezentace!#REF!)","v":{"$error":"#REF!"}},{"$f":"IF(Prezentace!#REF!=0,\"\",Prezentace!#REF!)","v":{"$error":"#REF!"}},null,null,null,null,null,null,null,null,null,null,null,null,null,null,0]
[{"$f":"IF(Prezentace!#REF!=0,\"\",Prezentace!#REF!)","v":{"$error":"#REF!"}},{"$f":"IF(Prezentace!#REF!=0,\"\",Prezentace!#REF!)","v":{"$error":"#REF!"}},{"$f":"Prezentace!#REF!","v":{"$error":"#REF!"}},{"$f":"IF(Prezentace!#REF!=0,\"\",Prezentace!#REF!)","v":{"$error":"#REF!"}},{"$f":"IF(Prezentace!#REF!=0,\"\",Prezentace!#REF!)","v":{"$error":"#REF!"}},null,null,null,null,null,null,null,null,null,null,null,null,null,null,0]
[{"$f":"IF(Prezentace!#REF!=0,\"\",Prezentace!#REF!)","v":{"$error":"#REF!"}},{"$f":"IF(Prezentace!#REF!=0,\"\",Prezentace!#REF!)","v":{"$error":"#REF!"}},{"$f":"Prezentace!#REF!","v":{"$error":"#REF!"}},{"$f":"IF(Prezentace!#REF!=0,\"\",Prezentace!#REF!)","v":{"$error":"#REF!"}},{"$f":"IF(Prezentace!#REF!=0,\"\",Prezentace!#REF!)","v":{"$error":"#REF!"}},null,null,null,null,null,null,null,null,null,null,null,null,null,null,0]
[{"$f":"IF(Prezentace!#REF!=0,\"\",Prezentace!#REF!)","v":{"$error":"#REF!"}},{"$f":"IF(Prezentace!#REF!=0,\"\",Prezentace!#REF!)","v":{"$error":"#REF!"}},{"$f":"Prezentace!#REF!","v":{"$error":"#REF!"}},{"$f":"IF(Prezentace!#REF!=0,\"\",Prezentace!#REF!)","v":{"$error":"#REF!"}},{"$f":"IF(Prezentace!#REF!=0,\"\",Prezentace!#REF!)","v":{"$error":"#REF!"}},null,null,null,null,null,null,null,null,null,null,null,null,null,null,0]
[{"$f":"IF(Prezentace!#REF!=0,\"\",Prezentace!#REF!)","v":{"$error":"#REF!"}},{"$f":"IF(Prezentace!#REF!=0,\"\",Prezentace!#REF!)","v":{"$error":"#REF!"}},{"$f":"Prezentace!#REF!","v":{"$error":"#REF!"}},{"$f":"IF(Prezentace!#REF!=0,\"\",Prezentace!#REF!)","v":{"$error":"#REF!"}},{"$f":"IF(Prezentace!#REF!=0,\"\",Prezentace!#REF!)","v":{"$error":"#REF!"}},null,null,null,null,null,null,null,null,null,null,null,null,null,null,{"$f":"(SUM(F38*$F$3,G38*$G$3,H38*$H$3,I38*$I$3,J38*$J$3,K38*$K$3,L38*$L$3,M38*$M$3,N38*$N$3,O38*$O$3,P38*$P$3,Q38*$Q$3,R38*$R$3))-S38","v":0}]
[{"$f":"IF(Prezentace!#REF!=0,\"\",Prezentace!#REF!)","v":{"$error":"#REF!"}},{"$f":"IF(Prezentace!#REF!=0,\"\",Prezentace!#REF!)","v":{"$error":"#REF!"}},{"$f":"Prezentace!#REF!","v":{"$error":"#REF!"}},{"$f":"IF(Prezentace!#REF!=0,\"\",Prezentace!#REF!)","v":{"$error":"#REF!"}},{"$f":"IF(Prezentace!#REF!=0,\"\",Prezentace!#REF!)","v":{"$error":"#REF!"}},null,null,null,null,null,null,null,null,null,null,null,null,null,null,0]
[{"$f":"IF(Prezentace!#REF!=0,\"\",Prezentace!#REF!)","v":{"$error":"#REF!"}},{"$f":"IF(Prezentace!#REF!=0,\"\",Prezentace!#REF!)","v":{"$error":"#REF!"}},{"$f":"Prezentace!#REF!","v":{"$error":"#REF!"}},{"$f":"IF(Prezentace!#REF!=0,\"\",Prezentace!#REF!)","v":{"$error":"#REF!"}},{"$f":"IF(Prezentace!#REF!=0,\"\",Prezentace!#REF!)","v":{"$error":"#REF!"}},null,null,null,null,null,null,null,null,null,null,null,null,null,null,0]
[{"$f":"IF(Prezentace!#REF!=0,\"\",Prezentace!#REF!)","v":{"$error":"#REF!"}},{"$f":"IF(Prezentace!#REF!=0,\"\",Prezentace!#REF!)","v":{"$error":"#REF!"}},{"$f":"Prezentace!#REF!","v":{"$error":"#REF!"}},{"$f":"IF(Prezentace!#REF!=0,\"\",Prezentace!#REF!)","v":{"$error":"#REF!"}},{"$f":"IF(Prezentace!#REF!=0,\"\",Prezentace!#REF!)","v":{"$error":"#REF!"}},null,null,null,null,null,null,null,null,null,null,null,null,null,null,0]
[{"$f":"IF(Prezentace!#REF!=0,\"\",Prezentace!#REF!)","v":{"$error":"#REF!"}},{"$f":"IF(Prezentace!#REF!=0,\"\",Prezentace!#REF!)","v":{"$error":"#REF!"}},{"$f":"Prezentace!#REF!","v":{"$error":"#REF!"}},{"$f":"IF(Prezentace!#REF!=0,\"\",Prezentace!#REF!)","v":{"$error":"#REF!"}},{"$f":"IF(Prezentace!#REF!=0,\"\",Prezentace!#REF!)","v":{"$error":"#REF!"}},null,null,null,null,null,null,null,null,null,null,null,null,null,null,0]
[{"$f":"IF(Prezentace!#REF!=0,\"\",Prezentace!#REF!)","v":{"$error":"#REF!"}},{"$f":"IF(Prezentace!#REF!=0,\"\",Prezentace!#REF!)","v":{"$error":"#REF!"}},{"$f":"Prezentace!#REF!","v":{"$error":"#REF!"}},{"$f":"IF(Prezentace!#REF!=0,\"\",Prezentace!#REF!)","v":{"$error":"#REF!"}},{"$f":"IF(Prezentace!#REF!=0,\"\",Prezentace!#REF!)","v":{"$error":"#REF!"}},null,null,null,null,null,null,null,null,null,null,null,null,null,null,0]
[{"$f":"IF(Prezentace!#REF!=0,\"\",Prezentace!#REF!)","v":{"$error":"#REF!"}},{"$f":"IF(Prezentace!#REF!=0,\"\",Prezentace!#REF!)","v":{"$error":"#REF!"}},{"$f":"Prezentace!#REF!","v":{"$error":"#REF!"}},{"$f":"IF(Prezentace!#REF!=0,\"\",Prezentace!#REF!)","v":{"$error":"#REF!"}},{"$f":"IF(Prezentace!#REF!=0,\"\",Prezentace!#REF!)","v":{"$error":"#REF!"}},null,null,null,null,null,null,null,null,null,null,null,null,null,null,0]
[{"$f":"IF(Prezentace!#REF!=0,\"\",Prezentace!#REF!)","v":{"$error":"#REF!"}},{"$f":"IF(Prezentace!#REF!=0,\"\",Prezentace!#REF!)","v":{"$error":"#REF!"}},{"$f":"Prezentace!#REF!","v":{"$error":"#REF!"}},{"$f":"IF(Prezentace!#REF!=0,\"\",Prezentace!#REF!)","v":{"$error":"#REF!"}},{"$f":"IF(Prezentace!#REF!=0,\"\",Prezentace!#REF!)","v":{"$error":"#REF!"}},null,null,null,null,null,null,null,null,null,null,null,null,null,null,0]
[{"$f":"IF(Prezentace!#REF!=0,\"\",Prezentace!#REF!)","v":{"$error":"#REF!"}},{"$f":"IF(Prezentace!#REF!=0,\"\",Prezentace!#REF!)","v":{"$error":"#REF!"}},{"$f":"Prezentace!#REF!","v":{"$error":"#REF!"}},{"$f":"IF(Prezentace!#REF!=0,\"\",Prezentace!#REF!)","v":{"$error":"#REF!"}},{"$f":"IF(Prezentace!#REF!=0,\"\",Prezentace!#REF!)","v":{"$error":"#REF!"}},null,null,null,null,null,null,null,null,null,null,null,null,null,null,0]
[{"$f":"IF(Prezentace!#REF!=0,\"\",Prezentace!#REF!)","v":{"$error":"#REF!"}},{"$f":"IF(Prezentace!#REF!=0,\"\",Prezentace!#REF!)","v":{"$error":"#REF!"}},{"$f":"Prezentace!#REF!","v":{"$error":"#REF!"}},{"$f":"IF(Prezentace!#REF!=0,\"\",Prezentace!#REF!)","v":{"$error":"#REF!"}},{"$f":"IF(Prezentace!#REF!=0,\"\",Prezentace!#REF!)","v":{"$error":"#REF!"}},null,null,null,null,null,null,null,null,null,null,null,null,null,null,0]
[{"$f":"IF(Prezentace!#REF!=0,\"\",Prezentace!#REF!)","v":{"$error":"#REF!"}},{"$f":"IF(Prezentace!#REF!=0,\"\",Prezentace!#REF!)","v":{"$error":"#REF!"}},{"$f":"Prezentace!#REF!","v":{"$error":"#REF!"}},{"$f":"IF(Prezentace!#REF!=0,\"\",Prezentace!#REF!)","v":{"$error":"#REF!"}},{"$f":"IF(Prezentace!#REF!=0,\"\",Prezentace!#REF!)","v":{"$error":"#REF!"}},null,null,null,null,null,null,null,null,null,null,null,null,null,null,0]
[{"$f":"IF(Prezentace!#REF!=0,\"\",Prezentace!#REF!)","v":{"$error":"#REF!"}},{"$f":"IF(Prezentace!#REF!=0,\"\",Prezentace!#REF!)","v":{"$error":"#REF!"}},{"$f":"Prezentace!#REF!","v":{"$error":"#REF!"}},{"$f":"IF(Prezentace!#REF!=0,\"\",Prezentace!#REF!)","v":{"$error":"#REF!"}},{"$f":"IF(Prezentace!#REF!=0,\"\",Prezentace!#REF!)","v":{"$error":"#REF!"}},null,null,null,null,null,null,null,null,null,null,null,null,null,null,0]
[{"$f":"IF(Prezentace!#REF!=0,\"\",Prezentace!#REF!)","v":{"$error":"#REF!"}},{"$f":"IF(Prezentace!#REF!=0,\"\",Prezentace!#REF!)","v":{"$error":"#REF!"}},{"$f":"Prezentace!#REF!","v":{"$error":"#REF!"}},{"$f":"IF(Prezentace!#REF!=0,\"\",Prezentace!#REF!)","v":{"$error":"#REF!"}},{"$f":"IF(Prezentace!#REF!=0,\"\",Prezentace!#REF!)","v":{"$error":"#REF!"}},null,null,null,null,null,null,null,null,null,null,null,null,null,null,0]
[{"$f":"IF(Prezentace!#REF!=0,\"\",Prezentace!#REF!)","v":{"$error":"#REF!"}},{"$f":"IF(Prezentace!#REF!=0,\"\",Prezentace!#REF!)","v":{"$error":"#REF!"}},{"$f":"Prezentace!#REF!","v":{"$error":"#REF!"}},{"$f":"IF(Prezentace!#REF!=0,\"\",Prezentace!#REF!)","v":{"$error":"#REF!"}},{"$f":"IF(Prezentace!#REF!=0,\"\",Prezentace!#REF!)","v":{"$error":"#REF!"}},null,null,null,null,null,null,null,null,null,null,null,null,null,null,0]
[{"$f":"IF(Prezentace!#REF!=0,\"\",Prezentace!#REF!)","v":{"$error":"#REF!"}},{"$f":"IF(Prezentace!#REF!=0,\"\",Prezentace!#REF!)","v":{"$error":"#REF!"}},{"$f":"Prezentace!#REF!","v":{"$error":"#REF!"}},{"$f":"IF(Prezentace!#REF!=0,\"\",Prezentace!#REF!)","v":{"$error":"#REF!"}},{"$f":"IF(Prezentace!#REF!=0,\"\",Prezentace!#REF!)","v":{"$error":"#REF!"}},null,null,null,null,null,null,null,null,null,null,null,null,null,null,0]
[{"$f":"IF(Prezentace!#REF!=0,\"\",Prezentace!#REF!)","v":{"$error":"#REF!"}},{"$f":"IF(Prezentace!#REF!=0,\"\",Prezentace!#REF!)","v":{"$error":"#REF!"}},{"$f":"Prezentace!#REF!","v":{"$error":"#REF!"}},{"$f":"IF(Prezentace!#REF!=0,\"\",Prezentace!#REF!)","v":{"$error":"#REF!"}},{"$f":"IF(Prezentace!#REF!=0,\"\",Prezentace!#REF!)","v":{"$error":"#REF!"}},null,null,null,null,null,null,null,null,null,null,null,null,null,null,0]
[{"$f":"IF(Prezentace!#REF!=0,\"\",Prezentace!#REF!)","v":{"$error":"#REF!"}},{"$f":"IF(Prezentace!#REF!=0,\"\",Prezentace!#REF!)","v":{"$error":"#REF!"}},{"$f":"Prezentace!#REF!","v":{"$error":"#REF!"}},{"$f":"IF(Prezentace!#REF!=0,\"\",Prezentace!#REF!)","v":{"$error":"#REF!"}},{"$f":"IF(Prezentace!#REF!=0,\"\",Prezentace!#REF!)","v":{"$error":"#REF!"}},null,null,null,null,null,null,null,null,null,null,null,null,null,null,0]
[{"$f":"IF(Prezentace!#REF!=0,\"\",Prezentace!#REF!)","v":{"$error":"#REF!"}},{"$f":"IF(Prezentace!#REF!=0,\"\",Prezentace!#REF!)","v":{"$error":"#REF!"}},{"$f":"Prezentace!#REF!","v":{"$error":"#REF!"}},{"$f":"IF(Prezentace!#REF!=0,\"\",Prezentace!#REF!)","v":{"$error":"#REF!"}},{"$f":"IF(Prezentace!#REF!=0,\"\",Prezentace!#REF!)","v":{"$error":"#REF!"}},null,null,null,null,null,null,null,null,null,null,null,null,null,null,0]
[{"$f":"IF(Prezentace!#REF!=0,\"\",Prezentace!#REF!)","v":{"$error":"#REF!"}},{"$f":"IF(Prezentace!#REF!=0,\"\",Prezentace!#REF!)","v":{"$error":"#REF!"}},{"$f":"Prezentace!#REF!","v":{"$error":"#REF!"}},{"$f":"IF(Prezentace!#REF!=0,\"\",Prezentace!#REF!)","v":{"$error":"#REF!"}},{"$f":"IF(Prezentace!#REF!=0,\"\",Prezentace!#REF!)","v":{"$error":"#REF!"}},null,null,null,null,null,null,null,null,null,null,null,null,null,null,0]
[{"$f":"IF(Prezentace!#REF!=0,\"\",Prezentace!#REF!)","v":{"$error":"#REF!"}},{"$f":"IF(Prezentace!#REF!=0,\"\",Prezentace!#REF!)","v":{"$error":"#REF!"}},{"$f":"Prezentace!#REF!","v":{"$error":"#REF!"}},{"$f":"IF(Prezentace!#REF!=0,\"\",Prezentace!#REF!)","v":{"$error":"#REF!"}},{"$f":"IF(Prezentace!#REF!=0,\"\",Prezentace!#REF!)","v":{"$error":"#REF!"}},null,null,null,null,null,null,null,null,null,null,null,null,null,null,0]
[{"$f":"IF(Prezentace!#REF!=0,\"\",Prezentace!#REF!)","v":{"$error":"#REF!"}},{"$f":"IF(Prezentace!#REF!=0,\"\",Prezentace!#REF!)","v":{"$error":"#REF!"}},{"$f":"Prezentace!#REF!","v":{"$error":"#REF!"}},{"$f":"IF(Prezentace!#REF!=0,\"\",Prezentace!#REF!)","v":{"$error":"#REF!"}},{"$f":"IF(Prezentace!#REF!=0,\"\",Prezentace!#REF!)","v":{"$error":"#REF!"}},null,null,null,null,null,null,null,null,null,null,null,null,null,null,0]
[{"$f":"IF(Prezentace!A32=0,\"\",Prezentace!A32)","v":""},{"$f":"IF(Prezentace!B32=0,\"\",Prezentace!B32)","v":""},{"$f":"Prezentace!D32","v":"P"},{"$f":"IF(Prezentace!F32=0,\"\",Prezentace!F32)","v":""},{"$f":"IF(Prezentace!E32=0,\"\",Prezentace!E32)","v":""},null,null,null,null,null,null,null,null,null,null,null,null,null,null,0]
[{"$f":"IF(Prezentace!A33=0,\"\",Prezentace!A33)","v":""},{"$f":"IF(Prezentace!B33=0,\"\",Prezentace!B33)","v":""},{"$f":"Prezentace!D33","v":"P"},{"$f":"IF(Prezentace!F33=0,\"\",Prezentace!F33)","v":""},{"$f":"IF(Prezentace!E33=0,\"\",Prezentace!E33)","v":""},null,null,null,null,null,null,null,null,null,null,null,null,null,null,0]
[{"$f":"IF(Prezentace!A34=0,\"\",Prezentace!A34)","v":""},{"$f":"IF(Prezentace!B34=0,\"\",Prezentace!B34)","v":""},{"$f":"Prezentace!D34","v":"P"},{"$f":"IF(Prezentace!F34=0,\"\",Prezentace!F34)","v":""},{"$f":"IF(Prezentace!E34=0,\"\",Prezentace!E34)","v":""},null,null,null,null,null,null,null,null,null,null,null,null,null,null,0]
[{"$f":"IF(Prezentace!A35=0,\"\",Prezentace!A35)","v":""},{"$f":"IF(Prezentace!B35=0,\"\",Prezentace!B35)","v":""},{"$f":"Prezentace!D35","v":"P"},{"$f":"IF(Prezentace!F35=0,\"\",Prezentace!F35)","v":""},{"$f":"IF(Prezentace!E35=0,\"\",Prezentace!E35)","v":""},null,null,null,null,null,null,null,null,null,null,null,null,null,null,0]
[{"$f":"IF(Prezentace!A36=0,\"\",Prezentace!A36)","v":""},{"$f":"IF(Prezentace!B36=0,\"\",Prezentace!B36)","v":""},{"$f":"Prezentace!D36","v":"P"},{"$f":"IF(Prezentace!F36=0,\"\",Prezentace!F36)","v":""},{"$f":"IF(Prezentace!E36=0,\"\",Prezentace!E36)","v":""},null,null,null,null,null,null,null,null,null,null,null,null,null,null,0]
[{"$f":"IF(Prezentace!A37=0,\"\",Prezentace!A37)","v":""},{"$f":"IF(Prezentace!B37=0,\"\",Prezentace!B37)","v":""},{"$f":"Prezentace!D37","v":"P"},{"$f":"IF(Prezentace!F37=0,\"\",Prezentace!F37)","v":""},{"$f":"IF(Prezentace!E37=0,\"\",Prezentace!E37)","v":""},null,null,null,null,null,null,null,null,null,null,null,null,null,null,0]
[{"$f":"IF(Prezentace!A38=0,\"\",Prezentace!A38)","v":""},{"$f":"IF(Prezentace!B38=0,\"\",Prezentace!B38)","v":""},{"$f":"Prezentace!D38","v":"P"},{"$f":"IF(Prezentace!F38=0,\"\",Prezentace!F38)","v":""},{"$f":"IF(Prezentace!E38=0,\"\",Prezentace!E38)","v":""},null,null,null,null,null,null,null,null,null,null,null,null,null,null,0]
[{"$f":"IF(Prezentace!A39=0,\"\",Prezentace!A39)","v":""},{"$f":"IF(Prezentace!B39=0,\"\",Prezentace!B39)","v":""},{"$f":"Prezentace!D39","v":"P"},{"$f":"IF(Prezentace!F39=0,\"\",Prezentace!F39)","v":""},{"$f":"IF(Prezentace!E39=0,\"\",Prezentace!E39)","v":""},null,null,null,null,null,null,null,null,null,null,null,null,null,null,0]
[{"$f":"IF(Prezentace!A40=0,\"\",Prezentace!A40)","v":""},{"$f":"IF(Prezentace!B40=0,\"\",Prezentace!B40)","v":""},{"$f":"Prezentace!D40","v":"P"},{"$f":"IF(Prezentace!F40=0,\"\",Prezentace!F40)","v":""},{"$f":"IF(Prezentace!E40=0,\"\",Prezentace!E40)","v":""},null,null,null,null,null,null,null,null,null,null,null,null,null,null,0]
[{"$f":"IF(Prezentace!A41=0,\"\",Prezentace!A41)","v":""},{"$f":"IF(Prezentace!B41=0,\"\",Prezentace!B41)","v":""},{"$f":"Prezentace!D41","v":"P"},{"$f":"IF(Prezentace!F41=0,\"\",Prezentace!F41)","v":""},{"$f":"IF(Prezentace!E41=0,\"\",Prezentace!E41)","v":""},null,null,null,null,null,null,null,null,null,null,null,null,null,null,0]
[{"$f":"IF(Prezentace!A42=0,\"\",Prezentace!A42)","v":""},{"$f":"IF(Prezentace!B42=0,\"\",Prezentace!B42)","v":""},{"$f":"Prezentace!D42","v":"P"},{"$f":"IF(Prezentace!F42=0,\"\",Prezentace!F42)","v":""},{"$f":"IF(Prezentace!E42=0,\"\",Prezentace!E42)","v":""},null,null,null,null,null,null,null,null,null,null,null,null,null,null,0]
[{"$f":"IF(Prezentace!A43=0,\"\",Prezentace!A43)","v":""},{"$f":"IF(Prezentace!B43=0,\"\",Prezentace!B43)","v":""},{"$f":"Prezentace!D43","v":"P"},{"$f":"IF(Prezentace!F43=0,\"\",Prezentace!F43)","v":""},{"$f":"IF(Prezentace!E43=0,\"\",Prezentace!E43)","v":""},null,null,null,null,null,null,null,null,null,null,null,null,null,null,0]
[{"$f":"IF(Prezentace!A44=0,\"\",Prezentace!A44)","v":""},{"$f":"IF(Prezentace!B44=0,\"\",Prezentace!B44)","v":""},{"$f":"Prezentace!D44","v":"P"},{"$f":"IF(Prezentace!F44=0,\"\",Prezentace!F44)","v":""},{"$f":"IF(Prezentace!E44=0,\"\",Prezentace!E44)","v":""},null,null,null,null,null,null,null,null,null,null,null,null,null,null,0]
[{"$f":"IF(Prezentace!A45=0,\"\",Prezentace!A45)","v":""},{"$f":"IF(Prezentace!B45=0,\"\",Prezentace!B45)","v":""},{"$f":"Prezentace!D45","v":"P"},{"$f":"IF(Prezentace!F45=0,\"\",Prezentace!F45)","v":""},{"$f":"IF(Prezentace!E45=0,\"\",Prezentace!E45)","v":""},null,null,null,null,null,null,null,null,null,null,null,null,null,null,0]
[{"$f":"IF(Prezentace!A46=0,\"\",Prezentace!A46)","v":""},{"$f":"IF(Prezentace!B46=0,\"\",Prezentace!B46)","v":""},{"$f":"Prezentace!D46","v":"P"},{"$f":"IF(Prezentace!F46=0,\"\",Prezentace!F46)","v":""},{"$f":"IF(Prezentace!E46=0,\"\",Prezentace!E46)","v":""},null,null,null,null,null,null,null,null,null,null,null,null,null,null,0]
[{"$f":"IF(Prezentace!A47=0,\"\",Prezentace!A47)","v":""},{"$f":"IF(Prezentace!B47=0,\"\",Prezentace!B47)","v":""},{"$f":"Prezentace!D47","v":"P"},{"$f":"IF(Prezentace!F47=0,\"\",Prezentace!F47)","v":""},{"$f":"IF(Prezentace!E47=0,\"\",Prezentace!E47)","v":""},null,null,null,null,null,null,null,null,null,null,null,null,null,null,0]
[{"$f":"IF(Prezentace!A48=0,\"\",Prezentace!A48)","v":""},{"$f":"IF(Prezentace!B48=0,\"\",Prezentace!B48)","v":""},{"$f":"Prezentace!D48","v":"P"},{"$f":"IF(Prezentace!F48=0,\"\",Prezentace!F48)","v":""},{"$f":"IF(Prezentace!E48=0,\"\",Prezentace!E48)","v":""},null,null,null,null,null,null,null,null,null,null,null,null,null,null,0]
[{"$f":"IF(Prezentace!A49=0,\"\",Prezentace!A49)","v":""},{"$f":"IF(Prezentace!B49=0,\"\",Prezentace!B49)","v":""},{"$f":"Prezentace!D49","v":"P"},{"$f":"IF(Prezentace!F49=0,\"\",Prezentace!F49)","v":""},{"$f":"IF(Prezentace!E49=0,\"\",Prezentace!E49)","v":""},null,null,null,null,null,null,null,null,null,null,null,null,null,null,0]
[{"$f":"IF(Prezentace!A50=0,\"\",Prezentace!A50)","v":""},{"$f":"IF(Prezentace!B50=0,\"\",Prezentace!B50)","v":""},{"$f":"Prezentace!D50","v":"P"},{"$f":"IF(Prezentace!F50=0,\"\",Prezentace!F50)","v":""},{"$f":"IF(Prezentace!E50=0,\"\",Prezentace!E50)","v":""},null,null,null,null,null,null,null,null,null,null,null,null,null,null,0]
[{"$f":"IF(Prezentace!A51=0,\"\",Prezentace!A51)","v":""},{"$f":"IF(Prezentace!B51=0,\"\",Prezentace!B51)","v":""},{"$f":"Prezentace!D51","v":"P"},{"$f":"IF(Prezentace!F51=0,\"\",Prezentace!F51)","v":""},{"$f":"IF(Prezentace!E51=0,\"\",Prezentace!E51)","v":""},null,null,null,null,null,null,null,null,null,null,null,null,null,null,0]
[{"$f":"IF(Prezentace!A52=0,\"\",Prezentace!A52)","v":""},{"$f":"IF(Prezentace!B52=0,\"\",Prezentace!B52)","v":""},{"$f":"Prezentace!D52","v":"P"},{"$f":"IF(Prezentace!F52=0,\"\",Prezentace!F52)","v":""},{"$f":"IF(Prezentace!E52=0,\"\",Prezentace!E52)","v":""},null,null,null,null,null,null,null,null,null,null,null,null,null,null,0]
[{"$f":"IF(Prezentace!A53=0,\"\",Prezentace!A53)","v":""},{"$f":"IF(Prezentace!B53=0,\"\",Prezentace!B53)","v":""},{"$f":"Prezentace!D53","v":"P"},{"$f":"IF(Prezentace!F53=0,\"\",Prezentace!F53)","v":""},{"$f":"IF(Prezentace!E53=0,\"\",Prezentace!E53)","v":""},null,null,null,null,null,null,null,null,null,null,null,null,null,null,0]
[{"$f":"IF(Prezentace!A54=0,\"\",Prezentace!A54)","v":""},{"$f":"IF(Prezentace!B54=0,\"\",Prezentace!B54)","v":""},{"$f":"Prezentace!D54","v":"P"},{"$f":"IF(Prezentace!F54=0,\"\",Prezentace!F54)","v":""},{"$f":"IF(Prezentace!E54=0,\"\",Prezentace!E54)","v":""},null,null,null,null,null,null,null,null,null,null,null,null,null,null,0]
[{"$f":"IF(Prezentace!A55=0,\"\",Prezentace!A55)","v":""},{"$f":"IF(Prezentace!B55=0,\"\",Prezentace!B55)","v":""},{"$f":"Prezentace!D55","v":"P"},{"$f":"IF(Prezentace!F55=0,\"\",Prezentace!F55)","v":""},{"$f":"IF(Prezentace!E55=0,\"\",Prezentace!E55)","v":""},null,null,null,null,null,null,null,null,null,null,null,null,null,null,0]
[{"$f":"IF(Prezentace!A56=0,\"\",Prezentace!A56)","v":""},{"$f":"IF(Prezentace!B56=0,\"\",Prezentace!B56)","v":""},{"$f":"Prezentace!D56","v":"P"},{"$f":"IF(Prezentace!F56=0,\"\",Prezentace!F56)","v":""},{"$f":"IF(Prezentace!E56=0,\"\",Prezentace!E56)","v":""},null,null,null,null,null,null,null,null,null,null,null,null,null,null,0]
[{"$f":"IF(Prezentace!A57=0,\"\",Prezentace!A57)","v":""},{"$f":"IF(Prezentace!B57=0,\"\",Prezentace!B57)","v":""},{"$f":"Prezentace!D57","v":"P"},{"$f":"IF(Prezentace!F57=0,\"\",Prezentace!F57)","v":""},{"$f":"IF(Prezentace!E57=0,\"\",Prezentace!E57)","v":""},null,null,null,null,null,null,null,null,null,null,null,null,null,null,0]
[{"$f":"IF(Prezentace!A58=0,\"\",Prezentace!A58)","v":""},{"$f":"IF(Prezentace!B58=0,\"\",Prezentace!B58)","v":""},{"$f":"Prezentace!D58","v":"P"},{"$f":"IF(Prezentace!F58=0,\"\",Prezentace!F58)","v":""},{"$f":"IF(Prezentace!E58=0,\"\",Prezentace!E58)","v":""},null,null,null,null,null,null,null,null,null,null,null,null,null,null,0]
[{"$f":"IF(Prezentace!A59=0,\"\",Prezentace!A59)","v":""},{"$f":"IF(Prezentace!B59=0,\"\",Prezentace!B59)","v":""},{"$f":"Prezentace!D59","v":"P"},{"$f":"IF(Prezentace!F59=0,\"\",Prezentace!F59)","v":""},{"$f":"IF(Prezentace!E59=0,\"\",Prezentace!E59)","v":""},null,null,null,null,null,null,null,null,null,null,null,null,null,null,0]
[{"$f":"IF(Prezentace!A60=0,\"\",Prezentace!A60)","v":""},{"$f":"IF(Prezentace!B60=0,\"\",Prezentace!B60)","v":""},{"$f":"Prezentace!D60","v":"P"},{"$f":"IF(Prezentace!F60=0,\"\",Prezentace!F60)","v":""},{"$f":"IF(Prezentace!E60=0,\"\",Prezentace!E60)","v":""},null,null,null,null,null,null,null,null,null,null,null,null,null,null,0]
[{"$f":"IF(Prezentace!A61=0,\"\",Prezentace!A61)","v":""},{"$f":"IF(Prezentace!B61=0,\"\",Prezentace!B61)","v":""},{"$f":"Prezentace!D61","v":"P"},{"$f":"IF(Prezentace!F61=0,\"\",Prezentace!F61)","v":""},{"$f":"IF(Prezentace!E61=0,\"\",Prezentace!E61)","v":""},null,null,null,null,null,null,null,null,null,null,null,null,null,null,0]
[{"$f":"IF(Prezentace!A62=0,\"\",Prezentace!A62)","v":""},{"$f":"IF(Prezentace!B62=0,\"\",Prezentace!B62)","v":""},{"$f":"Prezentace!D62","v":"P"},{"$f":"IF(Prezentace!F62=0,\"\",Prezentace!F62)","v":""},{"$f":"IF(Prezentace!E62=0,\"\",Prezentace!E62)","v":""},null,null,null,null,null,null,null,null,null,null,null,null,null,null,0]
[{"$f":"IF(Prezentace!A63=0,\"\",Prezentace!A63)","v":""},{"$f":"IF(Prezentace!B63=0,\"\",Prezentace!B63)","v":""},{"$f":"Prezentace!D63","v":"P"},{"$f":"IF(Prezentace!F63=0,\"\",Prezentace!F63)","v":""},{"$f":"IF(Prezentace!E63=0,\"\",Prezentace!E63)","v":""},null,null,null,null,null,null,null,null,null,null,null,null,null,null,0]
[{"$f":"IF(Prezentace!A64=0,\"\",Prezentace!A64)","v":""},{"$f":"IF(Prezentace!B64=0,\"\",Prezentace!B64)","v":""},{"$f":"Prezentace!D64","v":"P"},{"$f":"IF(Prezentace!F64=0,\"\",Prezentace!F64)","v":""},{"$f":"IF(Prezentace!E64=0,\"\",Prezentace!E64)","v":""},null,null,null,null,null,null,null,null,null,null,null,null,null,null,0]
[{"$f":"IF(Prezentace!A65=0,\"\",Prezentace!A65)","v":""},{"$f":"IF(Prezentace!B65=0,\"\",Prezentace!B65)","v":""},{"$f":"Prezentace!D65","v":"P"},{"$f":"IF(Prezentace!F65=0,\"\",Prezentace!F65)","v":""},{"$f":"IF(Prezentace!E65=0,\"\",Prezentace!E65)","v":""},null,null,null,null,null,null,null,null,null,null,null,null,null,null,0]
[{"$f":"IF(Prezentace!A66=0,\"\",Prezentace!A66)","v":""},{"$f":"IF(Prezentace!B66=0,\"\",Prezentace!B66)","v":""},{"$f":"Prezentace!D66","v":"P"},{"$f":"IF(Prezentace!F66=0,\"\",Prezentace!F66)","v":""},{"$f":"IF(Prezentace!E66=0,\"\",Prezentace!E66)","v":""},null,null,null,null,null,null,null,null,null,null,null,null,null,null,0]
[{"$f":"IF(Prezentace!A67=0,\"\",Prezentace!A67)","v":""},{"$f":"IF(Prezentace!B67=0,\"\",Prezentace!B67)","v":""},{"$f":"Prezentace!D67","v":"P"},{"$f":"IF(Prezentace!F67=0,\"\",Prezentace!F67)","v":""},{"$f":"IF(Prezentace!E67=0,\"\",Prezentace!E67)","v":""},null,null,null,null,null,null,null,null,null,null,null,null,null,null,0]
[{"$f":"IF(Prezentace!A68=0,\"\",Prezentace!A68)","v":""},{"$f":"IF(Prezentace!B68=0,\"\",Prezentace!B68)","v":""},{"$f":"Prezentace!D68","v":"P"},{"$f":"IF(Prezentace!F68=0,\"\",Prezentace!F68)","v":""},{"$f":"IF(Prezentace!E68=0,\"\",Prezentace!E68)","v":""},null,null,null,null,null,null,null,null,null,null,null,null,null,null,0]
[{"$f":"IF(Prezentace!A69=0,\"\",Prezentace!A69)","v":""},{"$f":"IF(Prezentace!B69=0,\"\",Prezentace!B69)","v":""},{"$f":"Prezentace!D69","v":"P"},{"$f":"IF(Prezentace!F69=0,\"\",Prezentace!F69)","v":""},{"$f":"IF(Prezentace!E69=0,\"\",Prezentace!E69)","v":""},null,null,null,null,null,null,null,null,null,null,null,null,null,null,0]
[{"$f":"IF(Prezentace!A70=0,\"\",Prezentace!A70)","v":""},{"$f":"IF(Prezentace!B70=0,\"\",Prezentace!B70)","v":""},{"$f":"Prezentace!D70","v":"P"},{"$f":"IF(Prezentace!F70=0,\"\",Prezentace!F70)","v":""},{"$f":"IF(Prezentace!E70=0,\"\",Prezentace!E70)","v":""},null,null,null,null,null,null,null,null,null,null,null,null,null,null,0]
[{"$f":"IF(Prezentace!A71=0,\"\",Prezentace!A71)","v":""},{"$f":"IF(Prezentace!B71=0,\"\",Prezentace!B71)","v":""},{"$f":"Prezentace!D71","v":"P"},{"$f":"IF(Prezentace!F71=0,\"\",Prezentace!F71)","v":""},{"$f":"IF(Prezentace!E71=0,\"\",Prezentace!E71)","v":""},null,null,null,null,null,null,null,null,null,null,null,null,null,null,0]
[{"$f":"IF(Prezentace!A72=0,\"\",Prezentace!A72)","v":""},{"$f":"IF(Prezentace!B72=0,\"\",Prezentace!B72)","v":""},{"$f":"Prezentace!D72","v":"P"},{"$f":"IF(Prezentace!F72=0,\"\",Prezentace!F72)","v":""},{"$f":"IF(Prezentace!E72=0,\"\",Prezentace!E72)","v":""},null,null,null,null,null,null,null,null,null,null,null,null,null,null,0]
[{"$f":"IF(Prezentace!A73=0,\"\",Prezentace!A73)","v":""},{"$f":"IF(Prezentace!B73=0,\"\",Prezentace!B73)","v":""},{"$f":"Prezentace!D73","v":"P"},{"$f":"IF(Prezentace!F73=0,\"\",Prezentace!F73)","v":""},{"$f":"IF(Prezentace!E73=0,\"\",Prezentace!E73)","v":""},null,null,null,null,null,null,null,null,null,null,null,null,null,null,0]
[{"$f":"IF(Prezentace!A74=0,\"\",Prezentace!A74)","v":""},{"$f":"IF(Prezentace!B74=0,\"\",Prezentace!B74)","v":""},{"$f":"Prezentace!D74","v":"P"},{"$f":"IF(Prezentace!F74=0,\"\",Prezentace!F74)","v":""},{"$f":"IF(Prezentace!E74=0,\"\",Prezentace!E74)","v":""},null,null,null,null,null,null,null,null,null,null,null,null,null,null,0]
[{"$f":"IF(Prezentace!A75=0,\"\",Prezentace!A75)","v":""},{"$f":"IF(Prezentace!B75=0,\"\",Prezentace!B75)","v":""},{"$f":"Prezentace!D75","v":"P"},{"$f":"IF(Prezentace!F75=0,\"\",Prezentace!F75)","v":""},{"$f":"IF(Prezentace!E75=0,\"\",Prezentace!E75)","v":""},null,null,null,null,null,null,null,null,null,null,null,null,null,null,{"$f":"(SUM(F102*$F$3,G102*$G$3,H102*$H$3,I102*$I$3,J102*$J$3,K102*$K$3,L102*$L$3,M102*$M$3,N102*$N$3,O102*$O$3,P102*$P$3,Q102*$Q$3,R102*$R$3))-S102","v":0}]