{"text_format":"1","workbook":"xlsx","n_sheets":16,"sheets":["Nastavení","Prezentace","1","1(M)","2","2(M)","3(M)","3","4","4(M)","5","5(M)","6","6(M)","Výsledky","List1"],"not_rendered":{"charts":0,"images":10,"macros":1,"external_links":0,"defined_names":3,"comments":1,"pivot_tables":0},"unopened":[],"bounds":{"document_bytes":16777216,"sheet_cells":100000,"rows_first":2000,"rows_last":500,"rows_between":2000,"halvings":0,"cell_chars":16384,"cell_head_chars":4096},"cells_cut":0,"cells_raw":0,"read":"whole","date_system":"1900"}

{"sheet":"Nastavení","index":0,"n_rows":17,"n_cols":2,"rows_kept":17,"cut":false,"hidden":false,"merged":[[33,1,33,3],[16,1,21,2],[3,0,4,20],[13,0,14,20]]}
[]
[]
[]
["Vyber počet disciplín"]
[]
[]
[]
[]
[]
[]
[]
[]
[]
["Vyber počet střelců"]
[]
[]
[null,44]

{"sheet":"Prezentace","index":1,"n_rows":104,"n_cols":23,"rows_kept":104,"cut":false,"hidden":false,"merged":[[3,15,4,15],[3,16,4,16],[3,8,4,8],[3,10,4,10],[3,12,4,12],[3,14,4,14],[3,9,4,9],[3,11,4,11],[3,13,4,13],[0,19,2,22],[3,0,4,0],[3,1,4,1],[3,21,4,21],[3,22,4,22],[3,18,4,18],[3,6,4,6],[3,2,4,2],[3,3,4,3],[3,4,4,4],[3,5,4,5],[3,19,4,19],[3,20,4,20],[3,7,4,7],[0,0,2,6],[3,17,4,17]]}
["Střelecký víceboj",null,null,null,null,null,null,null,null,null,null,null,null,null,null,null,null,null,null,"Datum: 4. 5. 2019\nHorní Cerekev\nKVZ Policie Počátky"]
[]
[]
["Druž.","Kap.","Start. číslo","Zbraň","Příjmení","Jméno","Klub (organizace)","Disc.\n1","Disc.\n1","Disc.\n2","Disc.\n2","Disc.\n3","Disc.\n3","Disc.\n4","Disc.\n4","Disc.\n5","Disc.\n5","Disc.\n6","Disc.\n6","Celkový výsledek","Pořadí","Celkem družstvo","Pořadí družstvo"]
[]
[null,null,1,"P","Adensam ","Martin","SK Žirovnice",{"$f":"'1'!V4","v":229.89},{"$f":"'1(M)'!T4","v":0},{"$f":"'2'!V4","v":288.40999999999997},{"$f":"'2(M)'!T4","v":0},{"$f":"'3'!V4","v":269.75},{"$f":"'3(M)'!T4","v":0},{"$f":"'4'!V4","v":0},{"$f":"'4(M)'!T4","v":0},{"$f":"'5'!V4","v":0},{"$f":"'5(M)'!T4","v":0},{"$f":"'6'!V4","v":0},{"$f":"'6(M)'!T4","v":0},{"$f":"IF(SUM(H6:S6)<0,0,SUM(H6:S6))","v":788.05},{"$f":"RANK(T6,$T$6:$T$104)","v":11},{"$f":"IF($B6=\"K\",SUMIFS($T$6:$T$104,$A$6:$A$104,A6),\"\")","v":""},{"$f":"IF($B6=\"K\",RANK(V6,$V$6:$V$104),\"\")","v":""}]
[null,null,2,"R","Adensam","Martin","SK Žirovnice",{"$f":"'1'!V5","v":160.4},{"$f":"'1(M)'!T5","v":0},{"$f":"'2'!V5","v":196.54000000000002},{"$f":"'2(M)'!T5","v":0},{"$f":"'3'!V5","v":203.88},{"$f":"'3(M)'!T5","v":0},{"$f":"'4'!V5","v":0},{"$f":"'4(M)'!T5","v":0},{"$f":"'5'!V5","v":0},{"$f":"'5(M)'!T5","v":0},{"$f":"'6'!V5","v":0},{"$f":"'6(M)'!T5","v":0},{"$f":"IF(SUM(H7:S7)<0,0,SUM(H7:S7))","v":560.82000000000005},{"$f":"RANK(T7,$T$6:$T$104)","v":41},{"$f":"IF($B7=\"K\",SUMIFS($T$6:$T$104,$A$6:$A$104,A7),\"\")","v":""},{"$f":"IF($B7=\"K\",RANK(V7,$V$6:$V$104),\"\")","v":""}]
[null,null,3,"P","Kostříž ","Jaroslav","Kvz Policie Počátky",{"$f":"'1'!V6","v":193},{"$f":"'1(M)'!T6","v":0},{"$f":"'2'!V6","v":305.2},{"$f":"'2(M)'!T6","v":0},{"$f":"'3'!V6","v":211.72},{"$f":"'3(M)'!T6","v":0},{"$f":"'4'!V6","v":0},{"$f":"'4(M)'!T6","v":0},{"$f":"'5'!V6","v":0},{"$f":"'5(M)'!T6","v":0},{"$f":"'6'!V6","v":0},{"$f":"'6(M)'!T6","v":0},709.92,31,"",""]
[null,null,4,"P","Koch   ml.","Miroslav","Kvz Policie Počátky",{"$f":"'1'!V7","v":207.94},{"$f":"'1(M)'!T7","v":0},{"$f":"'2'!V7","v":265.3},{"$f":"'2(M)'!T7","v":0},{"$f":"'3'!V7","v":247.88},{"$f":"'3(M)'!T7","v":0},{"$f":"'4'!V7","v":0},{"$f":"'4(M)'!T7","v":0},{"$f":"'5'!V7","v":0},{"$f":"'5(M)'!T7","v":0},{"$f":"'6'!V7","v":0},{"$f":"'6(M)'!T7","v":0},721.12,29,"",""]
[null,null,5,"P","Koch  st. ","Miroslav","Kvz Policie Počátky",{"$f":"'1'!V8","v":208.92000000000002},{"$f":"'1(M)'!T8","v":0},{"$f":"'2'!V8","v":298.31},{"$f":"'2(M)'!T8","v":0},{"$f":"'3'!V8","v":244.06},{"$f":"'3(M)'!T8","v":0},{"$f":"'4'!V8","v":0},{"$f":"'4(M)'!T8","v":0},{"$f":"'5'!V8","v":0},{"$f":"'5(M)'!T8","v":0},{"$f":"'6'!V8","v":0},{"$f":"'6(M)'!T8","v":0},751.29,20,"",""]
[null,null,6,"P","Herceg","Bohumil","Kvz Policie Počátky",{"$f":"'1'!V9","v":186.4},{"$f":"'1(M)'!T9","v":0},{"$f":"'2'!V9","v":254.5},{"$f":"'2(M)'!T9","v":0},{"$f":"'3'!V9","v":223.31},{"$f":"'3(M)'!T9","v":0},{"$f":"'4'!V9","v":0},{"$f":"'4(M)'!T9","v":0},{"$f":"'5'!V9","v":0},{"$f":"'5(M)'!T9","v":0},{"$f":"'6'!V9","v":0},{"$f":"'6(M)'!T9","v":0},664.21,35,"",""]
[null,null,7,"P","Fuksa  ","Viktor","Kvz Policie Počátky",{"$f":"'1'!V10","v":205.20999999999998},{"$f":"'1(M)'!T10","v":0},{"$f":"'2'!V10","v":288.56},{"$f":"'2(M)'!T10","v":0},{"$f":"'3'!V10","v":253.94},{"$f":"'3(M)'!T10","v":0},{"$f":"'4'!V10","v":0},{"$f":"'4(M)'!T10","v":0},{"$f":"'5'!V10","v":0},{"$f":"'5(M)'!T10","v":0},{"$f":"'6'!V10","v":0},{"$f":"'6(M)'!T10","v":0},747.71,23,"",""]
[null,null,8,"P","Matějka  ml.","Milan","KVZ Policie Počátky",{"$f":"'1'!V11","v":210.54000000000002},{"$f":"'1(M)'!T11","v":0},{"$f":"'2'!V11","v":307.44},{"$f":"'2(M)'!T11","v":0},{"$f":"'3'!V11","v":225.87},{"$f":"'3(M)'!T11","v":0},{"$f":"'4'!V11","v":0},{"$f":"'4(M)'!T11","v":0},{"$f":"'5'!V11","v":0},{"$f":"'5(M)'!T11","v":0},{"$f":"'6'!V11","v":0},{"$f":"'6(M)'!T11","v":0},743.85,25,"",""]
[null,null,9,"P","Svoboda","Michal","KVZ Počátky",{"$f":"'1'!V12","v":237.59},{"$f":"'1(M)'!T12","v":0},{"$f":"'2'!V12","v":327.87},{"$f":"'2(M)'!T12","v":0},{"$f":"'3'!V12","v":264.39999999999998},{"$f":"'3(M)'!T12","v":0},{"$f":"'4'!V12","v":0},{"$f":"'4(M)'!T12","v":0},{"$f":"'5'!V12","v":0},{"$f":"'5(M)'!T12","v":0},{"$f":"'6'!V12","v":0},{"$f":"'6(M)'!T12","v":0},829.86,7,"",""]
[null,null,10,"R","Bouda ","Lukáš","KVZ  Telč",{"$f":"'1'!V13","v":217.31},{"$f":"'1(M)'!T13","v":0},{"$f":"'2'!V13","v":284.89999999999998},{"$f":"'2(M)'!T13","v":0},{"$f":"'3'!V13","v":246.3},{"$f":"'3(M)'!T13","v":0},{"$f":"'4'!V13","v":0},{"$f":"'4(M)'!T13","v":0},{"$f":"'5'!V13","v":0},{"$f":"'5(M)'!T13","v":0},{"$f":"'6'!V13","v":0},{"$f":"'6(M)'!T13","v":0},748.51,22,"",""]
[null,null,11,"P","Bouda ","Lukáš","KVZ  Telč",{"$f":"'1'!V14","v":245.92000000000002},{"$f":"'1(M)'!T14","v":0},{"$f":"'2'!V14","v":328.95},{"$f":"'2(M)'!T14","v":0},{"$f":"'3'!V14","v":282.77999999999997},{"$f":"'3(M)'!T14","v":0},{"$f":"'4'!V14","v":0},{"$f":"'4(M)'!T14","v":0},{"$f":"'5'!V14","v":0},{"$f":"'5(M)'!T14","v":0},{"$f":"'6'!V14","v":0},{"$f":"'6(M)'!T14","v":0},857.65,2,"",""]
[null,null,12,"P","Koltai","Pavel","KVZ Telč",{"$f":"'1'!V15","v":251.88},{"$f":"'1(M)'!T15","v":0},{"$f":"'2'!V15","v":316.27999999999997},{"$f":"'2(M)'!T15","v":0},{"$f":"'3'!V15","v":266.40999999999997},{"$f":"'3(M)'!T15","v":0},{"$f":"'4'!V15","v":0},{"$f":"'4(M)'!T15","v":0},{"$f":"'5'!V15","v":0},{"$f":"'5(M)'!T15","v":0},{"$f":"'6'!V15","v":0},{"$f":"'6(M)'!T15","v":0},834.56999999999994,6,"",""]
[null,null,13,"P","Přibyl","Vladislav","KVZ Telč",{"$f":"'1'!V16","v":186.4},{"$f":"'1(M)'!T16","v":0},{"$f":"'2'!V16","v":181.3},{"$f":"'2(M)'!T16","v":0},{"$f":"'3'!V16","v":160.5},{"$f":"'3(M)'!T16","v":0},{"$f":"'4'!V16","v":0},{"$f":"'4(M)'!T16","v":0},{"$f":"'5'!V16","v":0},{"$f":"'5(M)'!T16","v":0},{"$f":"'6'!V16","v":0},{"$f":"'6(M)'!T16","v":0},528.20000000000005,42,"",""]
[null,null,14,"P","Matějka st.","Milan","Jindřichův Hradec",{"$f":"'1'!V17","v":104.4},{"$f":"'1(M)'!T17","v":0},{"$f":"'2'!V17","v":140.80000000000001},{"$f":"'2(M)'!T17","v":0},{"$f":"'3'!V17","v":116.6},{"$f":"'3(M)'!T17","v":0},{"$f":"'4'!V17","v":0},{"$f":"'4(M)'!T17","v":0},{"$f":"'5'!V17","v":0},{"$f":"'5(M)'!T17","v":0},{"$f":"'6'!V17","v":0},{"$f":"'6(M)'!T17","v":0},361.8,43,"",""]
[null,null,15,"P","Fiala  ","Miroslav","KVZ Fruko J.Hradec",{"$f":"'1'!V18","v":181.28},{"$f":"'1(M)'!T18","v":0},{"$f":"'2'!V18","v":298.62},{"$f":"'2(M)'!T18","v":0},{"$f":"'3'!V18","v":252.75},{"$f":"'3(M)'!T18","v":0},{"$f":"'4'!V18","v":0},{"$f":"'4(M)'!T18","v":0},{"$f":"'5'!V18","v":0},{"$f":"'5(M)'!T18","v":0},{"$f":"'6'!V18","v":0},{"$f":"'6(M)'!T18","v":0},732.65,26,"",""]
[null,null,16,"P","Gažák ","Karel","SSK Borek",{"$f":"'1'!V19","v":204.57},{"$f":"'1(M)'!T19","v":0},{"$f":"'2'!V19","v":309.10000000000002},{"$f":"'2(M)'!T19","v":0},{"$f":"'3'!V19","v":251.85},{"$f":"'3(M)'!T19","v":0},{"$f":"'4'!V19","v":0},{"$f":"'4(M)'!T19","v":0},{"$f":"'5'!V19","v":0},{"$f":"'5(M)'!T19","v":0},{"$f":"'6'!V19","v":0},{"$f":"'6(M)'!T19","v":0},765.5200000000001,18,"",""]
[null,null,17,"P","Landkammer","Václav","KVZ Fruko J.Hradec",{"$f":"'1'!V20","v":199.85},{"$f":"'1(M)'!T20","v":0},{"$f":"'2'!V20","v":272.8},{"$f":"'2(M)'!T20","v":0},{"$f":"'3'!V20","v":233.04000000000002},{"$f":"'3(M)'!T20","v":0},{"$f":"'4'!V20","v":0},{"$f":"'4(M)'!T20","v":0},{"$f":"'5'!V20","v":0},{"$f":"'5(M)'!T20","v":0},{"$f":"'6'!V20","v":0},{"$f":"'6(M)'!T20","v":0},705.69,32,"",""]
[null,null,18,"P","Brejžek ","Vojtěch","KVZ Fruko J.Hradec",{"$f":"'1'!V21","v":212.95999999999998},{"$f":"'1(M)'!T21","v":0},{"$f":"'2'!V21","v":269.27},{"$f":"'2(M)'!T21","v":0},{"$f":"'3'!V21","v":247.63},{"$f":"'3(M)'!T21","v":0},{"$f":"'4'!V21","v":0},{"$f":"'4(M)'!T21","v":0},{"$f":"'5'!V21","v":0},{"$f":"'5(M)'!T21","v":0},{"$f":"'6'!V21","v":0},{"$f":"'6(M)'!T21","v":0},729.8599999999999,27,"",""]
[null,null,19,"P","Urbanec  ","Antonín","KVZ Fruko J.Hradec",{"$f":"'1'!V22","v":111.69999999999999},{"$f":"'1(M)'!T22","v":0},{"$f":"'2'!V22","v":163.4},{"$f":"'2(M)'!T22","v":0},{"$f":"'3'!V22","v":79.300000000000011},{"$f":"'3(M)'!T22","v":0},{"$f":"'4'!V22","v":0},{"$f":"'4(M)'!T22","v":0},{"$f":"'5'!V22","v":0},{"$f":"'5(M)'!T22","v":0},{"$f":"'6'!V22","v":0},{"$f":"'6(M)'!T22","v":0},354.40000000000003,44,"",""]
[null,null,20,"P","Jílek  ","Milan","KVZ Fruko J.Hradec",{"$f":"'1'!V23","v":166.8},{"$f":"'1(M)'!T23","v":0},{"$f":"'2'!V23","v":248.3},{"$f":"'2(M)'!T23","v":0},{"$f":"'3'!V23","v":203.3},{"$f":"'3(M)'!T23","v":0},{"$f":"'4'!V23","v":0},{"$f":"'4(M)'!T23","v":0},{"$f":"'5'!V23","v":0},{"$f":"'5(M)'!T23","v":0},{"$f":"'6'!V23","v":0},{"$f":"'6(M)'!T23","v":0},618.40000000000009,38,"",""]
[null,null,21,"P","Jírů","Václav","SK Jednorožec",{"$f":"'1'!V24","v":223.54000000000002},{"$f":"'1(M)'!T24","v":0},{"$f":"'2'!V24","v":315.93},{"$f":"'2(M)'!T24","v":0},{"$f":"'3'!V24","v":254.14},{"$f":"'3(M)'!T24","v":0},{"$f":"'4'!V24","v":0},{"$f":"'4(M)'!T24","v":0},{"$f":"'5'!V24","v":0},{"$f":"'5(M)'!T24","v":0},{"$f":"'6'!V24","v":0},{"$f":"'6(M)'!T24","v":0},793.61,10,"",""]
[null,null,22,"P","Krupica","Milan","SK Jednorožec",{"$f":"'1'!V25","v":214.14},{"$f":"'1(M)'!T25","v":0},{"$f":"'2'!V25","v":307.42},{"$f":"'2(M)'!T25","v":0},{"$f":"'3'!V25","v":252.93},{"$f":"'3(M)'!T25","v":0},{"$f":"'4'!V25","v":0},{"$f":"'4(M)'!T25","v":0},{"$f":"'5'!V25","v":0},{"$f":"'5(M)'!T25","v":0},{"$f":"'6'!V25","v":0},{"$f":"'6(M)'!T25","v":0},774.49,15,"",""]
[null,null,23,"R","Krupica ","Milan","SK Jednorožec",{"$f":"'1'!V26","v":196.3},{"$f":"'1(M)'!T26","v":0},{"$f":"'2'!V26","v":251.7},{"$f":"'2(M)'!T26","v":0},{"$f":"'3'!V26","v":195.7},{"$f":"'3(M)'!T26","v":0},{"$f":"'4'!V26","v":0},{"$f":"'4(M)'!T26","v":0},{"$f":"'5'!V26","v":0},{"$f":"'5(M)'!T26","v":0},{"$f":"'6'!V26","v":0},{"$f":"'6(M)'!T26","v":0},643.70000000000005,37,"",""]
[null,null,24,"P","Petržílka","Miloslav","KVZ UVS J.Hradec",{"$f":"'1'!V27","v":207.37},{"$f":"'1(M)'!T27","v":0},{"$f":"'2'!V27","v":300.45},{"$f":"'2(M)'!T27","v":0},{"$f":"'3'!V27","v":261.49},{"$f":"'3(M)'!T27","v":0},{"$f":"'4'!V27","v":0},{"$f":"'4(M)'!T27","v":0},{"$f":"'5'!V27","v":0},{"$f":"'5(M)'!T27","v":0},{"$f":"'6'!V27","v":0},{"$f":"'6(M)'!T27","v":0},769.31,17,"",""]
[null,null,25,"R","Seitl ","Aleš","SSK lavonice",{"$f":"'1'!V28","v":189.8},{"$f":"'1(M)'!T28","v":0},{"$f":"'2'!V28","v":272.8},{"$f":"'2(M)'!T28","v":0},{"$f":"'3'!V28","v":235.38},{"$f":"'3(M)'!T28","v":0},{"$f":"'4'!V28","v":0},{"$f":"'4(M)'!T28","v":0},{"$f":"'5'!V28","v":0},{"$f":"'5(M)'!T28","v":0},{"$f":"'6'!V28","v":0},{"$f":"'6(M)'!T28","v":0},697.98,33,"",""]
[null,null,26,"P","Seitl ","Aleš","SSK lavonice",{"$f":"'1'!V29","v":150.92000000000002},{"$f":"'1(M)'!T29","v":0},{"$f":"'2'!V29","v":221.69},{"$f":"'2(M)'!T29","v":0},{"$f":"'3'!V29","v":195.3},{"$f":"'3(M)'!T29","v":0},{"$f":"'4'!V29","v":0},{"$f":"'4(M)'!T29","v":0},{"$f":"'5'!V29","v":0},{"$f":"'5(M)'!T29","v":0},{"$f":"'6'!V29","v":0},{"$f":"'6(M)'!T29","v":0},567.91000000000008,40,"",""]
[null,null,27,"P","Seitl","Karel","SSK lavonice",{"$f":"'1'!V30","v":194.6},{"$f":"'1(M)'!T30","v":0},{"$f":"'2'!V30","v":280.22000000000003},{"$f":"'2(M)'!T30","v":0},{"$f":"'3'!V30","v":240.15},{"$f":"'3(M)'!T30","v":0},{"$f":"'4'!V30","v":0},{"$f":"'4(M)'!T30","v":0},{"$f":"'5'!V30","v":0},{"$f":"'5(M)'!T30","v":0},{"$f":"'6'!V30","v":0},{"$f":"'6(M)'!T30","v":0},714.97,30,"",""]
[null,null,28,"P","Nikodým","David","KVZ Pelhřimov",{"$f":"'1'!V31","v":251.88},{"$f":"'1(M)'!T31","v":0},{"$f":"'2'!V31","v":311.7},{"$f":"'2(M)'!T31","v":0},{"$f":"'3'!V31","v":249.32},{"$f":"'3(M)'!T31","v":0},{"$f":"'4'!V31","v":0},{"$f":"'4(M)'!T31","v":0},{"$f":"'5'!V31","v":0},{"$f":"'5(M)'!T31","v":0},{"$f":"'6'!V31","v":0},{"$f":"'6(M)'!T31","v":0},812.89999999999986,8,"",""]
[null,null,29,"R","Nikodým ","David","KVZ Pelhřimov",{"$f":"'1'!V32","v":231.07},{"$f":"'1(M)'!T32","v":0},{"$f":"'2'!V32","v":286.10000000000002},{"$f":"'2(M)'!T32","v":0},{"$f":"'3'!V32","v":253.49},{"$f":"'3(M)'!T32","v":0},{"$f":"'4'!V32","v":0},{"$f":"'4(M)'!T32","v":0},{"$f":"'5'!V32","v":0},{"$f":"'5(M)'!T32","v":0},{"$f":"'6'!V32","v":0},{"$f":"'6(M)'!T32","v":0},770.66000000000008,16,"",""]
[null,null,30,"P","Hobza","Lukáš","KVZ Telč",{"$f":"'1'!V33","v":231.56},{"$f":"'1(M)'!T33","v":0},{"$f":"'2'!V33","v":289.79000000000002},{"$f":"'2(M)'!T33","v":0},{"$f":"'3'!V33","v":258.34000000000003},{"$f":"'3(M)'!T33","v":0},{"$f":"'4'!V33","v":0},{"$f":"'4(M)'!T33","v":0},{"$f":"'5'!V33","v":0},{"$f":"'5(M)'!T33","v":0},{"$f":"'6'!V33","v":0},{"$f":"'6(M)'!T33","v":0},779.69,13,"",""]
[null,null,31,"P","Jelínek ","Antonín","KVZ Pelhřimov",{"$f":"'1'!V34","v":173.43},{"$f":"'1(M)'!T34","v":0},{"$f":"'2'!V34","v":288},{"$f":"'2(M)'!T34","v":0},{"$f":"'3'!V34","v":231.74},{"$f":"'3(M)'!T34","v":0},{"$f":"'4'!V34","v":0},{"$f":"'4(M)'!T34","v":0},{"$f":"'5'!V34","v":0},{"$f":"'5(M)'!T34","v":0},{"$f":"'6'!V34","v":0},{"$f":"'6(M)'!T34","v":0},693.17000000000007,34,"",""]
[null,null,32,"R","Jelínek ","Antonín","KVZ Pelhřimov",{"$f":"'1'!V35","v":207.57999999999998},{"$f":"'1(M)'!T35","v":0},{"$f":"'2'!V35","v":304.68},{"$f":"'2(M)'!T35","v":0},{"$f":"'3'!V35","v":246.56},{"$f":"'3(M)'!T35","v":0},{"$f":"'4'!V35","v":0},{"$f":"'4(M)'!T35","v":0},{"$f":"'5'!V35","v":0},{"$f":"'5(M)'!T35","v":0},{"$f":"'6'!V35","v":0},{"$f":"'6(M)'!T35","v":0},758.81999999999994,19,"",""]
[null,null,33,"P","Píša ","Ladislav","KVZ Třebíč",{"$f":"'1'!V36","v":219.32999999999998},{"$f":"'1(M)'!T36","v":0},{"$f":"'2'!V36","v":186.61},{"$f":"'2(M)'!T36","v":0},{"$f":"'3'!V36","v":241.47},{"$f":"'3(M)'!T36","v":0},{"$f":"'4'!V36","v":0},{"$f":"'4(M)'!T36","v":0},{"$f":"'5'!V36","v":0},{"$f":"'5(M)'!T36","v":0},{"$f":"'6'!V36","v":0},{"$f":"'6(M)'!T36","v":0},647.41,36,"",""]
[null,null,34,"P","Mesároš","Štefan","KVZ Fruko J.Hradec",{"$f":"'1'!V37","v":242.25},{"$f":"'1(M)'!T37","v":0},{"$f":"'2'!V37","v":322.92},{"$f":"'2(M)'!T37","v":0},{"$f":"'3'!V37","v":281.7},{"$f":"'3(M)'!T37","v":0},{"$f":"'4'!V37","v":0},{"$f":"'4(M)'!T37","v":0},{"$f":"'5'!V37","v":0},{"$f":"'5(M)'!T37","v":0},{"$f":"'6'!V37","v":0},{"$f":"'6(M)'!T37","v":0},846.87000000000012,4,"",""]
[null,null,35,"P","Červenka","Pavel","KVZ Perlhřimov",{"$f":"'1'!V38","v":242.75},{"$f":"'1(M)'!T38","v":0},{"$f":"'2'!V38","v":326.95},{"$f":"'2(M)'!T38","v":0},{"$f":"'3'!V38","v":268.23},{"$f":"'3(M)'!T38","v":0},{"$f":"'4'!V38","v":0},{"$f":"'4(M)'!T38","v":0},{"$f":"'5'!V38","v":0},{"$f":"'5(M)'!T38","v":0},{"$f":"'6'!V38","v":0},{"$f":"'6(M)'!T38","v":0},{"$f":"IF(SUM(H40:S40)<0,0,SUM(H40:S40))","v":837.93000000000006},5,"",""]
[null,null,36,"R","Červenka ","Pavel","KVZ Perlhřimov",{"$f":"'1'!V39","v":199.4},{"$f":"'1(M)'!T39","v":0},{"$f":"'2'!V39","v":281.83},{"$f":"'2(M)'!T39","v":0},{"$f":"'3'!V39","v":263.29000000000002},{"$f":"'3(M)'!T39","v":0},{"$f":"'4'!V39","v":0},{"$f":"'4(M)'!T39","v":0},{"$f":"'5'!V39","v":0},{"$f":"'5(M)'!T39","v":0},{"$f":"'6'!V39","v":0},{"$f":"'6(M)'!T39","v":0},744.52,24,"",""]
[null,null,37,"P","Švihálek ","Jiří","KVZ Fruko J.Hradec",{"$f":"'1'!V40","v":234.12},{"$f":"'1(M)'!T40","v":0},{"$f":"'2'!V40","v":300.48},{"$f":"'2(M)'!T40","v":0},{"$f":"'3'!V40","v":250.61},{"$f":"'3(M)'!T40","v":0},{"$f":"'4'!V40","v":0},{"$f":"'4(M)'!T40","v":0},{"$f":"'5'!V40","v":0},{"$f":"'5(M)'!T40","v":0},{"$f":"'6'!V40","v":0},{"$f":"'6(M)'!T40","v":0},785.21,12,"",""]
[null,null,38,"R","Švihálek ","Jiří","KVZ Fruko J.Hradec",{"$f":"'1'!V41","v":205.12},{"$f":"'1(M)'!T41","v":0},{"$f":"'2'!V41","v":295.47000000000003},{"$f":"'2(M)'!T41","v":0},{"$f":"'3'!V41","v":249.31},{"$f":"'3(M)'!T41","v":0},{"$f":"'4'!V41","v":0},{"$f":"'4(M)'!T41","v":0},{"$f":"'5'!V41","v":0},{"$f":"'5(M)'!T41","v":0},{"$f":"'6'!V41","v":0},{"$f":"'6(M)'!T41","v":0},749.90000000000009,21,"",""]
[null,null,39,"P","Toman ","František","KVZ Fruko J.Hradec",{"$f":"'1'!V42","v":169.3},{"$f":"'1(M)'!T42","v":0},{"$f":"'2'!V42","v":317.10000000000002},{"$f":"'2(M)'!T42","v":0},{"$f":"'3'!V42","v":240.07999999999998},{"$f":"'3(M)'!T42","v":0},{"$f":"'4'!V42","v":0},{"$f":"'4(M)'!T42","v":0},{"$f":"'5'!V42","v":0},{"$f":"'5(M)'!T42","v":0},{"$f":"'6'!V42","v":0},{"$f":"'6(M)'!T42","v":0},726.48,28,"",""]
[null,null,40,"P","VejslíK ","Vladimír","KVZ Fruko J.Hradec",{"$f":"'1'!V43","v":253.31},{"$f":"'1(M)'!T43","v":0},{"$f":"'2'!V43","v":328.19},{"$f":"'2(M)'!T43","v":0},{"$f":"'3'!V43","v":270.95999999999998},{"$f":"'3(M)'!T43","v":0},{"$f":"'4'!V43","v":0},{"$f":"'4(M)'!T43","v":0},{"$f":"'5'!V43","v":0},{"$f":"'5(M)'!T43","v":0},{"$f":"'6'!V43","v":0},{"$f":"'6(M)'!T43","v":0},852.46,3,"",""]
[null,null,41,"P","Získal ","Karel","KVZ Pelhřimov",{"$f":"'1'!V44","v":215.02},{"$f":"'1(M)'!T44","v":0},{"$f":"'2'!V44","v":312.35000000000002},{"$f":"'2(M)'!T44","v":0},{"$f":"'3'!V44","v":251.39},{"$f":"'3(M)'!T44","v":0},{"$f":"'4'!V44","v":0},{"$f":"'4(M)'!T44","v":0},{"$f":"'5'!V44","v":0},{"$f":"'5(M)'!T44","v":0},{"$f":"'6'!V44","v":0},{"$f":"'6(M)'!T44","v":0},778.76,14,"",""]
[null,null,42,"R","Získal ","Karel","KVZ Pelhřimov",{"$f":"'1'!V45","v":181.9},{"$f":"'1(M)'!T45","v":0},{"$f":"'2'!V45","v":245},{"$f":"'2(M)'!T45","v":0},{"$f":"'3'!V45","v":155.6},{"$f":"'3(M)'!T45","v":0},{"$f":"'4'!V45","v":0},{"$f":"'4(M)'!T45","v":0},{"$f":"'5'!V45","v":0},{"$f":"'5(M)'!T45","v":0},{"$f":"'6'!V45","v":0},{"$f":"'6(M)'!T45","v":0},582.5,39,"",""]
[null,null,43,"P","Sokolík ","Jaroslav","KVZ Fruko J.Hradec",{"$f":"'1'!V46","v":239.99},{"$f":"'1(M)'!T46","v":0},{"$f":"'2'!V46","v":332.53},{"$f":"'2(M)'!T46","v":0},{"$f":"'3'!V46","v":289.62},{"$f":"'3(M)'!T46","v":0},{"$f":"'4'!V46","v":0},{"$f":"'4(M)'!T46","v":0},{"$f":"'5'!V46","v":0},{"$f":"'5(M)'!T46","v":0},{"$f":"'6'!V46","v":0},{"$f":"'6(M)'!T46","v":0},862.14,1,"",""]
[null,null,44,"P","Kraus ","Milan","KVZ Týn n Vltavou",{"$f":"'1'!V47","v":237.91},{"$f":"'1(M)'!T47","v":0},{"$f":"'2'!V47","v":310.47000000000003},{"$f":"'2(M)'!T47","v":0},{"$f":"'3'!V47","v":261.14},{"$f":"'3(M)'!T47","v":0},{"$f":"'4'!V47","v":0},{"$f":"'4(M)'!T47","v":0},{"$f":"'5'!V47","v":0},{"$f":"'5(M)'!T47","v":0},{"$f":"'6'!V47","v":0},{"$f":"'6(M)'!T47","v":0},809.52,9,"",""]
[null,null,45,"P",null,null,null,{"$f":"'1'!V48","v":0},{"$f":"'1(M)'!T48","v":0},{"$f":"'2'!V48","v":0},{"$f":"'2(M)'!T48","v":0},{"$f":"'3'!V48","v":0},{"$f":"'3(M)'!T48","v":0},{"$f":"'4'!V48","v":0},{"$f":"'4(M)'!T48","v":0},{"$f":"'5'!V48","v":0},{"$f":"'5(M)'!T48","v":0},{"$f":"'6'!V48","v":0},{"$f":"'6(M)'!T48","v":0},0,45,"",""]
[null,null,46,"P",null,null,null,{"$f":"'1'!V49","v":0},{"$f":"'1(M)'!T49","v":0},{"$f":"'2'!V49","v":0},{"$f":"'2(M)'!T49","v":0},{"$f":"'3'!V49","v":0},{"$f":"'3(M)'!T49","v":0},{"$f":"'4'!V49","v":0},{"$f":"'4(M)'!T49","v":0},{"$f":"'5'!V49","v":0},{"$f":"'5(M)'!T49","v":0},{"$f":"'6'!V49","v":0},{"$f":"'6(M)'!T49","v":0},0,45,"",""]
[null,null,47,"P",null,null,null,{"$f":"'1'!V50","v":0},{"$f":"'1(M)'!T50","v":0},{"$f":"'2'!V50","v":0},{"$f":"'2(M)'!T50","v":0},{"$f":"'3'!V50","v":0},{"$f":"'3(M)'!T50","v":0},{"$f":"'4'!V50","v":0},{"$f":"'4(M)'!T50","v":0},{"$f":"'5'!V50","v":0},{"$f":"'5(M)'!T50","v":0},{"$f":"'6'!V50","v":0},{"$f":"'6(M)'!T50","v":0},0,45,"",""]
[null,null,48,"P",null,null,null,{"$f":"'1'!V51","v":0},{"$f":"'1(M)'!T51","v":0},{"$f":"'2'!V51","v":0},{"$f":"'2(M)'!T51","v":0},{"$f":"'3'!V51","v":0},{"$f":"'3(M)'!T51","v":0},{"$f":"'4'!V51","v":0},{"$f":"'4(M)'!T51","v":0},{"$f":"'5'!V51","v":0},{"$f":"'5(M)'!T51","v":0},{"$f":"'6'!V51","v":0},{"$f":"'6(M)'!T51","v":0},0,45,"",""]
[null,null,49,"P",null,null,null,{"$f":"'1'!V52","v":0},{"$f":"'1(M)'!T52","v":0},{"$f":"'2'!V52","v":0},{"$f":"'2(M)'!T52","v":0},{"$f":"'3'!V52","v":0},{"$f":"'3(M)'!T52","v":0},{"$f":"'4'!V52","v":0},{"$f":"'4(M)'!T52","v":0},{"$f":"'5'!V52","v":0},{"$f":"'5(M)'!T52","v":0},{"$f":"'6'!V52","v":0},{"$f":"'6(M)'!T52","v":0},0,45,"",""]
[null,null,50,"P",null,null,null,{"$f":"'1'!V53","v":0},{"$f":"'1(M)'!T53","v":0},{"$f":"'2'!V53","v":0},{"$f":"'2(M)'!T53","v":0},{"$f":"'3'!V53","v":0},{"$f":"'3(M)'!T53","v":0},{"$f":"'4'!V53","v":0},{"$f":"'4(M)'!T53","v":0},{"$f":"'5'!V53","v":0},{"$f":"'5(M)'!T53","v":0},{"$f":"'6'!V53","v":0},{"$f":"'6(M)'!T53","v":0},0,45,"",""]
[null,null,51,"P",null,null,null,{"$f":"'1'!V54","v":0},{"$f":"'1(M)'!T54","v":0},{"$f":"'2'!V54","v":0},{"$f":"'2(M)'!T54","v":0},{"$f":"'3'!V54","v":0},{"$f":"'3(M)'!T54","v":0},{"$f":"'4'!V54","v":0},{"$f":"'4(M)'!T54","v":0},{"$f":"'5'!V54","v":0},{"$f":"'5(M)'!T54","v":0},{"$f":"'6'!V54","v":0},{"$f":"'6(M)'!T54","v":0},0,45,"",""]
[null,null,52,"P",null,null,null,{"$f":"'1'!V55","v":0},{"$f":"'1(M)'!T55","v":0},{"$f":"'2'!V55","v":0},{"$f":"'2(M)'!T55","v":0},{"$f":"'3'!V55","v":0},{"$f":"'3(M)'!T55","v":0},{"$f":"'4'!V55","v":0},{"$f":"'4(M)'!T55","v":0},{"$f":"'5'!V55","v":0},{"$f":"'5(M)'!T55","v":0},{"$f":"'6'!V55","v":0},{"$f":"'6(M)'!T55","v":0},0,45,"",""]
[null,null,53,"P",null,null,null,{"$f":"'1'!V56","v":0},{"$f":"'1(M)'!T56","v":0},{"$f":"'2'!V56","v":0},{"$f":"'2(M)'!T56","v":0},{"$f":"'3'!V56","v":0},{"$f":"'3(M)'!T56","v":0},{"$f":"'4'!V56","v":0},{"$f":"'4(M)'!T56","v":0},{"$f":"'5'!V56","v":0},{"$f":"'5(M)'!T56","v":0},{"$f":"'6'!V56","v":0},{"$f":"'6(M)'!T56","v":0},0,45,"",""]
[null,null,54,"P",null,null,null,{"$f":"'1'!V57","v":0},{"$f":"'1(M)'!T57","v":0},{"$f":"'2'!V57","v":0},{"$f":"'2(M)'!T57","v":0},{"$f":"'3'!V57","v":0},{"$f":"'3(M)'!T57","v":0},{"$f":"'4'!V57","v":0},{"$f":"'4(M)'!T57","v":0},{"$f":"'5'!V57","v":0},{"$f":"'5(M)'!T57","v":0},{"$f":"'6'!V57","v":0},{"$f":"'6(M)'!T57","v":0},0,45,"",""]
[null,null,55,"P",null,null,null,{"$f":"'1'!V58","v":0},{"$f":"'1(M)'!T58","v":0},{"$f":"'2'!V58","v":0},{"$f":"'2(M)'!T58","v":0},{"$f":"'3'!V58","v":0},{"$f":"'3(M)'!T58","v":0},{"$f":"'4'!V58","v":0},{"$f":"'4(M)'!T58","v":0},{"$f":"'5'!V58","v":0},{"$f":"'5(M)'!T58","v":0},{"$f":"'6'!V58","v":0},{"$f":"'6(M)'!T58","v":0},0,45,"",""]
[null,null,56,"P",null,null,null,{"$f":"'1'!V59","v":0},{"$f":"'1(M)'!T59","v":0},{"$f":"'2'!V59","v":0},{"$f":"'2(M)'!T59","v":0},{"$f":"'3'!V59","v":0},{"$f":"'3(M)'!T59","v":0},{"$f":"'4'!V59","v":0},{"$f":"'4(M)'!T59","v":0},{"$f":"'5'!V59","v":0},{"$f":"'5(M)'!T59","v":0},{"$f":"'6'!V59","v":0},{"$f":"'6(M)'!T59","v":0},0,45,"",""]
[null,null,57,"P",null,null,null,{"$f":"'1'!V60","v":0},{"$f":"'1(M)'!T60","v":0},{"$f":"'2'!V60","v":0},{"$f":"'2(M)'!T60","v":0},{"$f":"'3'!V60","v":0},{"$f":"'3(M)'!T60","v":0},{"$f":"'4'!V60","v":0},{"$f":"'4(M)'!T60","v":0},{"$f":"'5'!V60","v":0},{"$f":"'5(M)'!T60","v":0},{"$f":"'6'!V60","v":0},{"$f":"'6(M)'!T60","v":0},0,45,"",""]
[null,null,58,"P",null,null,null,{"$f":"'1'!V61","v":0},{"$f":"'1(M)'!T61","v":0},{"$f":"'2'!V61","v":0},{"$f":"'2(M)'!T61","v":0},{"$f":"'3'!V61","v":0},{"$f":"'3(M)'!T61","v":0},{"$f":"'4'!V61","v":0},{"$f":"'4(M)'!T61","v":0},{"$f":"'5'!V61","v":0},{"$f":"'5(M)'!T61","v":0},{"$f":"'6'!V61","v":0},{"$f":"'6(M)'!T61","v":0},0,45,"",""]
[null,null,59,"P",null,null,null,{"$f":"'1'!V62","v":0},{"$f":"'1(M)'!T62","v":0},{"$f":"'2'!V62","v":0},{"$f":"'2(M)'!T62","v":0},{"$f":"'3'!V62","v":0},{"$f":"'3(M)'!T62","v":0},{"$f":"'4'!V62","v":0},{"$f":"'4(M)'!T62","v":0},{"$f":"'5'!V62","v":0},{"$f":"'5(M)'!T62","v":0},{"$f":"'6'!V62","v":0},{"$f":"'6(M)'!T62","v":0},0,45,"",""]
[null,null,60,"P",null,null,null,{"$f":"'1'!V63","v":0},{"$f":"'1(M)'!T63","v":0},{"$f":"'2'!V63","v":0},{"$f":"'2(M)'!T63","v":0},{"$f":"'3'!V63","v":0},{"$f":"'3(M)'!T63","v":0},{"$f":"'4'!V63","v":0},{"$f":"'4(M)'!T63","v":0},{"$f":"'5'!V63","v":0},{"$f":"'5(M)'!T63","v":0},{"$f":"'6'!V63","v":0},{"$f":"'6(M)'!T63","v":0},0,45,"",""]
[null,null,61,"P",null,null,null,{"$f":"'1'!V64","v":0},{"$f":"'1(M)'!T64","v":0},{"$f":"'2'!V64","v":0},{"$f":"'2(M)'!T64","v":0},{"$f":"'3'!V64","v":0},{"$f":"'3(M)'!T64","v":0},{"$f":"'4'!V64","v":0},{"$f":"'4(M)'!T64","v":0},{"$f":"'5'!V64","v":0},{"$f":"'5(M)'!T64","v":0},{"$f":"'6'!V64","v":0},{"$f":"'6(M)'!T64","v":0},0,45,"",""]
[null,null,62,"P",null,null,null,{"$f":"'1'!V65","v":0},{"$f":"'1(M)'!T65","v":0},{"$f":"'2'!V65","v":0},{"$f":"'2(M)'!T65","v":0},{"$f":"'3'!V65","v":0},{"$f":"'3(M)'!T65","v":0},{"$f":"'4'!V65","v":0},{"$f":"'4(M)'!T65","v":0},{"$f":"'5'!V65","v":0},{"$f":"'5(M)'!T65","v":0},{"$f":"'6'!V65","v":0},{"$f":"'6(M)'!T65","v":0},0,45,"",""]
[null,null,63,"P",null,null,null,{"$f":"'1'!V66","v":0},{"$f":"'1(M)'!T66","v":0},{"$f":"'2'!V66","v":0},{"$f":"'2(M)'!T66","v":0},{"$f":"'3'!V66","v":0},{"$f":"'3(M)'!T66","v":0},{"$f":"'4'!V66","v":0},{"$f":"'4(M)'!T66","v":0},{"$f":"'5'!V66","v":0},{"$f":"'5(M)'!T66","v":0},{"$f":"'6'!V66","v":0},{"$f":"'6(M)'!T66","v":0},0,45,"",""]
[null,null,64,"P",null,null,null,{"$f":"'1'!V67","v":0},{"$f":"'1(M)'!T67","v":0},{"$f":"'2'!V67","v":0},{"$f":"'2(M)'!T67","v":0},{"$f":"'3'!V67","v":0},{"$f":"'3(M)'!T67","v":0},{"$f":"'4'!V67","v":0},{"$f":"'4(M)'!T67","v":0},{"$f":"'5'!V67","v":0},{"$f":"'5(M)'!T67","v":0},{"$f":"'6'!V67","v":0},{"$f":"'6(M)'!T67","v":0},0,45,"",""]
[null,null,65,"P",null,null,null,{"$f":"'1'!V68","v":0},{"$f":"'1(M)'!T68","v":0},{"$f":"'2'!V68","v":0},{"$f":"'2(M)'!T68","v":0},{"$f":"'3'!V68","v":0},{"$f":"'3(M)'!T68","v":0},{"$f":"'4'!V68","v":0},{"$f":"'4(M)'!T68","v":0},{"$f":"'5'!V68","v":0},{"$f":"'5(M)'!T68","v":0},{"$f":"'6'!V68","v":0},{"$f":"'6(M)'!T68","v":0},0,45,"",""]
[null,null,66,"P",null,null,null,{"$f":"'1'!V69","v":0},{"$f":"'1(M)'!T69","v":0},{"$f":"'2'!V69","v":0},{"$f":"'2(M)'!T69","v":0},{"$f":"'3'!V69","v":0},{"$f":"'3(M)'!T69","v":0},{"$f":"'4'!V69","v":0},{"$f":"'4(M)'!T69","v":0},{"$f":"'5'!V69","v":0},{"$f":"'5(M)'!T69","v":0},{"$f":"'6'!V69","v":0},{"$f":"'6(M)'!T69","v":0},0,{"$f":"RANK(T71,$T$6:$T$104)","v":45},{"$f":"IF($B71=\"K\",SUMIFS($T$6:$T$104,$A$6:$A$104,A71),\"\")","v":""},{"$f":"IF($B71=\"K\",RANK(V71,$V$6:$V$104),\"\")","v":""}]
[null,null,67,"P",null,null,null,{"$f":"'1'!V70","v":0},{"$f":"'1(M)'!T70","v":0},{"$f":"'2'!V70","v":0},{"$f":"'2(M)'!T70","v":0},{"$f":"'3'!V70","v":0},{"$f":"'3(M)'!T70","v":0},{"$f":"'4'!V70","v":0},{"$f":"'4(M)'!T70","v":0},{"$f":"'5'!V70","v":0},{"$f":"'5(M)'!T70","v":0},{"$f":"'6'!V70","v":0},{"$f":"'6(M)'!T70","v":0},0,45,"",""]
[null,null,68,"P",null,null,null,{"$f":"'1'!V71","v":0},{"$f":"'1(M)'!T71","v":0},{"$f":"'2'!V71","v":0},{"$f":"'2(M)'!T71","v":0},{"$f":"'3'!V71","v":0},{"$f":"'3(M)'!T71","v":0},{"$f":"'4'!V71","v":0},{"$f":"'4(M)'!T71","v":0},{"$f":"'5'!V71","v":0},{"$f":"'5(M)'!T71","v":0},{"$f":"'6'!V71","v":0},{"$f":"'6(M)'!T71","v":0},0,45,"",""]
[null,null,69,"P",null,null,null,{"$f":"'1'!V72","v":0},{"$f":"'1(M)'!T72","v":0},{"$f":"'2'!V72","v":0},{"$f":"'2(M)'!T72","v":0},{"$f":"'3'!V72","v":0},{"$f":"'3(M)'!T72","v":0},{"$f":"'4'!V72","v":0},{"$f":"'4(M)'!T72","v":0},{"$f":"'5'!V72","v":0},{"$f":"'5(M)'!T72","v":0},{"$f":"'6'!V72","v":0},{"$f":"'6(M)'!T72","v":0},0,45,"",""]
[null,null,70,"P",null,null,null,{"$f":"'1'!V73","v":0},{"$f":"'1(M)'!T73","v":0},{"$f":"'2'!V73","v":0},{"$f":"'2(M)'!T73","v":0},{"$f":"'3'!V73","v":0},{"$f":"'3(M)'!T73","v":0},{"$f":"'4'!V73","v":0},{"$f":"'4(M)'!T73","v":0},{"$f":"'5'!V73","v":0},{"$f":"'5(M)'!T73","v":0},{"$f":"'6'!V73","v":0},{"$f":"'6(M)'!T73","v":0},0,45,"",""]
[null,null,71,"P",null,null,null,{"$f":"'1'!V74","v":0},{"$f":"'1(M)'!T74","v":0},{"$f":"'2'!V74","v":0},{"$f":"'2(M)'!T74","v":0},{"$f":"'3'!V74","v":0},{"$f":"'3(M)'!T74","v":0},{"$f":"'4'!V74","v":0},{"$f":"'4(M)'!T74","v":0},{"$f":"'5'!V74","v":0},{"$f":"'5(M)'!T74","v":0},{"$f":"'6'!V74","v":0},{"$f":"'6(M)'!T74","v":0},0,45,"",""]
[null,null,72,"P",null,null,null,{"$f":"'1'!V75","v":0},{"$f":"'1(M)'!T75","v":0},{"$f":"'2'!V75","v":0},{"$f":"'2(M)'!T75","v":0},{"$f":"'3'!V75","v":0},{"$f":"'3(M)'!T75","v":0},{"$f":"'4'!V75","v":0},{"$f":"'4(M)'!T75","v":0},{"$f":"'5'!V75","v":0},{"$f":"'5(M)'!T75","v":0},{"$f":"'6'!V75","v":0},{"$f":"'6(M)'!T75","v":0},0,45,"",""]
[null,null,73,"P",null,null,null,{"$f":"'1'!V76","v":0},{"$f":"'1(M)'!T76","v":0},{"$f":"'2'!V76","v":0},{"$f":"'2(M)'!T76","v":0},{"$f":"'3'!V76","v":0},{"$f":"'3(M)'!T76","v":0},{"$f":"'4'!V76","v":0},{"$f":"'4(M)'!T76","v":0},{"$f":"'5'!V76","v":0},{"$f":"'5(M)'!T76","v":0},{"$f":"'6'!V76","v":0},{"$f":"'6(M)'!T76","v":0},0,45,"",""]
[null,null,74,"P",null,null,null,{"$f":"'1'!V77","v":0},{"$f":"'1(M)'!T77","v":0},{"$f":"'2'!V77","v":0},{"$f":"'2(M)'!T77","v":0},{"$f":"'3'!V77","v":0},{"$f":"'3(M)'!T77","v":0},{"$f":"'4'!V77","v":0},{"$f":"'4(M)'!T77","v":0},{"$f":"'5'!V77","v":0},{"$f":"'5(M)'!T77","v":0},{"$f":"'6'!V77","v":0},{"$f":"'6(M)'!T77","v":0},0,45,"",""]
[null,null,75,"P",null,null,null,{"$f":"'1'!V78","v":0},{"$f":"'1(M)'!T78","v":0},{"$f":"'2'!V78","v":0},{"$f":"'2(M)'!T78","v":0},{"$f":"'3'!V78","v":0},{"$f":"'3(M)'!T78","v":0},{"$f":"'4'!V78","v":0},{"$f":"'4(M)'!T78","v":0},{"$f":"'5'!V78","v":0},{"$f":"'5(M)'!T78","v":0},{"$f":"'6'!V78","v":0},{"$f":"'6(M)'!T78","v":0},0,45,"",""]
[null,null,76,"P",null,null,null,{"$f":"'1'!V79","v":0},{"$f":"'1(M)'!T79","v":0},{"$f":"'2'!V79","v":0},{"$f":"'2(M)'!T79","v":0},{"$f":"'3'!V79","v":0},{"$f":"'3(M)'!T79","v":0},{"$f":"'4'!V79","v":0},{"$f":"'4(M)'!T79","v":0},{"$f":"'5'!V79","v":0},{"$f":"'5(M)'!T79","v":0},{"$f":"'6'!V79","v":0},{"$f":"'6(M)'!T79","v":0},0,45,"",""]
[null,null,77,"P",null,null,null,{"$f":"'1'!V80","v":0},{"$f":"'1(M)'!T80","v":0},{"$f":"'2'!V80","v":0},{"$f":"'2(M)'!T80","v":0},{"$f":"'3'!V80","v":0},{"$f":"'3(M)'!T80","v":0},{"$f":"'4'!V80","v":0},{"$f":"'4(M)'!T80","v":0},{"$f":"'5'!V80","v":0},{"$f":"'5(M)'!T80","v":0},{"$f":"'6'!V80","v":0},{"$f":"'6(M)'!T80","v":0},0,45,"",""]
[null,null,78,"P",null,null,null,{"$f":"'1'!V81","v":0},{"$f":"'1(M)'!T81","v":0},{"$f":"'2'!V81","v":0},{"$f":"'2(M)'!T81","v":0},{"$f":"'3'!V81","v":0},{"$f":"'3(M)'!T81","v":0},{"$f":"'4'!V81","v":0},{"$f":"'4(M)'!T81","v":0},{"$f":"'5'!V81","v":0},{"$f":"'5(M)'!T81","v":0},{"$f":"'6'!V81","v":0},{"$f":"'6(M)'!T81","v":0},0,45,"",""]
[null,null,79,"P",null,null,null,{"$f":"'1'!V82","v":0},{"$f":"'1(M)'!T82","v":0},{"$f":"'2'!V82","v":0},{"$f":"'2(M)'!T82","v":0},{"$f":"'3'!V82","v":0},{"$f":"'3(M)'!T82","v":0},{"$f":"'4'!V82","v":0},{"$f":"'4(M)'!T82","v":0},{"$f":"'5'!V82","v":0},{"$f":"'5(M)'!T82","v":0},{"$f":"'6'!V82","v":0},{"$f":"'6(M)'!T82","v":0},0,45,"",""]
[null,null,80,"P",null,null,null,{"$f":"'1'!V83","v":0},{"$f":"'1(M)'!T83","v":0},{"$f":"'2'!V83","v":0},{"$f":"'2(M)'!T83","v":0},{"$f":"'3'!V83","v":0},{"$f":"'3(M)'!T83","v":0},{"$f":"'4'!V83","v":0},{"$f":"'4(M)'!T83","v":0},{"$f":"'5'!V83","v":0},{"$f":"'5(M)'!T83","v":0},{"$f":"'6'!V83","v":0},{"$f":"'6(M)'!T83","v":0},0,45,"",""]
[null,null,81,"P",null,null,null,{"$f":"'1'!V84","v":0},{"$f":"'1(M)'!T84","v":0},{"$f":"'2'!V84","v":0},{"$f":"'2(M)'!T84","v":0},{"$f":"'3'!V84","v":0},{"$f":"'3(M)'!T84","v":0},{"$f":"'4'!V84","v":0},{"$f":"'4(M)'!T84","v":0},{"$f":"'5'!V84","v":0},{"$f":"'5(M)'!T84","v":0},{"$f":"'6'!V84","v":0},{"$f":"'6(M)'!T84","v":0},0,45,"",""]
[null,null,82,"P",null,null,null,{"$f":"'1'!V85","v":0},{"$f":"'1(M)'!T85","v":0},{"$f":"'2'!V85","v":0},{"$f":"'2(M)'!T85","v":0},{"$f":"'3'!V85","v":0},{"$f":"'3(M)'!T85","v":0},{"$f":"'4'!V85","v":0},{"$f":"'4(M)'!T85","v":0},{"$f":"'5'!V85","v":0},{"$f":"'5(M)'!T85","v":0},{"$f":"'6'!V85","v":0},{"$f":"'6(M)'!T85","v":0},0,45,"",""]
[null,null,83,"P",null,null,null,{"$f":"'1'!V86","v":0},{"$f":"'1(M)'!T86","v":0},{"$f":"'2'!V86","v":0},{"$f":"'2(M)'!T86","v":0},{"$f":"'3'!V86","v":0},{"$f":"'3(M)'!T86","v":0},{"$f":"'4'!V86","v":0},{"$f":"'4(M)'!T86","v":0},{"$f":"'5'!V86","v":0},{"$f":"'5(M)'!T86","v":0},{"$f":"'6'!V86","v":0},{"$f":"'6(M)'!T86","v":0},0,45,"",""]
[null,null,84,"P",null,null,null,{"$f":"'1'!V87","v":0},{"$f":"'1(M)'!T87","v":0},{"$f":"'2'!V87","v":0},{"$f":"'2(M)'!T87","v":0},{"$f":"'3'!V87","v":0},{"$f":"'3(M)'!T87","v":0},{"$f":"'4'!V87","v":0},{"$f":"'4(M)'!T87","v":0},{"$f":"'5'!V87","v":0},{"$f":"'5(M)'!T87","v":0},{"$f":"'6'!V87","v":0},{"$f":"'6(M)'!T87","v":0},0,45,"",""]
[null,null,85,"P",null,null,null,{"$f":"'1'!V88","v":0},{"$f":"'1(M)'!T88","v":0},{"$f":"'2'!V88","v":0},{"$f":"'2(M)'!T88","v":0},{"$f":"'3'!V88","v":0},{"$f":"'3(M)'!T88","v":0},{"$f":"'4'!V88","v":0},{"$f":"'4(M)'!T88","v":0},{"$f":"'5'!V88","v":0},{"$f":"'5(M)'!T88","v":0},{"$f":"'6'!V88","v":0},{"$f":"'6(M)'!T88","v":0},0,45,"",""]
[null,null,86,"P",null,null,null,{"$f":"'1'!V89","v":0},{"$f":"'1(M)'!T89","v":0},{"$f":"'2'!V89","v":0},{"$f":"'2(M)'!T89","v":0},{"$f":"'3'!V89","v":0},{"$f":"'3(M)'!T89","v":0},{"$f":"'4'!V89","v":0},{"$f":"'4(M)'!T89","v":0},{"$f":"'5'!V89","v":0},{"$f":"'5(M)'!T89","v":0},{"$f":"'6'!V89","v":0},{"$f":"'6(M)'!T89","v":0},0,45,"",""]
[null,null,87,"P",null,null,null,{"$f":"'1'!V90","v":0},{"$f":"'1(M)'!T90","v":0},{"$f":"'2'!V90","v":0},{"$f":"'2(M)'!T90","v":0},{"$f":"'3'!V90","v":0},{"$f":"'3(M)'!T90","v":0},{"$f":"'4'!V90","v":0},{"$f":"'4(M)'!T90","v":0},{"$f":"'5'!V90","v":0},{"$f":"'5(M)'!T90","v":0},{"$f":"'6'!V90","v":0},{"$f":"'6(M)'!T90","v":0},0,45,"",""]
[null,null,88,"P",null,null,null,{"$f":"'1'!V91","v":0},{"$f":"'1(M)'!T91","v":0},{"$f":"'2'!V91","v":0},{"$f":"'2(M)'!T91","v":0},{"$f":"'3'!V91","v":0},{"$f":"'3(M)'!T91","v":0},{"$f":"'4'!V91","v":0},{"$f":"'4(M)'!T91","v":0},{"$f":"'5'!V91","v":0},{"$f":"'5(M)'!T91","v":0},{"$f":"'6'!V91","v":0},{"$f":"'6(M)'!T91","v":0},0,45,"",""]
[null,null,89,"P",null,null,null,{"$f":"'1'!V92","v":0},{"$f":"'1(M)'!T92","v":0},{"$f":"'2'!V92","v":0},{"$f":"'2(M)'!T92","v":0},{"$f":"'3'!V92","v":0},{"$f":"'3(M)'!T92","v":0},{"$f":"'4'!V92","v":0},{"$f":"'4(M)'!T92","v":0},{"$f":"'5'!V92","v":0},{"$f":"'5(M)'!T92","v":0},{"$f":"'6'!V92","v":0},{"$f":"'6(M)'!T92","v":0},0,45,"",""]
[null,null,90,"P",null,null,null,{"$f":"'1'!V93","v":0},{"$f":"'1(M)'!T93","v":0},{"$f":"'2'!V93","v":0},{"$f":"'2(M)'!T93","v":0},{"$f":"'3'!V93","v":0},{"$f":"'3(M)'!T93","v":0},{"$f":"'4'!V93","v":0},{"$f":"'4(M)'!T93","v":0},{"$f":"'5'!V93","v":0},{"$f":"'5(M)'!T93","v":0},{"$f":"'6'!V93","v":0},{"$f":"'6(M)'!T93","v":0},0,45,"",""]
[null,null,91,"P",null,null,null,{"$f":"'1'!V94","v":0},{"$f":"'1(M)'!T94","v":0},{"$f":"'2'!V94","v":0},{"$f":"'2(M)'!T94","v":0},{"$f":"'3'!V94","v":0},{"$f":"'3(M)'!T94","v":0},{"$f":"'4'!V94","v":0},{"$f":"'4(M)'!T94","v":0},{"$f":"'5'!V94","v":0},{"$f":"'5(M)'!T94","v":0},{"$f":"'6'!V94","v":0},{"$f":"'6(M)'!T94","v":0},0,45,"",""]
[null,null,92,"P",null,null,null,{"$f":"'1'!V95","v":0},{"$f":"'1(M)'!T95","v":0},{"$f":"'2'!V95","v":0},{"$f":"'2(M)'!T95","v":0},{"$f":"'3'!V95","v":0},{"$f":"'3(M)'!T95","v":0},{"$f":"'4'!V95","v":0},{"$f":"'4(M)'!T95","v":0},{"$f":"'5'!V95","v":0},{"$f":"'5(M)'!T95","v":0},{"$f":"'6'!V95","v":0},{"$f":"'6(M)'!T95","v":0},0,45,"",""]
[null,null,93,"P",null,null,null,{"$f":"'1'!V96","v":0},{"$f":"'1(M)'!T96","v":0},{"$f":"'2'!V96","v":0},{"$f":"'2(M)'!T96","v":0},{"$f":"'3'!V96","v":0},{"$f":"'3(M)'!T96","v":0},{"$f":"'4'!V96","v":0},{"$f":"'4(M)'!T96","v":0},{"$f":"'5'!V96","v":0},{"$f":"'5(M)'!T96","v":0},{"$f":"'6'!V96","v":0},{"$f":"'6(M)'!T96","v":0},0,45,"",""]
[null,null,94,"P",null,null,null,{"$f":"'1'!V97","v":0},{"$f":"'1(M)'!T97","v":0},{"$f":"'2'!V97","v":0},{"$f":"'2(M)'!T97","v":0},{"$f":"'3'!V97","v":0},{"$f":"'3(M)'!T97","v":0},{"$f":"'4'!V97","v":0},{"$f":"'4(M)'!T97","v":0},{"$f":"'5'!V97","v":0},{"$f":"'5(M)'!T97","v":0},{"$f":"'6'!V97","v":0},{"$f":"'6(M)'!T97","v":0},0,45,"",""]
[null,null,95,"P",null,null,null,{"$f":"'1'!V98","v":0},{"$f":"'1(M)'!T98","v":0},{"$f":"'2'!V98","v":0},{"$f":"'2(M)'!T98","v":0},{"$f":"'3'!V98","v":0},{"$f":"'3(M)'!T98","v":0},{"$f":"'4'!V98","v":0},{"$f":"'4(M)'!T98","v":0},{"$f":"'5'!V98","v":0},{"$f":"'5(M)'!T98","v":0},{"$f":"'6'!V98","v":0},{"$f":"'6(M)'!T98","v":0},0,45,"",""]
[null,null,96,"P",null,null,null,{"$f":"'1'!V99","v":0},{"$f":"'1(M)'!T99","v":0},{"$f":"'2'!V99","v":0},{"$f":"'2(M)'!T99","v":0},{"$f":"'3'!V99","v":0},{"$f":"'3(M)'!T99","v":0},{"$f":"'4'!V99","v":0},{"$f":"'4(M)'!T99","v":0},{"$f":"'5'!V99","v":0},{"$f":"'5(M)'!T99","v":0},{"$f":"'6'!V99","v":0},{"$f":"'6(M)'!T99","v":0},0,45,"",""]
[null,null,97,"P",null,null,null,{"$f":"'1'!V100","v":0},{"$f":"'1(M)'!T100","v":0},{"$f":"'2'!V100","v":0},{"$f":"'2(M)'!T100","v":0},{"$f":"'3'!V100","v":0},{"$f":"'3(M)'!T100","v":0},{"$f":"'4'!V100","v":0},{"$f":"'4(M)'!T100","v":0},{"$f":"'5'!V100","v":0},{"$f":"'5(M)'!T100","v":0},{"$f":"'6'!V100","v":0},{"$f":"'6(M)'!T100","v":0},0,45,"",""]
[null,null,98,"P",null,null,null,{"$f":"'1'!V101","v":0},{"$f":"'1(M)'!T101","v":0},{"$f":"'2'!V101","v":0},{"$f":"'2(M)'!T101","v":0},{"$f":"'3'!V101","v":0},{"$f":"'3(M)'!T101","v":0},{"$f":"'4'!V101","v":0},{"$f":"'4(M)'!T101","v":0},{"$f":"'5'!V101","v":0},{"$f":"'5(M)'!T101","v":0},{"$f":"'6'!V101","v":0},{"$f":"'6(M)'!T101","v":0},0,45,"",""]
[null,null,99,"P",null,null,null,{"$f":"'1'!V102","v":0},{"$f":"'1(M)'!T102","v":0},{"$f":"'2'!V102","v":0},{"$f":"'2(M)'!T102","v":0},{"$f":"'3'!V102","v":0},{"$f":"'3(M)'!T102","v":0},{"$f":"'4'!V102","v":0},{"$f":"'4(M)'!T102","v":0},{"$f":"'5'!V102","v":0},{"$f":"'5(M)'!T102","v":0},{"$f":"'6'!V102","v":0},{"$f":"'6(M)'!T102","v":0},{"$f":"IF(SUM(H104:S104)<0,0,SUM(H104:S104))","v":0},45,"",""]

{"sheet":"1","index":2,"n_rows":102,"n_cols":22,"rows_kept":102,"cut":false,"hidden":false,"merged":[[0,3,0,20],[0,0,2,0],[0,1,2,1]]}
["Druž.","Kap.",null,"Disciplina 1"]
[]
[null,null,null,null,null,"K","M",1,2,3,4,5,6,7,8,9,10,11,12,"TB","Čas","Součet"]
[{"$f":"IF(Prezentace!A6=0,\"\",Prezentace!A6)","v":""},{"$f":"IF(Prezentace!B6=0,\"\",Prezentace!B6)","v":""},{"$f":"Prezentace!D6","v":"P"},{"$f":"IF(Prezentace!F6=0,\"\",Prezentace!F6)","v":"Martin"},{"$f":"IF(Prezentace!E6=0,\"\",Prezentace!E6)","v":"Adensam "},300,null,null,null,null,null,null,null,null,null,null,null,null,null,null,70.11,{"$f":"(SUM(F4:T4))-U4","v":229.89}]
[{"$f":"IF(Prezentace!A7=0,\"\",Prezentace!A7)","v":""},{"$f":"IF(Prezentace!B7=0,\"\",Prezentace!B7)","v":""},{"$f":"Prezentace!D7","v":"R"},{"$f":"IF(Prezentace!F7=0,\"\",Prezentace!F7)","v":"Martin"},{"$f":"IF(Prezentace!E7=0,\"\",Prezentace!E7)","v":"Adensam"},300,null,null,null,null,null,null,null,null,null,null,null,null,null,null,139.6,{"$f":"(SUM(F5:T5))-U5","v":160.4}]
[{"$f":"IF(Prezentace!A8=0,\"\",Prezentace!A8)","v":""},{"$f":"IF(Prezentace!B8=0,\"\",Prezentace!B8)","v":""},{"$f":"Prezentace!D8","v":"P"},{"$f":"IF(Prezentace!F8=0,\"\",Prezentace!F8)","v":"Jaroslav"},{"$f":"IF(Prezentace!E8=0,\"\",Prezentace!E8)","v":"Kostříž "},300,null,null,null,null,null,null,null,null,null,null,null,null,null,null,107,193]
[{"$f":"IF(Prezentace!A9=0,\"\",Prezentace!A9)","v":""},{"$f":"IF(Prezentace!B9=0,\"\",Prezentace!B9)","v":""},{"$f":"Prezentace!D9","v":"P"},{"$f":"IF(Prezentace!F9=0,\"\",Prezentace!F9)","v":"Miroslav"},{"$f":"IF(Prezentace!E9=0,\"\",Prezentace!E9)","v":"Koch   ml."},300,null,null,null,null,null,null,null,null,null,null,null,null,null,null,92.06,207.94]
[{"$f":"IF(Prezentace!A10=0,\"\",Prezentace!A10)","v":""},{"$f":"IF(Prezentace!B10=0,\"\",Prezentace!B10)","v":""},{"$f":"Prezentace!D10","v":"P"},{"$f":"IF(Prezentace!F10=0,\"\",Prezentace!F10)","v":"Miroslav"},{"$f":"IF(Prezentace!E10=0,\"\",Prezentace!E10)","v":"Koch  st. "},300,null,null,null,null,null,null,null,null,null,null,null,null,null,null,91.08,208.92000000000002]
[{"$f":"IF(Prezentace!A11=0,\"\",Prezentace!A11)","v":""},{"$f":"IF(Prezentace!B11=0,\"\",Prezentace!B11)","v":""},{"$f":"Prezentace!D11","v":"P"},{"$f":"IF(Prezentace!F11=0,\"\",Prezentace!F11)","v":"Bohumil"},{"$f":"IF(Prezentace!E11=0,\"\",Prezentace!E11)","v":"Herceg"},300,null,null,null,null,null,null,null,null,null,null,null,null,null,null,113.6,186.4]
[{"$f":"IF(Prezentace!A12=0,\"\",Prezentace!A12)","v":""},{"$f":"IF(Prezentace!B12=0,\"\",Prezentace!B12)","v":""},{"$f":"Prezentace!D12","v":"P"},{"$f":"IF(Prezentace!F12=0,\"\",Prezentace!F12)","v":"Viktor"},{"$f":"IF(Prezentace!E12=0,\"\",Prezentace!E12)","v":"Fuksa  "},290,null,null,null,null,null,null,null,null,null,null,null,null,null,null,84.79,205.20999999999998]
[{"$f":"IF(Prezentace!A13=0,\"\",Prezentace!A13)","v":""},{"$f":"IF(Prezentace!B13=0,\"\",Prezentace!B13)","v":""},{"$f":"Prezentace!D13","v":"P"},{"$f":"IF(Prezentace!F13=0,\"\",Prezentace!F13)","v":"Milan"},{"$f":"IF(Prezentace!E13=0,\"\",Prezentace!E13)","v":"Matějka  ml."},290,null,null,null,null,null,null,null,null,null,null,null,null,null,null,79.459999999999994,210.54000000000002]
[{"$f":"IF(Prezentace!A14=0,\"\",Prezentace!A14)","v":""},{"$f":"IF(Prezentace!B14=0,\"\",Prezentace!B14)","v":""},{"$f":"Prezentace!D14","v":"P"},{"$f":"IF(Prezentace!F14=0,\"\",Prezentace!F14)","v":"Michal"},{"$f":"IF(Prezentace!E14=0,\"\",Prezentace!E14)","v":"Svoboda"},300,null,null,null,null,null,null,null,null,null,null,null,null,null,null,62.41,237.59]
[{"$f":"IF(Prezentace!A15=0,\"\",Prezentace!A15)","v":""},{"$f":"IF(Prezentace!B15=0,\"\",Prezentace!B15)","v":""},{"$f":"Prezentace!D15","v":"R"},{"$f":"IF(Prezentace!F15=0,\"\",Prezentace!F15)","v":"Lukáš"},{"$f":"IF(Prezentace!E15=0,\"\",Prezentace!E15)","v":"Bouda "},300,null,null,null,null,null,null,null,null,null,null,null,null,null,null,82.69,217.31]
[{"$f":"IF(Prezentace!A16=0,\"\",Prezentace!A16)","v":""},{"$f":"IF(Prezentace!B16=0,\"\",Prezentace!B16)","v":""},{"$f":"Prezentace!D16","v":"P"},{"$f":"IF(Prezentace!F16=0,\"\",Prezentace!F16)","v":"Lukáš"},{"$f":"IF(Prezentace!E16=0,\"\",Prezentace!E16)","v":"Bouda "},300,null,null,null,null,null,null,null,null,null,null,null,null,null,null,54.08,245.92000000000002]
[{"$f":"IF(Prezentace!A17=0,\"\",Prezentace!A17)","v":""},{"$f":"IF(Prezentace!B17=0,\"\",Prezentace!B17)","v":""},{"$f":"Prezentace!D17","v":"P"},{"$f":"IF(Prezentace!F17=0,\"\",Prezentace!F17)","v":"Pavel"},{"$f":"IF(Prezentace!E17=0,\"\",Prezentace!E17)","v":"Koltai"},300,null,null,null,null,null,null,null,null,null,null,null,null,null,null,48.12,251.88]
[{"$f":"IF(Prezentace!A18=0,\"\",Prezentace!A18)","v":""},{"$f":"IF(Prezentace!B18=0,\"\",Prezentace!B18)","v":""},{"$f":"Prezentace!D18","v":"P"},{"$f":"IF(Prezentace!F18=0,\"\",Prezentace!F18)","v":"Vladislav"},{"$f":"IF(Prezentace!E18=0,\"\",Prezentace!E18)","v":"Přibyl"},300,null,null,null,null,null,null,null,null,null,null,null,null,null,null,113.6,186.4]
[{"$f":"IF(Prezentace!A19=0,\"\",Prezentace!A19)","v":""},{"$f":"IF(Prezentace!B19=0,\"\",Prezentace!B19)","v":""},{"$f":"Prezentace!D19","v":"P"},{"$f":"IF(Prezentace!F19=0,\"\",Prezentace!F19)","v":"Milan"},{"$f":"IF(Prezentace!E19=0,\"\",Prezentace!E19)","v":"Matějka st."},290,null,null,null,null,null,null,null,null,null,null,null,null,null,null,185.6,104.4]
[{"$f":"IF(Prezentace!A20=0,\"\",Prezentace!A20)","v":""},{"$f":"IF(Prezentace!B20=0,\"\",Prezentace!B20)","v":""},{"$f":"Prezentace!D20","v":"P"},{"$f":"IF(Prezentace!F20=0,\"\",Prezentace!F20)","v":"Miroslav"},{"$f":"IF(Prezentace!E20=0,\"\",Prezentace!E20)","v":"Fiala  "},280,null,null,null,null,null,null,null,null,null,null,null,null,null,null,98.72,181.28]
[{"$f":"IF(Prezentace!A21=0,\"\",Prezentace!A21)","v":""},{"$f":"IF(Prezentace!B21=0,\"\",Prezentace!B21)","v":""},{"$f":"Prezentace!D21","v":"P"},{"$f":"IF(Prezentace!F21=0,\"\",Prezentace!F21)","v":"Karel"},{"$f":"IF(Prezentace!E21=0,\"\",Prezentace!E21)","v":"Gažák "},290,null,null,null,null,null,null,null,null,null,null,null,null,null,null,85.43,204.57]
[{"$f":"IF(Prezentace!A22=0,\"\",Prezentace!A22)","v":""},{"$f":"IF(Prezentace!B22=0,\"\",Prezentace!B22)","v":""},{"$f":"Prezentace!D22","v":"P"},{"$f":"IF(Prezentace!F22=0,\"\",Prezentace!F22)","v":"Václav"},{"$f":"IF(Prezentace!E22=0,\"\",Prezentace!E22)","v":"Landkammer"},290,null,null,null,null,null,null,null,null,null,null,null,null,null,null,90.15,199.85]
[{"$f":"IF(Prezentace!A23=0,\"\",Prezentace!A23)","v":""},{"$f":"IF(Prezentace!B23=0,\"\",Prezentace!B23)","v":""},{"$f":"Prezentace!D23","v":"P"},{"$f":"IF(Prezentace!F23=0,\"\",Prezentace!F23)","v":"Vojtěch"},{"$f":"IF(Prezentace!E23=0,\"\",Prezentace!E23)","v":"Brejžek "},300,null,null,null,null,null,null,null,null,null,null,null,null,null,null,87.04,212.95999999999998]
[{"$f":"IF(Prezentace!A24=0,\"\",Prezentace!A24)","v":""},{"$f":"IF(Prezentace!B24=0,\"\",Prezentace!B24)","v":""},{"$f":"Prezentace!D24","v":"P"},{"$f":"IF(Prezentace!F24=0,\"\",Prezentace!F24)","v":"Antonín"},{"$f":"IF(Prezentace!E24=0,\"\",Prezentace!E24)","v":"Urbanec  "},280,null,null,null,null,null,null,null,null,null,null,null,null,null,null,168.3,111.69999999999999]
[{"$f":"IF(Prezentace!A25=0,\"\",Prezentace!A25)","v":""},{"$f":"IF(Prezentace!B25=0,\"\",Prezentace!B25)","v":""},{"$f":"Prezentace!D25","v":"P"},{"$f":"IF(Prezentace!F25=0,\"\",Prezentace!F25)","v":"Milan"},{"$f":"IF(Prezentace!E25=0,\"\",Prezentace!E25)","v":"Jílek  "},280,null,null,null,null,null,null,null,null,null,null,null,null,null,null,113.2,166.8]
[{"$f":"IF(Prezentace!A26=0,\"\",Prezentace!A26)","v":""},{"$f":"IF(Prezentace!B26=0,\"\",Prezentace!B26)","v":""},{"$f":"Prezentace!D26","v":"P"},{"$f":"IF(Prezentace!F26=0,\"\",Prezentace!F26)","v":"Václav"},{"$f":"IF(Prezentace!E26=0,\"\",Prezentace!E26)","v":"Jírů"},290,null,null,null,null,null,null,null,null,null,null,null,null,null,null,66.459999999999994,223.54000000000002]
[{"$f":"IF(Prezentace!A27=0,\"\",Prezentace!A27)","v":""},{"$f":"IF(Prezentace!B27=0,\"\",Prezentace!B27)","v":""},{"$f":"Prezentace!D27","v":"P"},{"$f":"IF(Prezentace!F27=0,\"\",Prezentace!F27)","v":"Milan"},{"$f":"IF(Prezentace!E27=0,\"\",Prezentace!E27)","v":"Krupica"},300,null,null,null,null,null,null,null,null,null,null,null,null,null,null,85.86,214.14]
[{"$f":"IF(Prezentace!A28=0,\"\",Prezentace!A28)","v":""},{"$f":"IF(Prezentace!B28=0,\"\",Prezentace!B28)","v":""},{"$f":"Prezentace!D28","v":"R"},{"$f":"IF(Prezentace!F28=0,\"\",Prezentace!F28)","v":"Milan"},{"$f":"IF(Prezentace!E28=0,\"\",Prezentace!E28)","v":"Krupica "},300,null,null,null,null,null,null,null,null,null,null,null,null,null,null,103.7,196.3]
[{"$f":"IF(Prezentace!A29=0,\"\",Prezentace!A29)","v":""},{"$f":"IF(Prezentace!B29=0,\"\",Prezentace!B29)","v":""},{"$f":"Prezentace!D29","v":"P"},{"$f":"IF(Prezentace!F29=0,\"\",Prezentace!F29)","v":"Miloslav"},{"$f":"IF(Prezentace!E29=0,\"\",Prezentace!E29)","v":"Petržílka"},290,null,null,null,null,null,null,null,null,null,null,null,null,null,null,82.63,207.37]
[{"$f":"IF(Prezentace!A30=0,\"\",Prezentace!A30)","v":""},{"$f":"IF(Prezentace!B30=0,\"\",Prezentace!B30)","v":""},{"$f":"Prezentace!D30","v":"R"},{"$f":"IF(Prezentace!F30=0,\"\",Prezentace!F30)","v":"Aleš"},{"$f":"IF(Prezentace!E30=0,\"\",Prezentace!E30)","v":"Seitl "},290,null,null,null,null,null,null,null,null,null,null,null,null,null,null,100.2,189.8]
[{"$f":"IF(Prezentace!A31=0,\"\",Prezentace!A31)","v":""},{"$f":"IF(Prezentace!B31=0,\"\",Prezentace!B31)","v":""},{"$f":"Prezentace!D31","v":"P"},{"$f":"IF(Prezentace!F31=0,\"\",Prezentace!F31)","v":"Aleš"},{"$f":"IF(Prezentace!E31=0,\"\",Prezentace!E31)","v":"Seitl "},250,null,null,null,null,null,null,null,null,null,null,null,null,null,null,99.08,150.92000000000002]
[{"$f":"IF(Prezentace!A32=0,\"\",Prezentace!A32)","v":""},{"$f":"IF(Prezentace!B32=0,\"\",Prezentace!B32)","v":""},{"$f":"Prezentace!D32","v":"P"},{"$f":"IF(Prezentace!F32=0,\"\",Prezentace!F32)","v":"Karel"},{"$f":"IF(Prezentace!E32=0,\"\",Prezentace!E32)","v":"Seitl"},300,null,null,null,null,null,null,null,null,null,null,null,null,null,null,105.4,194.6]
[{"$f":"IF(Prezentace!A33=0,\"\",Prezentace!A33)","v":""},{"$f":"IF(Prezentace!B33=0,\"\",Prezentace!B33)","v":""},{"$f":"Prezentace!D33","v":"P"},{"$f":"IF(Prezentace!F33=0,\"\",Prezentace!F33)","v":"David"},{"$f":"IF(Prezentace!E33=0,\"\",Prezentace!E33)","v":"Nikodým"},300,null,null,null,null,null,null,null,null,null,null,null,null,null,null,48.12,251.88]
[{"$f":"IF(Prezentace!A34=0,\"\",Prezentace!A34)","v":""},{"$f":"IF(Prezentace!B34=0,\"\",Prezentace!B34)","v":""},{"$f":"Prezentace!D34","v":"R"},{"$f":"IF(Prezentace!F34=0,\"\",Prezentace!F34)","v":"David"},{"$f":"IF(Prezentace!E34=0,\"\",Prezentace!E34)","v":"Nikodým "},300,null,null,null,null,null,null,null,null,null,null,null,null,null,null,68.930000000000007,231.07]
[{"$f":"IF(Prezentace!A35=0,\"\",Prezentace!A35)","v":""},{"$f":"IF(Prezentace!B35=0,\"\",Prezentace!B35)","v":""},{"$f":"Prezentace!D35","v":"P"},{"$f":"IF(Prezentace!F35=0,\"\",Prezentace!F35)","v":"Lukáš"},{"$f":"IF(Prezentace!E35=0,\"\",Prezentace!E35)","v":"Hobza"},290,null,null,null,null,null,null,null,null,null,null,null,null,null,null,58.44,231.56]
[{"$f":"IF(Prezentace!A36=0,\"\",Prezentace!A36)","v":""},{"$f":"IF(Prezentace!B36=0,\"\",Prezentace!B36)","v":""},{"$f":"Prezentace!D36","v":"P"},{"$f":"IF(Prezentace!F36=0,\"\",Prezentace!F36)","v":"Antonín"},{"$f":"IF(Prezentace!E36=0,\"\",Prezentace!E36)","v":"Jelínek "},270,null,null,null,null,null,null,null,null,null,null,null,null,null,null,96.57,173.43]
[{"$f":"IF(Prezentace!A37=0,\"\",Prezentace!A37)","v":""},{"$f":"IF(Prezentace!B37=0,\"\",Prezentace!B37)","v":""},{"$f":"Prezentace!D37","v":"R"},{"$f":"IF(Prezentace!F37=0,\"\",Prezentace!F37)","v":"Antonín"},{"$f":"IF(Prezentace!E37=0,\"\",Prezentace!E37)","v":"Jelínek "},290,null,null,null,null,null,null,null,null,null,null,null,null,null,null,82.42,207.57999999999998]
[{"$f":"IF(Prezentace!A38=0,\"\",Prezentace!A38)","v":""},{"$f":"IF(Prezentace!B38=0,\"\",Prezentace!B38)","v":""},{"$f":"Prezentace!D38","v":"P"},{"$f":"IF(Prezentace!F38=0,\"\",Prezentace!F38)","v":"Ladislav"},{"$f":"IF(Prezentace!E38=0,\"\",Prezentace!E38)","v":"Píša "},300,null,null,null,null,null,null,null,null,null,null,null,null,null,null,80.67,219.32999999999998]
[{"$f":"IF(Prezentace!A39=0,\"\",Prezentace!A39)","v":""},{"$f":"IF(Prezentace!B39=0,\"\",Prezentace!B39)","v":""},{"$f":"Prezentace!D39","v":"P"},{"$f":"IF(Prezentace!F39=0,\"\",Prezentace!F39)","v":"Štefan"},{"$f":"IF(Prezentace!E39=0,\"\",Prezentace!E39)","v":"Mesároš"},300,null,null,null,null,null,null,null,null,null,null,null,null,null,null,57.75,242.25]
[{"$f":"IF(Prezentace!A40=0,\"\",Prezentace!A40)","v":""},{"$f":"IF(Prezentace!B40=0,\"\",Prezentace!B40)","v":""},{"$f":"Prezentace!D40","v":"P"},{"$f":"IF(Prezentace!F40=0,\"\",Prezentace!F40)","v":"Pavel"},{"$f":"IF(Prezentace!E40=0,\"\",Prezentace!E40)","v":"Červenka"},290,null,null,null,null,null,null,null,null,null,null,null,null,null,null,47.25,{"$f":"(SUM(F38:T38))-U38","v":242.75}]
[{"$f":"IF(Prezentace!A41=0,\"\",Prezentace!A41)","v":""},{"$f":"IF(Prezentace!B41=0,\"\",Prezentace!B41)","v":""},{"$f":"Prezentace!D41","v":"R"},{"$f":"IF(Prezentace!F41=0,\"\",Prezentace!F41)","v":"Pavel"},{"$f":"IF(Prezentace!E41=0,\"\",Prezentace!E41)","v":"Červenka "},300,null,null,null,null,null,null,null,null,null,null,null,null,null,null,100.6,199.4]
[{"$f":"IF(Prezentace!A42=0,\"\",Prezentace!A42)","v":""},{"$f":"IF(Prezentace!B42=0,\"\",Prezentace!B42)","v":""},{"$f":"Prezentace!D42","v":"P"},{"$f":"IF(Prezentace!F42=0,\"\",Prezentace!F42)","v":"Jiří"},{"$f":"IF(Prezentace!E42=0,\"\",Prezentace!E42)","v":"Švihálek "},300,null,null,null,null,null,null,null,null,null,null,null,null,null,null,65.88,234.12]
[{"$f":"IF(Prezentace!A43=0,\"\",Prezentace!A43)","v":""},{"$f":"IF(Prezentace!B43=0,\"\",Prezentace!B43)","v":""},{"$f":"Prezentace!D43","v":"R"},{"$f":"IF(Prezentace!F43=0,\"\",Prezentace!F43)","v":"Jiří"},{"$f":"IF(Prezentace!E43=0,\"\",Prezentace!E43)","v":"Švihálek "},290,null,null,null,null,null,null,null,null,null,null,null,null,null,null,84.88,205.12]
[{"$f":"IF(Prezentace!A44=0,\"\",Prezentace!A44)","v":""},{"$f":"IF(Prezentace!B44=0,\"\",Prezentace!B44)","v":""},{"$f":"Prezentace!D44","v":"P"},{"$f":"IF(Prezentace!F44=0,\"\",Prezentace!F44)","v":"František"},{"$f":"IF(Prezentace!E44=0,\"\",Prezentace!E44)","v":"Toman "},300,null,null,null,null,null,null,null,null,null,null,null,null,null,null,130.69999999999999,169.3]
[{"$f":"IF(Prezentace!A45=0,\"\",Prezentace!A45)","v":""},{"$f":"IF(Prezentace!B45=0,\"\",Prezentace!B45)","v":""},{"$f":"Prezentace!D45","v":"P"},{"$f":"IF(Prezentace!F45=0,\"\",Prezentace!F45)","v":"Vladimír"},{"$f":"IF(Prezentace!E45=0,\"\",Prezentace!E45)","v":"VejslíK "},300,null,null,null,null,null,null,null,null,null,null,null,null,null,null,46.69,253.31]
[{"$f":"IF(Prezentace!A46=0,\"\",Prezentace!A46)","v":""},{"$f":"IF(Prezentace!B46=0,\"\",Prezentace!B46)","v":""},{"$f":"Prezentace!D46","v":"P"},{"$f":"IF(Prezentace!F46=0,\"\",Prezentace!F46)","v":"Karel"},{"$f":"IF(Prezentace!E46=0,\"\",Prezentace!E46)","v":"Získal "},270,null,null,null,null,null,null,null,null,null,null,null,null,null,null,54.98,215.02]
[{"$f":"IF(Prezentace!A47=0,\"\",Prezentace!A47)","v":""},{"$f":"IF(Prezentace!B47=0,\"\",Prezentace!B47)","v":""},{"$f":"Prezentace!D47","v":"R"},{"$f":"IF(Prezentace!F47=0,\"\",Prezentace!F47)","v":"Karel"},{"$f":"IF(Prezentace!E47=0,\"\",Prezentace!E47)","v":"Získal "},300,null,null,null,null,null,null,null,null,null,null,null,null,null,null,118.1,181.9]
[{"$f":"IF(Prezentace!A48=0,\"\",Prezentace!A48)","v":""},{"$f":"IF(Prezentace!B48=0,\"\",Prezentace!B48)","v":""},{"$f":"Prezentace!D48","v":"P"},{"$f":"IF(Prezentace!F48=0,\"\",Prezentace!F48)","v":"Jaroslav"},{"$f":"IF(Prezentace!E48=0,\"\",Prezentace!E48)","v":"Sokolík "},290,null,null,null,null,null,null,null,null,null,null,null,null,null,null,50.01,239.99]
[{"$f":"IF(Prezentace!A49=0,\"\",Prezentace!A49)","v":""},{"$f":"IF(Prezentace!B49=0,\"\",Prezentace!B49)","v":""},{"$f":"Prezentace!D49","v":"P"},{"$f":"IF(Prezentace!F49=0,\"\",Prezentace!F49)","v":"Milan"},{"$f":"IF(Prezentace!E49=0,\"\",Prezentace!E49)","v":"Kraus "},300,null,null,null,null,null,null,null,null,null,null,null,null,null,null,62.09,237.91]
[{"$f":"IF(Prezentace!A50=0,\"\",Prezentace!A50)","v":""},{"$f":"IF(Prezentace!B50=0,\"\",Prezentace!B50)","v":""},{"$f":"Prezentace!D50","v":"P"},{"$f":"IF(Prezentace!F50=0,\"\",Prezentace!F50)","v":""},{"$f":"IF(Prezentace!E50=0,\"\",Prezentace!E50)","v":""},null,null,null,null,null,null,null,null,null,null,null,null,null,null,null,null,0]
[{"$f":"IF(Prezentace!A51=0,\"\",Prezentace!A51)","v":""},{"$f":"IF(Prezentace!B51=0,\"\",Prezentace!B51)","v":""},{"$f":"Prezentace!D51","v":"P"},{"$f":"IF(Prezentace!F51=0,\"\",Prezentace!F51)","v":""},{"$f":"IF(Prezentace!E51=0,\"\",Prezentace!E51)","v":""},null,null,null,null,null,null,null,null,null,null,null,null,null,null,null,null,0]
[{"$f":"IF(Prezentace!A52=0,\"\",Prezentace!A52)","v":""},{"$f":"IF(Prezentace!B52=0,\"\",Prezentace!B52)","v":""},{"$f":"Prezentace!D52","v":"P"},{"$f":"IF(Prezentace!F52=0,\"\",Prezentace!F52)","v":""},{"$f":"IF(Prezentace!E52=0,\"\",Prezentace!E52)","v":""},null,null,null,null,null,null,null,null,null,null,null,null,null,null,null,null,0]
[{"$f":"IF(Prezentace!A53=0,\"\",Prezentace!A53)","v":""},{"$f":"IF(Prezentace!B53=0,\"\",Prezentace!B53)","v":""},{"$f":"Prezentace!D53","v":"P"},{"$f":"IF(Prezentace!F53=0,\"\",Prezentace!F53)","v":""},{"$f":"IF(Prezentace!E53=0,\"\",Prezentace!E53)","v":""},null,null,null,null,null,null,null,null,null,null,null,null,null,null,null,null,0]
[{"$f":"IF(Prezentace!A54=0,\"\",Prezentace!A54)","v":""},{"$f":"IF(Prezentace!B54=0,\"\",Prezentace!B54)","v":""},{"$f":"Prezentace!D54","v":"P"},{"$f":"IF(Prezentace!F54=0,\"\",Prezentace!F54)","v":""},{"$f":"IF(Prezentace!E54=0,\"\",Prezentace!E54)","v":""},null,null,null,null,null,null,null,null,null,null,null,null,null,null,null,null,0]
[{"$f":"IF(Prezentace!A55=0,\"\",Prezentace!A55)","v":""},{"$f":"IF(Prezentace!B55=0,\"\",Prezentace!B55)","v":""},{"$f":"Prezentace!D55","v":"P"},{"$f":"IF(Prezentace!F55=0,\"\",Prezentace!F55)","v":""},{"$f":"IF(Prezentace!E55=0,\"\",Prezentace!E55)","v":""},null,null,null,null,null,null,null,null,null,null,null,null,null,null,null,null,0]
[{"$f":"IF(Prezentace!A56=0,\"\",Prezentace!A56)","v":""},{"$f":"IF(Prezentace!B56=0,\"\",Prezentace!B56)","v":""},{"$f":"Prezentace!D56","v":"P"},{"$f":"IF(Prezentace!F56=0,\"\",Prezentace!F56)","v":""},{"$f":"IF(Prezentace!E56=0,\"\",Prezentace!E56)","v":""},null,null,null,null,null,null,null,null,null,null,null,null,null,null,null,null,0]
[{"$f":"IF(Prezentace!A57=0,\"\",Prezentace!A57)","v":""},{"$f":"IF(Prezentace!B57=0,\"\",Prezentace!B57)","v":""},{"$f":"Prezentace!D57","v":"P"},{"$f":"IF(Prezentace!F57=0,\"\",Prezentace!F57)","v":""},{"$f":"IF(Prezentace!E57=0,\"\",Prezentace!E57)","v":""},null,null,null,null,null,null,null,null,null,null,null,null,null,null,null,null,0]
[{"$f":"IF(Prezentace!A58=0,\"\",Prezentace!A58)","v":""},{"$f":"IF(Prezentace!B58=0,\"\",Prezentace!B58)","v":""},{"$f":"Prezentace!D58","v":"P"},{"$f":"IF(Prezentace!F58=0,\"\",Prezentace!F58)","v":""},{"$f":"IF(Prezentace!E58=0,\"\",Prezentace!E58)","v":""},null,null,null,null,null,null,null,null,null,null,null,null,null,null,null,null,0]
[{"$f":"IF(Prezentace!A59=0,\"\",Prezentace!A59)","v":""},{"$f":"IF(Prezentace!B59=0,\"\",Prezentace!B59)","v":""},{"$f":"Prezentace!D59","v":"P"},{"$f":"IF(Prezentace!F59=0,\"\",Prezentace!F59)","v":""},{"$f":"IF(Prezentace!E59=0,\"\",Prezentace!E59)","v":""},null,null,null,null,null,null,null,null,null,null,null,null,null,null,null,null,0]
[{"$f":"IF(Prezentace!A60=0,\"\",Prezentace!A60)","v":""},{"$f":"IF(Prezentace!B60=0,\"\",Prezentace!B60)","v":""},{"$f":"Prezentace!D60","v":"P"},{"$f":"IF(Prezentace!F60=0,\"\",Prezentace!F60)","v":""},{"$f":"IF(Prezentace!E60=0,\"\",Prezentace!E60)","v":""},null,null,null,null,null,null,null,null,null,null,null,null,null,null,null,null,0]
[{"$f":"IF(Prezentace!A61=0,\"\",Prezentace!A61)","v":""},{"$f":"IF(Prezentace!B61=0,\"\",Prezentace!B61)","v":""},{"$f":"Prezentace!D61","v":"P"},{"$f":"IF(Prezentace!F61=0,\"\",Prezentace!F61)","v":""},{"$f":"IF(Prezentace!E61=0,\"\",Prezentace!E61)","v":""},null,null,null,null,null,null,null,null,null,null,null,null,null,null,null,null,0]
[{"$f":"IF(Prezentace!A62=0,\"\",Prezentace!A62)","v":""},{"$f":"IF(Prezentace!B62=0,\"\",Prezentace!B62)","v":""},{"$f":"Prezentace!D62","v":"P"},{"$f":"IF(Prezentace!F62=0,\"\",Prezentace!F62)","v":""},{"$f":"IF(Prezentace!E62=0,\"\",Prezentace!E62)","v":""},null,null,null,null,null,null,null,null,null,null,null,null,null,null,null,null,0]
[{"$f":"IF(Prezentace!A63=0,\"\",Prezentace!A63)","v":""},{"$f":"IF(Prezentace!B63=0,\"\",Prezentace!B63)","v":""},{"$f":"Prezentace!D63","v":"P"},{"$f":"IF(Prezentace!F63=0,\"\",Prezentace!F63)","v":""},{"$f":"IF(Prezentace!E63=0,\"\",Prezentace!E63)","v":""},null,null,null,null,null,null,null,null,null,null,null,null,null,null,null,null,0]
[{"$f":"IF(Prezentace!A64=0,\"\",Prezentace!A64)","v":""},{"$f":"IF(Prezentace!B64=0,\"\",Prezentace!B64)","v":""},{"$f":"Prezentace!D64","v":"P"},{"$f":"IF(Prezentace!F64=0,\"\",Prezentace!F64)","v":""},{"$f":"IF(Prezentace!E64=0,\"\",Prezentace!E64)","v":""},null,null,null,null,null,null,null,null,null,null,null,null,null,null,null,null,0]
[{"$f":"IF(Prezentace!A65=0,\"\",Prezentace!A65)","v":""},{"$f":"IF(Prezentace!B65=0,\"\",Prezentace!B65)","v":""},{"$f":"Prezentace!D65","v":"P"},{"$f":"IF(Prezentace!F65=0,\"\",Prezentace!F65)","v":""},{"$f":"IF(Prezentace!E65=0,\"\",Prezentace!E65)","v":""},null,null,null,null,null,null,null,null,null,null,null,null,null,null,null,null,0]
[{"$f":"IF(Prezentace!A66=0,\"\",Prezentace!A66)","v":""},{"$f":"IF(Prezentace!B66=0,\"\",Prezentace!B66)","v":""},{"$f":"Prezentace!D66","v":"P"},{"$f":"IF(Prezentace!F66=0,\"\",Prezentace!F66)","v":""},{"$f":"IF(Prezentace!E66=0,\"\",Prezentace!E66)","v":""},null,null,null,null,null,null,null,null,null,null,null,null,null,null,null,null,0]
[{"$f":"IF(Prezentace!A67=0,\"\",Prezentace!A67)","v":""},{"$f":"IF(Prezentace!B67=0,\"\",Prezentace!B67)","v":""},{"$f":"Prezentace!D67","v":"P"},{"$f":"IF(Prezentace!F67=0,\"\",Prezentace!F67)","v":""},{"$f":"IF(Prezentace!E67=0,\"\",Prezentace!E67)","v":""},null,null,null,null,null,null,null,null,null,null,null,null,null,null,null,null,0]
[{"$f":"IF(Prezentace!A68=0,\"\",Prezentace!A68)","v":""},{"$f":"IF(Prezentace!B68=0,\"\",Prezentace!B68)","v":""},{"$f":"Prezentace!D68","v":"P"},{"$f":"IF(Prezentace!F68=0,\"\",Prezentace!F68)","v":""},{"$f":"IF(Prezentace!E68=0,\"\",Prezentace!E68)","v":""},null,null,null,null,null,null,null,null,null,null,null,null,null,null,null,null,0]
[{"$f":"IF(Prezentace!A69=0,\"\",Prezentace!A69)","v":""},{"$f":"IF(Prezentace!B69=0,\"\",Prezentace!B69)","v":""},{"$f":"Prezentace!D69","v":"P"},{"$f":"IF(Prezentace!F69=0,\"\",Prezentace!F69)","v":""},{"$f":"IF(Prezentace!E69=0,\"\",Prezentace!E69)","v":""},null,null,null,null,null,null,null,null,null,null,null,null,null,null,null,null,0]
[{"$f":"IF(Prezentace!A70=0,\"\",Prezentace!A70)","v":""},{"$f":"IF(Prezentace!B70=0,\"\",Prezentace!B70)","v":""},{"$f":"Prezentace!D70","v":"P"},{"$f":"IF(Prezentace!F70=0,\"\",Prezentace!F70)","v":""},{"$f":"IF(Prezentace!E70=0,\"\",Prezentace!E70)","v":""},null,null,null,null,null,null,null,null,null,null,null,null,null,null,null,null,0]
[{"$f":"IF(Prezentace!A71=0,\"\",Prezentace!A71)","v":""},{"$f":"IF(Prezentace!B71=0,\"\",Prezentace!B71)","v":""},{"$f":"Prezentace!D71","v":"P"},{"$f":"IF(Prezentace!F71=0,\"\",Prezentace!F71)","v":""},{"$f":"IF(Prezentace!E71=0,\"\",Prezentace!E71)","v":""},null,null,null,null,null,null,null,null,null,null,null,null,null,null,null,null,0]
[{"$f":"IF(Prezentace!A72=0,\"\",Prezentace!A72)","v":""},{"$f":"IF(Prezentace!B72=0,\"\",Prezentace!B72)","v":""},{"$f":"Prezentace!D72","v":"P"},{"$f":"IF(Prezentace!F72=0,\"\",Prezentace!F72)","v":""},{"$f":"IF(Prezentace!E72=0,\"\",Prezentace!E72)","v":""},null,null,null,null,null,null,null,null,null,null,null,null,null,null,null,null,0]
[{"$f":"IF(Prezentace!A73=0,\"\",Prezentace!A73)","v":""},{"$f":"IF(Prezentace!B73=0,\"\",Prezentace!B73)","v":""},{"$f":"Prezentace!D73","v":"P"},{"$f":"IF(Prezentace!F73=0,\"\",Prezentace!F73)","v":""},{"$f":"IF(Prezentace!E73=0,\"\",Prezentace!E73)","v":""},null,null,null,null,null,null,null,null,null,null,null,null,null,null,null,null,0]
[{"$f":"IF(Prezentace!A74=0,\"\",Prezentace!A74)","v":""},{"$f":"IF(Prezentace!B74=0,\"\",Prezentace!B74)","v":""},{"$f":"Prezentace!D74","v":"P"},{"$f":"IF(Prezentace!F74=0,\"\",Prezentace!F74)","v":""},{"$f":"IF(Prezentace!E74=0,\"\",Prezentace!E74)","v":""},null,null,null,null,null,null,null,null,null,null,null,null,null,null,null,null,0]
[{"$f":"IF(Prezentace!A75=0,\"\",Prezentace!A75)","v":""},{"$f":"IF(Prezentace!B75=0,\"\",Prezentace!B75)","v":""},{"$f":"Prezentace!D75","v":"P"},{"$f":"IF(Prezentace!F75=0,\"\",Prezentace!F75)","v":""},{"$f":"IF(Prezentace!E75=0,\"\",Prezentace!E75)","v":""},null,null,null,null,null,null,null,null,null,null,null,null,null,null,null,null,0]
[{"$f":"IF(Prezentace!A76=0,\"\",Prezentace!A76)","v":""},{"$f":"IF(Prezentace!B76=0,\"\",Prezentace!B76)","v":""},{"$f":"Prezentace!D76","v":"P"},{"$f":"IF(Prezentace!F76=0,\"\",Prezentace!F76)","v":""},{"$f":"IF(Prezentace!E76=0,\"\",Prezentace!E76)","v":""},null,null,null,null,null,null,null,null,null,null,null,null,null,null,null,null,0]
[{"$f":"IF(Prezentace!A77=0,\"\",Prezentace!A77)","v":""},{"$f":"IF(Prezentace!B77=0,\"\",Prezentace!B77)","v":""},{"$f":"Prezentace!D77","v":"P"},{"$f":"IF(Prezentace!F77=0,\"\",Prezentace!F77)","v":""},{"$f":"IF(Prezentace!E77=0,\"\",Prezentace!E77)","v":""},null,null,null,null,null,null,null,null,null,null,null,null,null,null,null,null,0]
[{"$f":"IF(Prezentace!A78=0,\"\",Prezentace!A78)","v":""},{"$f":"IF(Prezentace!B78=0,\"\",Prezentace!B78)","v":""},{"$f":"Prezentace!D78","v":"P"},{"$f":"IF(Prezentace!F78=0,\"\",Prezentace!F78)","v":""},{"$f":"IF(Prezentace!E78=0,\"\",Prezentace!E78)","v":""},null,null,null,null,null,null,null,null,null,null,null,null,null,null,null,null,0]
[{"$f":"IF(Prezentace!A79=0,\"\",Prezentace!A79)","v":""},{"$f":"IF(Prezentace!B79=0,\"\",Prezentace!B79)","v":""},{"$f":"Prezentace!D79","v":"P"},{"$f":"IF(Prezentace!F79=0,\"\",Prezentace!F79)","v":""},{"$f":"IF(Prezentace!E79=0,\"\",Prezentace!E79)","v":""},null,null,null,null,null,null,null,null,null,null,null,null,null,null,null,null,0]
[{"$f":"IF(Prezentace!A80=0,\"\",Prezentace!A80)","v":""},{"$f":"IF(Prezentace!B80=0,\"\",Prezentace!B80)","v":""},{"$f":"Prezentace!D80","v":"P"},{"$f":"IF(Prezentace!F80=0,\"\",Prezentace!F80)","v":""},{"$f":"IF(Prezentace!E80=0,\"\",Prezentace!E80)","v":""},null,null,null,null,null,null,null,null,null,null,null,null,null,null,null,null,0]
[{"$f":"IF(Prezentace!A81=0,\"\",Prezentace!A81)","v":""},{"$f":"IF(Prezentace!B81=0,\"\",Prezentace!B81)","v":""},{"$f":"Prezentace!D81","v":"P"},{"$f":"IF(Prezentace!F81=0,\"\",Prezentace!F81)","v":""},{"$f":"IF(Prezentace!E81=0,\"\",Prezentace!E81)","v":""},null,null,null,null,null,null,null,null,null,null,null,null,null,null,null,null,0]
[{"$f":"IF(Prezentace!A82=0,\"\",Prezentace!A82)","v":""},{"$f":"IF(Prezentace!B82=0,\"\",Prezentace!B82)","v":""},{"$f":"Prezentace!D82","v":"P"},{"$f":"IF(Prezentace!F82=0,\"\",Prezentace!F82)","v":""},{"$f":"IF(Prezentace!E82=0,\"\",Prezentace!E82)","v":""},null,null,null,null,null,null,null,null,null,null,null,null,null,null,null,null,0]
[{"$f":"IF(Prezentace!A83=0,\"\",Prezentace!A83)","v":""},{"$f":"IF(Prezentace!B83=0,\"\",Prezentace!B83)","v":""},{"$f":"Prezentace!D83","v":"P"},{"$f":"IF(Prezentace!F83=0,\"\",Prezentace!F83)","v":""},{"$f":"IF(Prezentace!E83=0,\"\",Prezentace!E83)","v":""},null,null,null,null,null,null,null,null,null,null,null,null,null,null,null,null,0]
[{"$f":"IF(Prezentace!A84=0,\"\",Prezentace!A84)","v":""},{"$f":"IF(Prezentace!B84=0,\"\",Prezentace!B84)","v":""},{"$f":"Prezentace!D84","v":"P"},{"$f":"IF(Prezentace!F84=0,\"\",Prezentace!F84)","v":""},{"$f":"IF(Prezentace!E84=0,\"\",Prezentace!E84)","v":""},null,null,null,null,null,null,null,null,null,null,null,null,null,null,null,null,0]
[{"$f":"IF(Prezentace!A85=0,\"\",Prezentace!A85)","v":""},{"$f":"IF(Prezentace!B85=0,\"\",Prezentace!B85)","v":""},{"$f":"Prezentace!D85","v":"P"},{"$f":"IF(Prezentace!F85=0,\"\",Prezentace!F85)","v":""},{"$f":"IF(Prezentace!E85=0,\"\",Prezentace!E85)","v":""},null,null,null,null,null,null,null,null,null,null,null,null,null,null,null,null,0]
[{"$f":"IF(Prezentace!A86=0,\"\",Prezentace!A86)","v":""},{"$f":"IF(Prezentace!B86=0,\"\",Prezentace!B86)","v":""},{"$f":"Prezentace!D86","v":"P"},{"$f":"IF(Prezentace!F86=0,\"\",Prezentace!F86)","v":""},{"$f":"IF(Prezentace!E86=0,\"\",Prezentace!E86)","v":""},null,null,null,null,null,null,null,null,null,null,null,null,null,null,null,null,0]
[{"$f":"IF(Prezentace!A87=0,\"\",Prezentace!A87)","v":""},{"$f":"IF(Prezentace!B87=0,\"\",Prezentace!B87)","v":""},{"$f":"Prezentace!D87","v":"P"},{"$f":"IF(Prezentace!F87=0,\"\",Prezentace!F87)","v":""},{"$f":"IF(Prezentace!E87=0,\"\",Prezentace!E87)","v":""},null,null,null,null,null,null,null,null,null,null,null,null,null,null,null,null,0]
[{"$f":"IF(Prezentace!A88=0,\"\",Prezentace!A88)","v":""},{"$f":"IF(Prezentace!B88=0,\"\",Prezentace!B88)","v":""},{"$f":"Prezentace!D88","v":"P"},{"$f":"IF(Prezentace!F88=0,\"\",Prezentace!F88)","v":""},{"$f":"IF(Prezentace!E88=0,\"\",Prezentace!E88)","v":""},null,null,null,null,null,null,null,null,null,null,null,null,null,null,null,null,0]
[{"$f":"IF(Prezentace!A89=0,\"\",Prezentace!A89)","v":""},{"$f":"IF(Prezentace!B89=0,\"\",Prezentace!B89)","v":""},{"$f":"Prezentace!D89","v":"P"},{"$f":"IF(Prezentace!F89=0,\"\",Prezentace!F89)","v":""},{"$f":"IF(Prezentace!E89=0,\"\",Prezentace!E89)","v":""},null,null,null,null,null,null,null,null,null,null,null,null,null,null,null,null,0]
[{"$f":"IF(Prezentace!A90=0,\"\",Prezentace!A90)","v":""},{"$f":"IF(Prezentace!B90=0,\"\",Prezentace!B90)","v":""},{"$f":"Prezentace!D90","v":"P"},{"$f":"IF(Prezentace!F90=0,\"\",Prezentace!F90)","v":""},{"$f":"IF(Prezentace!E90=0,\"\",Prezentace!E90)","v":""},null,null,null,null,null,null,null,null,null,null,null,null,null,null,null,null,0]
[{"$f":"IF(Prezentace!A91=0,\"\",Prezentace!A91)","v":""},{"$f":"IF(Prezentace!B91=0,\"\",Prezentace!B91)","v":""},{"$f":"Prezentace!D91","v":"P"},{"$f":"IF(Prezentace!F91=0,\"\",Prezentace!F91)","v":""},{"$f":"IF(Prezentace!E91=0,\"\",Prezentace!E91)","v":""},null,null,null,null,null,null,null,null,null,null,null,null,null,null,null,null,0]
[{"$f":"IF(Prezentace!A92=0,\"\",Prezentace!A92)","v":""},{"$f":"IF(Prezentace!B92=0,\"\",Prezentace!B92)","v":""},{"$f":"Prezentace!D92","v":"P"},{"$f":"IF(Prezentace!F92=0,\"\",Prezentace!F92)","v":""},{"$f":"IF(Prezentace!E92=0,\"\",Prezentace!E92)","v":""},null,null,null,null,null,null,null,null,null,null,null,null,null,null,null,null,0]
[{"$f":"IF(Prezentace!A93=0,\"\",Prezentace!A93)","v":""},{"$f":"IF(Prezentace!B93=0,\"\",Prezentace!B93)","v":""},{"$f":"Prezentace!D93","v":"P"},{"$f":"IF(Prezentace!F93=0,\"\",Prezentace!F93)","v":""},{"$f":"IF(Prezentace!E93=0,\"\",Prezentace!E93)","v":""},null,null,null,null,null,null,null,null,null,null,null,null,null,null,null,null,0]
[{"$f":"IF(Prezentace!A94=0,\"\",Prezentace!A94)","v":""},{"$f":"IF(Prezentace!B94=0,\"\",Prezentace!B94)","v":""},{"$f":"Prezentace!D94","v":"P"},{"$f":"IF(Prezentace!F94=0,\"\",Prezentace!F94)","v":""},{"$f":"IF(Prezentace!E94=0,\"\",Prezentace!E94)","v":""},null,null,null,null,null,null,null,null,null,null,null,null,null,null,null,null,0]
[{"$f":"IF(Prezentace!A95=0,\"\",Prezentace!A95)","v":""},{"$f":"IF(Prezentace!B95=0,\"\",Prezentace!B95)","v":""},{"$f":"Prezentace!D95","v":"P"},{"$f":"IF(Prezentace!F95=0,\"\",Prezentace!F95)","v":""},{"$f":"IF(Prezentace!E95=0,\"\",Prezentace!E95)","v":""},null,null,null,null,null,null,null,null,null,null,null,null,null,null,null,null,0]
[{"$f":"IF(Prezentace!A96=0,\"\",Prezentace!A96)","v":""},{"$f":"IF(Prezentace!B96=0,\"\",Prezentace!B96)","v":""},{"$f":"Prezentace!D96","v":"P"},{"$f":"IF(Prezentace!F96=0,\"\",Prezentace!F96)","v":""},{"$f":"IF(Prezentace!E96=0,\"\",Prezentace!E96)","v":""},null,null,null,null,null,null,null,null,null,null,null,null,null,null,null,null,0]
[{"$f":"IF(Prezentace!A97=0,\"\",Prezentace!A97)","v":""},{"$f":"IF(Prezentace!B97=0,\"\",Prezentace!B97)","v":""},{"$f":"Prezentace!D97","v":"P"},{"$f":"IF(Prezentace!F97=0,\"\",Prezentace!F97)","v":""},{"$f":"IF(Prezentace!E97=0,\"\",Prezentace!E97)","v":""},null,null,null,null,null,null,null,null,null,null,null,null,null,null,null,null,0]
[{"$f":"IF(Prezentace!A98=0,\"\",Prezentace!A98)","v":""},{"$f":"IF(Prezentace!B98=0,\"\",Prezentace!B98)","v":""},{"$f":"Prezentace!D98","v":"P"},{"$f":"IF(Prezentace!F98=0,\"\",Prezentace!F98)","v":""},{"$f":"IF(Prezentace!E98=0,\"\",Prezentace!E98)","v":""},null,null,null,null,null,null,null,null,null,null,null,null,null,null,null,null,0]
[{"$f":"IF(Prezentace!A99=0,\"\",Prezentace!A99)","v":""},{"$f":"IF(Prezentace!B99=0,\"\",Prezentace!B99)","v":""},{"$f":"Prezentace!D99","v":"P"},{"$f":"IF(Prezentace!F99=0,\"\",Prezentace!F99)","v":""},{"$f":"IF(Prezentace!E99=0,\"\",Prezentace!E99)","v":""},null,null,null,null,null,null,null,null,null,null,null,null,null,null,null,null,0]
[{"$f":"IF(Prezentace!A100=0,\"\",Prezentace!A100)","v":""},{"$f":"IF(Prezentace!B100=0,\"\",Prezentace!B100)","v":""},{"$f":"Prezentace!D100","v":"P"},{"$f":"IF(Prezentace!F100=0,\"\",Prezentace!F100)","v":""},{"$f":"IF(Prezentace!E100=0,\"\",Prezentace!E100)","v":""},null,null,null,null,null,null,null,null,null,null,null,null,null,null,null,null,0]
[{"$f":"IF(Prezentace!A101=0,\"\",Prezentace!A101)","v":""},{"$f":"IF(Prezentace!B101=0,\"\",Prezentace!B101)","v":""},{"$f":"Prezentace!D101","v":"P"},{"$f":"IF(Prezentace!F101=0,\"\",Prezentace!F101)","v":""},{"$f":"IF(Prezentace!E101=0,\"\",Prezentace!E101)","v":""},null,null,null,null,null,null,null,null,null,null,null,null,null,null,null,null,0]
[{"$f":"IF(Prezentace!A102=0,\"\",Prezentace!A102)","v":""},{"$f":"IF(Prezentace!B102=0,\"\",Prezentace!B102)","v":""},{"$f":"Prezentace!D102","v":"P"},{"$f":"IF(Prezentace!F102=0,\"\",Prezentace!F102)","v":""},{"$f":"IF(Prezentace!E102=0,\"\",Prezentace!E102)","v":""},null,null,null,null,null,null,null,null,null,null,null,null,null,null,null,null,0]
[{"$f":"IF(Prezentace!A103=0,\"\",Prezentace!A103)","v":""},{"$f":"IF(Prezentace!B103=0,\"\",Prezentace!B103)","v":""},{"$f":"Prezentace!D103","v":"P"},{"$f":"IF(Prezentace!F103=0,\"\",Prezentace!F103)","v":""},{"$f":"IF(Prezentace!E103=0,\"\",Prezentace!E103)","v":""},null,null,null,null,null,null,null,null,null,null,null,null,null,null,null,null,0]
[{"$f":"IF(Prezentace!A104=0,\"\",Prezentace!A104)","v":""},{"$f":"IF(Prezentace!B104=0,\"\",Prezentace!B104)","v":""},{"$f":"Prezentace!D104","v":"P"},{"$f":"IF(Prezentace!F104=0,\"\",Prezentace!F104)","v":""},{"$f":"IF(Prezentace!E104=0,\"\",Prezentace!E104)","v":""},null,null,null,null,null,null,null,null,null,null,null,null,null,null,null,null,{"$f":"(SUM(F102:T102))-U102","v":0}]

{"sheet":"1(M)","index":3,"n_rows":102,"n_cols":20,"rows_kept":102,"cut":false,"hidden":true,"merged":[[0,3,0,18],[0,0,2,0],[0,1,2,1]]}
["Druž.","Kap.",null,"Disciplina 1"]
[]
[null,null,null,null,null,0,1,2,3,4,5,6,7,8,9,10,12,15,"Čas","Součet"]
[{"$f":"IF(Prezentace!A6=0,\"\",Prezentace!A6)","v":""},{"$f":"IF(Prezentace!B6=0,\"\",Prezentace!B6)","v":""},{"$f":"Prezentace!D6","v":"P"},{"$f":"IF(Prezentace!F6=0,\"\",Prezentace!F6)","v":"Martin"},{"$f":"IF(Prezentace!E6=0,\"\",Prezentace!E6)","v":"Adensam "},null,null,null,null,null,null,null,null,null,null,null,null,null,null,{"$f":"(SUM(F4*$F$3,G4*$G$3,H4*$H$3,I4*$I$3,J4*$J$3,K4*$K$3,L4*$L$3,M4*$M$3,N4*$N$3,O4*$O$3,P4*$P$3,Q4*$Q$3,R4*$R$3))-S4","v":0}]
[{"$f":"IF(Prezentace!A7=0,\"\",Prezentace!A7)","v":""},{"$f":"IF(Prezentace!B7=0,\"\",Prezentace!B7)","v":""},{"$f":"Prezentace!D7","v":"R"},{"$f":"IF(Prezentace!F7=0,\"\",Prezentace!F7)","v":"Martin"},{"$f":"IF(Prezentace!E7=0,\"\",Prezentace!E7)","v":"Adensam"},null,null,null,null,null,null,null,null,null,null,null,null,null,null,{"$f":"(SUM(F5*$F$3,G5*$G$3,H5*$H$3,I5*$I$3,J5*$J$3,K5*$K$3,L5*$L$3,M5*$M$3,N5*$N$3,O5*$O$3,P5*$P$3,Q5*$Q$3,R5*$R$3))-S5","v":0}]
[{"$f":"IF(Prezentace!A8=0,\"\",Prezentace!A8)","v":""},{"$f":"IF(Prezentace!B8=0,\"\",Prezentace!B8)","v":""},{"$f":"Prezentace!D8","v":"P"},{"$f":"IF(Prezentace!F8=0,\"\",Prezentace!F8)","v":"Jaroslav"},{"$f":"IF(Prezentace!E8=0,\"\",Prezentace!E8)","v":"Kostříž "},null,null,null,null,null,null,null,null,null,null,null,null,null,null,0]
[{"$f":"IF(Prezentace!A9=0,\"\",Prezentace!A9)","v":""},{"$f":"IF(Prezentace!B9=0,\"\",Prezentace!B9)","v":""},{"$f":"Prezentace!D9","v":"P"},{"$f":"IF(Prezentace!F9=0,\"\",Prezentace!F9)","v":"Miroslav"},{"$f":"IF(Prezentace!E9=0,\"\",Prezentace!E9)","v":"Koch   ml."},null,null,null,null,null,null,null,null,null,null,null,null,null,null,0]
[{"$f":"IF(Prezentace!A10=0,\"\",Prezentace!A10)","v":""},{"$f":"IF(Prezentace!B10=0,\"\",Prezentace!B10)","v":""},{"$f":"Prezentace!D10","v":"P"},{"$f":"IF(Prezentace!F10=0,\"\",Prezentace!F10)","v":"Miroslav"},{"$f":"IF(Prezentace!E10=0,\"\",Prezentace!E10)","v":"Koch  st. "},null,null,null,null,null,null,null,null,null,null,null,null,null,null,0]
[{"$f":"IF(Prezentace!A11=0,\"\",Prezentace!A11)","v":""},{"$f":"IF(Prezentace!B11=0,\"\",Prezentace!B11)","v":""},{"$f":"Prezentace!D11","v":"P"},{"$f":"IF(Prezentace!F11=0,\"\",Prezentace!F11)","v":"Bohumil"},{"$f":"IF(Prezentace!E11=0,\"\",Prezentace!E11)","v":"Herceg"},null,null,null,null,null,null,null,null,null,null,null,null,null,null,0]
[{"$f":"IF(Prezentace!A12=0,\"\",Prezentace!A12)","v":""},{"$f":"IF(Prezentace!B12=0,\"\",Prezentace!B12)","v":""},{"$f":"Prezentace!D12","v":"P"},{"$f":"IF(Prezentace!F12=0,\"\",Prezentace!F12)","v":"Viktor"},{"$f":"IF(Prezentace!E12=0,\"\",Prezentace!E12)","v":"Fuksa  "},null,null,null,null,null,null,null,null,null,null,null,null,null,null,0]
[{"$f":"IF(Prezentace!A13=0,\"\",Prezentace!A13)","v":""},{"$f":"IF(Prezentace!B13=0,\"\",Prezentace!B13)","v":""},{"$f":"Prezentace!D13","v":"P"},{"$f":"IF(Prezentace!F13=0,\"\",Prezentace!F13)","v":"Milan"},{"$f":"IF(Prezentace!E13=0,\"\",Prezentace!E13)","v":"Matějka  ml."},null,null,null,null,null,null,null,null,null,null,null,null,null,null,0]
[{"$f":"IF(Prezentace!A14=0,\"\",Prezentace!A14)","v":""},{"$f":"IF(Prezentace!B14=0,\"\",Prezentace!B14)","v":""},{"$f":"Prezentace!D14","v":"P"},{"$f":"IF(Prezentace!F14=0,\"\",Prezentace!F14)","v":"Michal"},{"$f":"IF(Prezentace!E14=0,\"\",Prezentace!E14)","v":"Svoboda"},null,null,null,null,null,null,null,null,null,null,null,null,null,null,0]
[{"$f":"IF(Prezentace!A15=0,\"\",Prezentace!A15)","v":""},{"$f":"IF(Prezentace!B15=0,\"\",Prezentace!B15)","v":""},{"$f":"Prezentace!D15","v":"R"},{"$f":"IF(Prezentace!F15=0,\"\",Prezentace!F15)","v":"Lukáš"},{"$f":"IF(Prezentace!E15=0,\"\",Prezentace!E15)","v":"Bouda "},null,null,null,null,null,null,null,null,null,null,null,null,null,null,0]
[{"$f":"IF(Prezentace!A16=0,\"\",Prezentace!A16)","v":""},{"$f":"IF(Prezentace!B16=0,\"\",Prezentace!B16)","v":""},{"$f":"Prezentace!D16","v":"P"},{"$f":"IF(Prezentace!F16=0,\"\",Prezentace!F16)","v":"Lukáš"},{"$f":"IF(Prezentace!E16=0,\"\",Prezentace!E16)","v":"Bouda "},null,null,null,null,null,null,null,null,null,null,null,null,null,null,0]
[{"$f":"IF(Prezentace!A17=0,\"\",Prezentace!A17)","v":""},{"$f":"IF(Prezentace!B17=0,\"\",Prezentace!B17)","v":""},{"$f":"Prezentace!D17","v":"P"},{"$f":"IF(Prezentace!F17=0,\"\",Prezentace!F17)","v":"Pavel"},{"$f":"IF(Prezentace!E17=0,\"\",Prezentace!E17)","v":"Koltai"},null,null,null,null,null,null,null,null,null,null,null,null,null,null,0]
[{"$f":"IF(Prezentace!A18=0,\"\",Prezentace!A18)","v":""},{"$f":"IF(Prezentace!B18=0,\"\",Prezentace!B18)","v":""},{"$f":"Prezentace!D18","v":"P"},{"$f":"IF(Prezentace!F18=0,\"\",Prezentace!F18)","v":"Vladislav"},{"$f":"IF(Prezentace!E18=0,\"\",Prezentace!E18)","v":"Přibyl"},null,null,null,null,null,null,null,null,null,null,null,null,null,null,0]
[{"$f":"IF(Prezentace!A19=0,\"\",Prezentace!A19)","v":""},{"$f":"IF(Prezentace!B19=0,\"\",Prezentace!B19)","v":""},{"$f":"Prezentace!D19","v":"P"},{"$f":"IF(Prezentace!F19=0,\"\",Prezentace!F19)","v":"Milan"},{"$f":"IF(Prezentace!E19=0,\"\",Prezentace!E19)","v":"Matějka st."},null,null,null,null,null,null,null,null,null,null,null,null,null,null,0]
[{"$f":"IF(Prezentace!A20=0,\"\",Prezentace!A20)","v":""},{"$f":"IF(Prezentace!B20=0,\"\",Prezentace!B20)","v":""},{"$f":"Prezentace!D20","v":"P"},{"$f":"IF(Prezentace!F20=0,\"\",Prezentace!F20)","v":"Miroslav"},{"$f":"IF(Prezentace!E20=0,\"\",Prezentace!E20)","v":"Fiala  "},null,null,null,null,null,null,null,null,null,null,null,null,null,null,0]
[{"$f":"IF(Prezentace!A21=0,\"\",Prezentace!A21)","v":""},{"$f":"IF(Prezentace!B21=0,\"\",Prezentace!B21)","v":""},{"$f":"Prezentace!D21","v":"P"},{"$f":"IF(Prezentace!F21=0,\"\",Prezentace!F21)","v":"Karel"},{"$f":"IF(Prezentace!E21=0,\"\",Prezentace!E21)","v":"Gažák "},null,null,null,null,null,null,null,null,null,null,null,null,null,null,0]
[{"$f":"IF(Prezentace!A22=0,\"\",Prezentace!A22)","v":""},{"$f":"IF(Prezentace!B22=0,\"\",Prezentace!B22)","v":""},{"$f":"Prezentace!D22","v":"P"},{"$f":"IF(Prezentace!F22=0,\"\",Prezentace!F22)","v":"Václav"},{"$f":"IF(Prezentace!E22=0,\"\",Prezentace!E22)","v":"Landkammer"},null,null,null,null,null,null,null,null,null,null,null,null,null,null,0]
[{"$f":"IF(Prezentace!A23=0,\"\",Prezentace!A23)","v":""},{"$f":"IF(Prezentace!B23=0,\"\",Prezentace!B23)","v":""},{"$f":"Prezentace!D23","v":"P"},{"$f":"IF(Prezentace!F23=0,\"\",Prezentace!F23)","v":"Vojtěch"},{"$f":"IF(Prezentace!E23=0,\"\",Prezentace!E23)","v":"Brejžek "},null,null,null,null,null,null,null,null,null,null,null,null,null,null,0]
[{"$f":"IF(Prezentace!A24=0,\"\",Prezentace!A24)","v":""},{"$f":"IF(Prezentace!B24=0,\"\",Prezentace!B24)","v":""},{"$f":"Prezentace!D24","v":"P"},{"$f":"IF(Prezentace!F24=0,\"\",Prezentace!F24)","v":"Antonín"},{"$f":"IF(Prezentace!E24=0,\"\",Prezentace!E24)","v":"Urbanec  "},null,null,null,null,null,null,null,null,null,null,null,null,null,null,0]
[{"$f":"IF(Prezentace!A25=0,\"\",Prezentace!A25)","v":""},{"$f":"IF(Prezentace!B25=0,\"\",Prezentace!B25)","v":""},{"$f":"Prezentace!D25","v":"P"},{"$f":"IF(Prezentace!F25=0,\"\",Prezentace!F25)","v":"Milan"},{"$f":"IF(Prezentace!E25=0,\"\",Prezentace!E25)","v":"Jílek  "},null,null,null,null,null,null,null,null,null,null,null,null,null,null,0]
[{"$f":"IF(Prezentace!A26=0,\"\",Prezentace!A26)","v":""},{"$f":"IF(Prezentace!B26=0,\"\",Prezentace!B26)","v":""},{"$f":"Prezentace!D26","v":"P"},{"$f":"IF(Prezentace!F26=0,\"\",Prezentace!F26)","v":"Václav"},{"$f":"IF(Prezentace!E26=0,\"\",Prezentace!E26)","v":"Jírů"},null,null,null,null,null,null,null,null,null,null,null,null,null,null,0]
[{"$f":"IF(Prezentace!A27=0,\"\",Prezentace!A27)","v":""},{"$f":"IF(Prezentace!B27=0,\"\",Prezentace!B27)","v":""},{"$f":"Prezentace!D27","v":"P"},{"$f":"IF(Prezentace!F27=0,\"\",Prezentace!F27)","v":"Milan"},{"$f":"IF(Prezentace!E27=0,\"\",Prezentace!E27)","v":"Krupica"},null,null,null,null,null,null,null,null,null,null,null,null,null,null,0]
[{"$f":"IF(Prezentace!A28=0,\"\",Prezentace!A28)","v":""},{"$f":"IF(Prezentace!B28=0,\"\",Prezentace!B28)","v":""},{"$f":"Prezentace!D28","v":"R"},{"$f":"IF(Prezentace!F28=0,\"\",Prezentace!F28)","v":"Milan"},{"$f":"IF(Prezentace!E28=0,\"\",Prezentace!E28)","v":"Krupica "},null,null,null,null,null,null,null,null,null,null,null,null,null,null,0]
[{"$f":"IF(Prezentace!A29=0,\"\",Prezentace!A29)","v":""},{"$f":"IF(Prezentace!B29=0,\"\",Prezentace!B29)","v":""},{"$f":"Prezentace!D29","v":"P"},{"$f":"IF(Prezentace!F29=0,\"\",Prezentace!F29)","v":"Miloslav"},{"$f":"IF(Prezentace!E29=0,\"\",Prezentace!E29)","v":"Petržílka"},null,null,null,null,null,null,null,null,null,null,null,null,null,null,0]
[{"$f":"IF(Prezentace!A30=0,\"\",Prezentace!A30)","v":""},{"$f":"IF(Prezentace!B30=0,\"\",Prezentace!B30)","v":""},{"$f":"Prezentace!D30","v":"R"},{"$f":"IF(Prezentace!F30=0,\"\",Prezentace!F30)","v":"Aleš"},{"$f":"IF(Prezentace!E30=0,\"\",Prezentace!E30)","v":"Seitl "},null,null,null,null,null,null,null,null,null,null,null,null,null,null,0]
[{"$f":"IF(Prezentace!A31=0,\"\",Prezentace!A31)","v":""},{"$f":"IF(Prezentace!B31=0,\"\",Prezentace!B31)","v":""},{"$f":"Prezentace!D31","v":"P"},{"$f":"IF(Prezentace!F31=0,\"\",Prezentace!F31)","v":"Aleš"},{"$f":"IF(Prezentace!E31=0,\"\",Prezentace!E31)","v":"Seitl "},null,null,null,null,null,null,null,null,null,null,null,null,null,null,0]
[{"$f":"IF(Prezentace!A32=0,\"\",Prezentace!A32)","v":""},{"$f":"IF(Prezentace!B32=0,\"\",Prezentace!B32)","v":""},{"$f":"Prezentace!D32","v":"P"},{"$f":"IF(Prezentace!F32=0,\"\",Prezentace!F32)","v":"Karel"},{"$f":"IF(Prezentace!E32=0,\"\",Prezentace!E32)","v":"Seitl"},null,null,null,null,null,null,null,null,null,null,null,null,null,null,0]
[{"$f":"IF(Prezentace!A33=0,\"\",Prezentace!A33)","v":""},{"$f":"IF(Prezentace!B33=0,\"\",Prezentace!B33)","v":""},{"$f":"Prezentace!D33","v":"P"},{"$f":"IF(Prezentace!F33=0,\"\",Prezentace!F33)","v":"David"},{"$f":"IF(Prezentace!E33=0,\"\",Prezentace!E33)","v":"Nikodým"},null,null,null,null,null,null,null,null,null,null,null,null,null,null,0]
[{"$f":"IF(Prezentace!A34=0,\"\",Prezentace!A34)","v":""},{"$f":"IF(Prezentace!B34=0,\"\",Prezentace!B34)","v":""},{"$f":"Prezentace!D34","v":"R"},{"$f":"IF(Prezentace!F34=0,\"\",Prezentace!F34)","v":"David"},{"$f":"IF(Prezentace!E34=0,\"\",Prezentace!E34)","v":"Nikodým "},null,null,null,null,null,null,null,null,null,null,null,null,null,null,0]
[{"$f":"IF(Prezentace!A35=0,\"\",Prezentace!A35)","v":""},{"$f":"IF(Prezentace!B35=0,\"\",Prezentace!B35)","v":""},{"$f":"Prezentace!D35","v":"P"},{"$f":"IF(Prezentace!F35=0,\"\",Prezentace!F35)","v":"Lukáš"},{"$f":"IF(Prezentace!E35=0,\"\",Prezentace!E35)","v":"Hobza"},null,null,null,null,null,null,null,null,null,null,null,null,null,null,0]
[{"$f":"IF(Prezentace!A36=0,\"\",Prezentace!A36)","v":""},{"$f":"IF(Prezentace!B36=0,\"\",Prezentace!B36)","v":""},{"$f":"Prezentace!D36","v":"P"},{"$f":"IF(Prezentace!F36=0,\"\",Prezentace!F36)","v":"Antonín"},{"$f":"IF(Prezentace!E36=0,\"\",Prezentace!E36)","v":"Jelínek "},null,null,null,null,null,null,null,null,null,null,null,null,null,null,0]
[{"$f":"IF(Prezentace!A37=0,\"\",Prezentace!A37)","v":""},{"$f":"IF(Prezentace!B37=0,\"\",Prezentace!B37)","v":""},{"$f":"Prezentace!D37","v":"R"},{"$f":"IF(Prezentace!F37=0,\"\",Prezentace!F37)","v":"Antonín"},{"$f":"IF(Prezentace!E37=0,\"\",Prezentace!E37)","v":"Jelínek "},null,null,null,null,null,null,null,null,null,null,null,null,null,null,0]
[{"$f":"IF(Prezentace!A38=0,\"\",Prezentace!A38)","v":""},{"$f":"IF(Prezentace!B38=0,\"\",Prezentace!B38)","v":""},{"$f":"Prezentace!D38","v":"P"},{"$f":"IF(Prezentace!F38=0,\"\",Prezentace!F38)","v":"Ladislav"},{"$f":"IF(Prezentace!E38=0,\"\",Prezentace!E38)","v":"Píša "},null,null,null,null,null,null,null,null,null,null,null,null,null,null,0]
[{"$f":"IF(Prezentace!A39=0,\"\",Prezentace!A39)","v":""},{"$f":"IF(Prezentace!B39=0,\"\",Prezentace!B39)","v":""},{"$f":"Prezentace!D39","v":"P"},{"$f":"IF(Prezentace!F39=0,\"\",Prezentace!F39)","v":"Štefan"},{"$f":"IF(Prezentace!E39=0,\"\",Prezentace!E39)","v":"Mesároš"},null,null,null,null,null,null,null,null,null,null,null,null,null,null,0]
[{"$f":"IF(Prezentace!A40=0,\"\",Prezentace!A40)","v":""},{"$f":"IF(Prezentace!B40=0,\"\",Prezentace!B40)","v":""},{"$f":"Prezentace!D40","v":"P"},{"$f":"IF(Prezentace!F40=0,\"\",Prezentace!F40)","v":"Pavel"},{"$f":"IF(Prezentace!E40=0,\"\",Prezentace!E40)","v":"Červenka"},null,null,null,null,null,null,null,null,null,null,null,null,null,null,{"$f":"(SUM(F38*$F$3,G38*$G$3,H38*$H$3,I38*$I$3,J38*$J$3,K38*$K$3,L38*$L$3,M38*$M$3,N38*$N$3,O38*$O$3,P38*$P$3,Q38*$Q$3,R38*$R$3))-S38","v":0}]
[{"$f":"IF(Prezentace!A41=0,\"\",Prezentace!A41)","v":""},{"$f":"IF(Prezentace!B41=0,\"\",Prezentace!B41)","v":""},{"$f":"Prezentace!D41","v":"R"},{"$f":"IF(Prezentace!F41=0,\"\",Prezentace!F41)","v":"Pavel"},{"$f":"IF(Prezentace!E41=0,\"\",Prezentace!E41)","v":"Červenka "},null,null,null,null,null,null,null,null,null,null,null,null,null,null,0]
[{"$f":"IF(Prezentace!A42=0,\"\",Prezentace!A42)","v":""},{"$f":"IF(Prezentace!B42=0,\"\",Prezentace!B42)","v":""},{"$f":"Prezentace!D42","v":"P"},{"$f":"IF(Prezentace!F42=0,\"\",Prezentace!F42)","v":"Jiří"},{"$f":"IF(Prezentace!E42=0,\"\",Prezentace!E42)","v":"Švihálek "},null,null,null,null,null,null,null,null,null,null,null,null,null,null,0]
[{"$f":"IF(Prezentace!A43=0,\"\",Prezentace!A43)","v":""},{"$f":"IF(Prezentace!B43=0,\"\",Prezentace!B43)","v":""},{"$f":"Prezentace!D43","v":"R"},{"$f":"IF(Prezentace!F43=0,\"\",Prezentace!F43)","v":"Jiří"},{"$f":"IF(Prezentace!E43=0,\"\",Prezentace!E43)","v":"Švihálek "},null,null,null,null,null,null,null,null,null,null,null,null,null,null,0]
[{"$f":"IF(Prezentace!A44=0,\"\",Prezentace!A44)","v":""},{"$f":"IF(Prezentace!B44=0,\"\",Prezentace!B44)","v":""},{"$f":"Prezentace!D44","v":"P"},{"$f":"IF(Prezentace!F44=0,\"\",Prezentace!F44)","v":"František"},{"$f":"IF(Prezentace!E44=0,\"\",Prezentace!E44)","v":"Toman "},null,null,null,null,null,null,null,null,null,null,null,null,null,null,0]
[{"$f":"IF(Prezentace!A45=0,\"\",Prezentace!A45)","v":""},{"$f":"IF(Prezentace!B45=0,\"\",Prezentace!B45)","v":""},{"$f":"Prezentace!D45","v":"P"},{"$f":"IF(Prezentace!F45=0,\"\",Prezentace!F45)","v":"Vladimír"},{"$f":"IF(Prezentace!E45=0,\"\",Prezentace!E45)","v":"VejslíK "},null,null,null,null,null,null,null,null,null,null,null,null,null,null,0]
[{"$f":"IF(Prezentace!A46=0,\"\",Prezentace!A46)","v":""},{"$f":"IF(Prezentace!B46=0,\"\",Prezentace!B46)","v":""},{"$f":"Prezentace!D46","v":"P"},{"$f":"IF(Prezentace!F46=0,\"\",Prezentace!F46)","v":"Karel"},{"$f":"IF(Prezentace!E46=0,\"\",Prezentace!E46)","v":"Získal "},null,null,null,null,null,null,null,null,null,null,null,null,null,null,0]
[{"$f":"IF(Prezentace!A47=0,\"\",Prezentace!A47)","v":""},{"$f":"IF(Prezentace!B47=0,\"\",Prezentace!B47)","v":""},{"$f":"Prezentace!D47","v":"R"},{"$f":"IF(Prezentace!F47=0,\"\",Prezentace!F47)","v":"Karel"},{"$f":"IF(Prezentace!E47=0,\"\",Prezentace!E47)","v":"Získal "},null,null,null,null,null,null,null,null,null,null,null,null,null,null,0]
[{"$f":"IF(Prezentace!A48=0,\"\",Prezentace!A48)","v":""},{"$f":"IF(Prezentace!B48=0,\"\",Prezentace!B48)","v":""},{"$f":"Prezentace!D48","v":"P"},{"$f":"IF(Prezentace!F48=0,\"\",Prezentace!F48)","v":"Jaroslav"},{"$f":"IF(Prezentace!E48=0,\"\",Prezentace!E48)","v":"Sokolík "},null,null,null,null,null,null,null,null,null,null,null,null,null,null,0]
[{"$f":"IF(Prezentace!A49=0,\"\",Prezentace!A49)","v":""},{"$f":"IF(Prezentace!B49=0,\"\",Prezentace!B49)","v":""},{"$f":"Prezentace!D49","v":"P"},{"$f":"IF(Prezentace!F49=0,\"\",Prezentace!F49)","v":"Milan"},{"$f":"IF(Prezentace!E49=0,\"\",Prezentace!E49)","v":"Kraus "},null,null,null,null,null,null,null,null,null,null,null,null,null,null,0]
[{"$f":"IF(Prezentace!A50=0,\"\",Prezentace!A50)","v":""},{"$f":"IF(Prezentace!B50=0,\"\",Prezentace!B50)","v":""},{"$f":"Prezentace!D50","v":"P"},{"$f":"IF(Prezentace!F50=0,\"\",Prezentace!F50)","v":""},{"$f":"IF(Prezentace!E50=0,\"\",Prezentace!E50)","v":""},null,null,null,null,null,null,null,null,null,null,null,null,null,null,0]
[{"$f":"IF(Prezentace!A51=0,\"\",Prezentace!A51)","v":""},{"$f":"IF(Prezentace!B51=0,\"\",Prezentace!B51)","v":""},{"$f":"Prezentace!D51","v":"P"},{"$f":"IF(Prezentace!F51=0,\"\",Prezentace!F51)","v":""},{"$f":"IF(Prezentace!E51=0,\"\",Prezentace!E51)","v":""},null,null,null,null,null,null,null,null,null,null,null,null,null,null,0]
[{"$f":"IF(Prezentace!A52=0,\"\",Prezentace!A52)","v":""},{"$f":"IF(Prezentace!B52=0,\"\",Prezentace!B52)","v":""},{"$f":"Prezentace!D52","v":"P"},{"$f":"IF(Prezentace!F52=0,\"\",Prezentace!F52)","v":""},{"$f":"IF(Prezentace!E52=0,\"\",Prezentace!E52)","v":""},null,null,null,null,null,null,null,null,null,null,null,null,null,null,0]
[{"$f":"IF(Prezentace!A53=0,\"\",Prezentace!A53)","v":""},{"$f":"IF(Prezentace!B53=0,\"\",Prezentace!B53)","v":""},{"$f":"Prezentace!D53","v":"P"},{"$f":"IF(Prezentace!F53=0,\"\",Prezentace!F53)","v":""},{"$f":"IF(Prezentace!E53=0,\"\",Prezentace!E53)","v":""},null,null,null,null,null,null,null,null,null,null,null,null,null,null,0]
[{"$f":"IF(Prezentace!A54=0,\"\",Prezentace!A54)","v":""},{"$f":"IF(Prezentace!B54=0,\"\",Prezentace!B54)","v":""},{"$f":"Prezentace!D54","v":"P"},{"$f":"IF(Prezentace!F54=0,\"\",Prezentace!F54)","v":""},{"$f":"IF(Prezentace!E54=0,\"\",Prezentace!E54)","v":""},null,null,null,null,null,null,null,null,null,null,null,null,null,null,0]
[{"$f":"IF(Prezentace!A55=0,\"\",Prezentace!A55)","v":""},{"$f":"IF(Prezentace!B55=0,\"\",Prezentace!B55)","v":""},{"$f":"Prezentace!D55","v":"P"},{"$f":"IF(Prezentace!F55=0,\"\",Prezentace!F55)","v":""},{"$f":"IF(Prezentace!E55=0,\"\",Prezentace!E55)","v":""},null,null,null,null,null,null,null,null,null,null,null,null,null,null,0]
[{"$f":"IF(Prezentace!A56=0,\"\",Prezentace!A56)","v":""},{"$f":"IF(Prezentace!B56=0,\"\",Prezentace!B56)","v":""},{"$f":"Prezentace!D56","v":"P"},{"$f":"IF(Prezentace!F56=0,\"\",Prezentace!F56)","v":""},{"$f":"IF(Prezentace!E56=0,\"\",Prezentace!E56)","v":""},null,null,null,null,null,null,null,null,null,null,null,null,null,null,0]
[{"$f":"IF(Prezentace!A57=0,\"\",Prezentace!A57)","v":""},{"$f":"IF(Prezentace!B57=0,\"\",Prezentace!B57)","v":""},{"$f":"Prezentace!D57","v":"P"},{"$f":"IF(Prezentace!F57=0,\"\",Prezentace!F57)","v":""},{"$f":"IF(Prezentace!E57=0,\"\",Prezentace!E57)","v":""},null,null,null,null,null,null,null,null,null,null,null,null,null,null,0]
[{"$f":"IF(Prezentace!A58=0,\"\",Prezentace!A58)","v":""},{"$f":"IF(Prezentace!B58=0,\"\",Prezentace!B58)","v":""},{"$f":"Prezentace!D58","v":"P"},{"$f":"IF(Prezentace!F58=0,\"\",Prezentace!F58)","v":""},{"$f":"IF(Prezentace!E58=0,\"\",Prezentace!E58)","v":""},null,null,null,null,null,null,null,null,null,null,null,null,null,null,0]
[{"$f":"IF(Prezentace!A59=0,\"\",Prezentace!A59)","v":""},{"$f":"IF(Prezentace!B59=0,\"\",Prezentace!B59)","v":""},{"$f":"Prezentace!D59","v":"P"},{"$f":"IF(Prezentace!F59=0,\"\",Prezentace!F59)","v":""},{"$f":"IF(Prezentace!E59=0,\"\",Prezentace!E59)","v":""},null,null,null,null,null,null,null,null,null,null,null,null,null,null,0]
[{"$f":"IF(Prezentace!A60=0,\"\",Prezentace!A60)","v":""},{"$f":"IF(Prezentace!B60=0,\"\",Prezentace!B60)","v":""},{"$f":"Prezentace!D60","v":"P"},{"$f":"IF(Prezentace!F60=0,\"\",Prezentace!F60)","v":""},{"$f":"IF(Prezentace!E60=0,\"\",Prezentace!E60)","v":""},null,null,null,null,null,null,null,null,null,null,null,null,null,null,0]
[{"$f":"IF(Prezentace!A61=0,\"\",Prezentace!A61)","v":""},{"$f":"IF(Prezentace!B61=0,\"\",Prezentace!B61)","v":""},{"$f":"Prezentace!D61","v":"P"},{"$f":"IF(Prezentace!F61=0,\"\",Prezentace!F61)","v":""},{"$f":"IF(Prezentace!E61=0,\"\",Prezentace!E61)","v":""},null,null,null,null,null,null,null,null,null,null,null,null,null,null,0]
[{"$f":"IF(Prezentace!A62=0,\"\",Prezentace!A62)","v":""},{"$f":"IF(Prezentace!B62=0,\"\",Prezentace!B62)","v":""},{"$f":"Prezentace!D62","v":"P"},{"$f":"IF(Prezentace!F62=0,\"\",Prezentace!F62)","v":""},{"$f":"IF(Prezentace!E62=0,\"\",Prezentace!E62)","v":""},null,null,null,null,null,null,null,null,null,null,null,null,null,null,0]
[{"$f":"IF(Prezentace!A63=0,\"\",Prezentace!A63)","v":""},{"$f":"IF(Prezentace!B63=0,\"\",Prezentace!B63)","v":""},{"$f":"Prezentace!D63","v":"P"},{"$f":"IF(Prezentace!F63=0,\"\",Prezentace!F63)","v":""},{"$f":"IF(Prezentace!E63=0,\"\",Prezentace!E63)","v":""},null,null,null,null,null,null,null,null,null,null,null,null,null,null,0]
[{"$f":"IF(Prezentace!A64=0,\"\",Prezentace!A64)","v":""},{"$f":"IF(Prezentace!B64=0,\"\",Prezentace!B64)","v":""},{"$f":"Prezentace!D64","v":"P"},{"$f":"IF(Prezentace!F64=0,\"\",Prezentace!F64)","v":""},{"$f":"IF(Prezentace!E64=0,\"\",Prezentace!E64)","v":""},null,null,null,null,null,null,null,null,null,null,null,null,null,null,0]
[{"$f":"IF(Prezentace!A65=0,\"\",Prezentace!A65)","v":""},{"$f":"IF(Prezentace!B65=0,\"\",Prezentace!B65)","v":""},{"$f":"Prezentace!D65","v":"P"},{"$f":"IF(Prezentace!F65=0,\"\",Prezentace!F65)","v":""},{"$f":"IF(Prezentace!E65=0,\"\",Prezentace!E65)","v":""},null,null,null,null,null,null,null,null,null,null,null,null,null,null,0]
[{"$f":"IF(Prezentace!A66=0,\"\",Prezentace!A66)","v":""},{"$f":"IF(Prezentace!B66=0,\"\",Prezentace!B66)","v":""},{"$f":"Prezentace!D66","v":"P"},{"$f":"IF(Prezentace!F66=0,\"\",Prezentace!F66)","v":""},{"$f":"IF(Prezentace!E66=0,\"\",Prezentace!E66)","v":""},null,null,null,null,null,null,null,null,null,null,null,null,null,null,0]
[{"$f":"IF(Prezentace!A67=0,\"\",Prezentace!A67)","v":""},{"$f":"IF(Prezentace!B67=0,\"\",Prezentace!B67)","v":""},{"$f":"Prezentace!D67","v":"P"},{"$f":"IF(Prezentace!F67=0,\"\",Prezentace!F67)","v":""},{"$f":"IF(Prezentace!E67=0,\"\",Prezentace!E67)","v":""},null,null,null,null,null,null,null,null,null,null,null,null,null,null,0]
[{"$f":"IF(Prezentace!A68=0,\"\",Prezentace!A68)","v":""},{"$f":"IF(Prezentace!B68=0,\"\",Prezentace!B68)","v":""},{"$f":"Prezentace!D68","v":"P"},{"$f":"IF(Prezentace!F68=0,\"\",Prezentace!F68)","v":""},{"$f":"IF(Prezentace!E68=0,\"\",Prezentace!E68)","v":""},null,null,null,null,null,null,null,null,null,null,null,null,null,null,0]
[{"$f":"IF(Prezentace!A69=0,\"\",Prezentace!A69)","v":""},{"$f":"IF(Prezentace!B69=0,\"\",Prezentace!B69)","v":""},{"$f":"Prezentace!D69","v":"P"},{"$f":"IF(Prezentace!F69=0,\"\",Prezentace!F69)","v":""},{"$f":"IF(Prezentace!E69=0,\"\",Prezentace!E69)","v":""},null,null,null,null,null,null,null,null,null,null,null,null,null,null,0]
[{"$f":"IF(Prezentace!A70=0,\"\",Prezentace!A70)","v":""},{"$f":"IF(Prezentace!B70=0,\"\",Prezentace!B70)","v":""},{"$f":"Prezentace!D70","v":"P"},{"$f":"IF(Prezentace!F70=0,\"\",Prezentace!F70)","v":""},{"$f":"IF(Prezentace!E70=0,\"\",Prezentace!E70)","v":""},null,null,null,null,null,null,null,null,null,null,null,null,null,null,0]
[{"$f":"IF(Prezentace!A71=0,\"\",Prezentace!A71)","v":""},{"$f":"IF(Prezentace!B71=0,\"\",Prezentace!B71)","v":""},{"$f":"Prezentace!D71","v":"P"},{"$f":"IF(Prezentace!F71=0,\"\",Prezentace!F71)","v":""},{"$f":"IF(Prezentace!E71=0,\"\",Prezentace!E71)","v":""},null,null,null,null,null,null,null,null,null,null,null,null,null,null,0]
[{"$f":"IF(Prezentace!A72=0,\"\",Prezentace!A72)","v":""},{"$f":"IF(Prezentace!B72=0,\"\",Prezentace!B72)","v":""},{"$f":"Prezentace!D72","v":"P"},{"$f":"IF(Prezentace!F72=0,\"\",Prezentace!F72)","v":""},{"$f":"IF(Prezentace!E72=0,\"\",Prezentace!E72)","v":""},null,null,null,null,null,null,null,null,null,null,null,null,null,null,0]
[{"$f":"IF(Prezentace!A73=0,\"\",Prezentace!A73)","v":""},{"$f":"IF(Prezentace!B73=0,\"\",Prezentace!B73)","v":""},{"$f":"Prezentace!D73","v":"P"},{"$f":"IF(Prezentace!F73=0,\"\",Prezentace!F73)","v":""},{"$f":"IF(Prezentace!E73=0,\"\",Prezentace!E73)","v":""},null,null,null,null,null,null,null,null,null,null,null,null,null,null,0]
[{"$f":"IF(Prezentace!A74=0,\"\",Prezentace!A74)","v":""},{"$f":"IF(Prezentace!B74=0,\"\",Prezentace!B74)","v":""},{"$f":"Prezentace!D74","v":"P"},{"$f":"IF(Prezentace!F74=0,\"\",Prezentace!F74)","v":""},{"$f":"IF(Prezentace!E74=0,\"\",Prezentace!E74)","v":""},null,null,null,null,null,null,null,null,null,null,null,null,null,null,0]
[{"$f":"IF(Prezentace!A75=0,\"\",Prezentace!A75)","v":""},{"$f":"IF(Prezentace!B75=0,\"\",Prezentace!B75)","v":""},{"$f":"Prezentace!D75","v":"P"},{"$f":"IF(Prezentace!F75=0,\"\",Prezentace!F75)","v":""},{"$f":"IF(Prezentace!E75=0,\"\",Prezentace!E75)","v":""},null,null,null,null,null,null,null,null,null,null,null,null,null,null,0]
[{"$f":"IF(Prezentace!A76=0,\"\",Prezentace!A76)","v":""},{"$f":"IF(Prezentace!B76=0,\"\",Prezentace!B76)","v":""},{"$f":"Prezentace!D76","v":"P"},{"$f":"IF(Prezentace!F76=0,\"\",Prezentace!F76)","v":""},{"$f":"IF(Prezentace!E76=0,\"\",Prezentace!E76)","v":""},null,null,null,null,null,null,null,null,null,null,null,null,null,null,0]
[{"$f":"IF(Prezentace!A77=0,\"\",Prezentace!A77)","v":""},{"$f":"IF(Prezentace!B77=0,\"\",Prezentace!B77)","v":""},{"$f":"Prezentace!D77","v":"P"},{"$f":"IF(Prezentace!F77=0,\"\",Prezentace!F77)","v":""},{"$f":"IF(Prezentace!E77=0,\"\",Prezentace!E77)","v":""},null,null,null,null,null,null,null,null,null,null,null,null,null,null,0]
[{"$f":"IF(Prezentace!A78=0,\"\",Prezentace!A78)","v":""},{"$f":"IF(Prezentace!B78=0,\"\",Prezentace!B78)","v":""},{"$f":"Prezentace!D78","v":"P"},{"$f":"IF(Prezentace!F78=0,\"\",Prezentace!F78)","v":""},{"$f":"IF(Prezentace!E78=0,\"\",Prezentace!E78)","v":""},null,null,null,null,null,null,null,null,null,null,null,null,null,null,0]
[{"$f":"IF(Prezentace!A79=0,\"\",Prezentace!A79)","v":""},{"$f":"IF(Prezentace!B79=0,\"\",Prezentace!B79)","v":""},{"$f":"Prezentace!D79","v":"P"},{"$f":"IF(Prezentace!F79=0,\"\",Prezentace!F79)","v":""},{"$f":"IF(Prezentace!E79=0,\"\",Prezentace!E79)","v":""},null,null,null,null,null,null,null,null,null,null,null,null,null,null,0]
[{"$f":"IF(Prezentace!A80=0,\"\",Prezentace!A80)","v":""},{"$f":"IF(Prezentace!B80=0,\"\",Prezentace!B80)","v":""},{"$f":"Prezentace!D80","v":"P"},{"$f":"IF(Prezentace!F80=0,\"\",Prezentace!F80)","v":""},{"$f":"IF(Prezentace!E80=0,\"\",Prezentace!E80)","v":""},null,null,null,null,null,null,null,null,null,null,null,null,null,null,0]
[{"$f":"IF(Prezentace!A81=0,\"\",Prezentace!A81)","v":""},{"$f":"IF(Prezentace!B81=0,\"\",Prezentace!B81)","v":""},{"$f":"Prezentace!D81","v":"P"},{"$f":"IF(Prezentace!F81=0,\"\",Prezentace!F81)","v":""},{"$f":"IF(Prezentace!E81=0,\"\",Prezentace!E81)","v":""},null,null,null,null,null,null,null,null,null,null,null,null,null,null,0]
[{"$f":"IF(Prezentace!A82=0,\"\",Prezentace!A82)","v":""},{"$f":"IF(Prezentace!B82=0,\"\",Prezentace!B82)","v":""},{"$f":"Prezentace!D82","v":"P"},{"$f":"IF(Prezentace!F82=0,\"\",Prezentace!F82)","v":""},{"$f":"IF(Prezentace!E82=0,\"\",Prezentace!E82)","v":""},null,null,null,null,null,null,null,null,null,null,null,null,null,null,0]
[{"$f":"IF(Prezentace!A83=0,\"\",Prezentace!A83)","v":""},{"$f":"IF(Prezentace!B83=0,\"\",Prezentace!B83)","v":""},{"$f":"Prezentace!D83","v":"P"},{"$f":"IF(Prezentace!F83=0,\"\",Prezentace!F83)","v":""},{"$f":"IF(Prezentace!E83=0,\"\",Prezentace!E83)","v":""},null,null,null,null,null,null,null,null,null,null,null,null,null,null,0]
[{"$f":"IF(Prezentace!A84=0,\"\",Prezentace!A84)","v":""},{"$f":"IF(Prezentace!B84=0,\"\",Prezentace!B84)","v":""},{"$f":"Prezentace!D84","v":"P"},{"$f":"IF(Prezentace!F84=0,\"\",Prezentace!F84)","v":""},{"$f":"IF(Prezentace!E84=0,\"\",Prezentace!E84)","v":""},null,null,null,null,null,null,null,null,null,null,null,null,null,null,0]
[{"$f":"IF(Prezentace!A85=0,\"\",Prezentace!A85)","v":""},{"$f":"IF(Prezentace!B85=0,\"\",Prezentace!B85)","v":""},{"$f":"Prezentace!D85","v":"P"},{"$f":"IF(Prezentace!F85=0,\"\",Prezentace!F85)","v":""},{"$f":"IF(Prezentace!E85=0,\"\",Prezentace!E85)","v":""},null,null,null,null,null,null,null,null,null,null,null,null,null,null,0]
[{"$f":"IF(Prezentace!A86=0,\"\",Prezentace!A86)","v":""},{"$f":"IF(Prezentace!B86=0,\"\",Prezentace!B86)","v":""},{"$f":"Prezentace!D86","v":"P"},{"$f":"IF(Prezentace!F86=0,\"\",Prezentace!F86)","v":""},{"$f":"IF(Prezentace!E86=0,\"\",Prezentace!E86)","v":""},null,null,null,null,null,null,null,null,null,null,null,null,null,null,0]
[{"$f":"IF(Prezentace!A87=0,\"\",Prezentace!A87)","v":""},{"$f":"IF(Prezentace!B87=0,\"\",Prezentace!B87)","v":""},{"$f":"Prezentace!D87","v":"P"},{"$f":"IF(Prezentace!F87=0,\"\",Prezentace!F87)","v":""},{"$f":"IF(Prezentace!E87=0,\"\",Prezentace!E87)","v":""},null,null,null,null,null,null,null,null,null,null,null,null,null,null,0]
[{"$f":"IF(Prezentace!A88=0,\"\",Prezentace!A88)","v":""},{"$f":"IF(Prezentace!B88=0,\"\",Prezentace!B88)","v":""},{"$f":"Prezentace!D88","v":"P"},{"$f":"IF(Prezentace!F88=0,\"\",Prezentace!F88)","v":""},{"$f":"IF(Prezentace!E88=0,\"\",Prezentace!E88)","v":""},null,null,null,null,null,null,null,null,null,null,null,null,null,null,0]
[{"$f":"IF(Prezentace!A89=0,\"\",Prezentace!A89)","v":""},{"$f":"IF(Prezentace!B89=0,\"\",Prezentace!B89)","v":""},{"$f":"Prezentace!D89","v":"P"},{"$f":"IF(Prezentace!F89=0,\"\",Prezentace!F89)","v":""},{"$f":"IF(Prezentace!E89=0,\"\",Prezentace!E89)","v":""},null,null,null,null,null,null,null,null,null,null,null,null,null,null,0]
[{"$f":"IF(Prezentace!A90=0,\"\",Prezentace!A90)","v":""},{"$f":"IF(Prezentace!B90=0,\"\",Prezentace!B90)","v":""},{"$f":"Prezentace!D90","v":"P"},{"$f":"IF(Prezentace!F90=0,\"\",Prezentace!F90)","v":""},{"$f":"IF(Prezentace!E90=0,\"\",Prezentace!E90)","v":""},null,null,null,null,null,null,null,null,null,null,null,null,null,null,0]
[{"$f":"IF(Prezentace!A91=0,\"\",Prezentace!A91)","v":""},{"$f":"IF(Prezentace!B91=0,\"\",Prezentace!B91)","v":""},{"$f":"Prezentace!D91","v":"P"},{"$f":"IF(Prezentace!F91=0,\"\",Prezentace!F91)","v":""},{"$f":"IF(Prezentace!E91=0,\"\",Prezentace!E91)","v":""},null,null,null,null,null,null,null,null,null,null,null,null,null,null,0]
[{"$f":"IF(Prezentace!A92=0,\"\",Prezentace!A92)","v":""},{"$f":"IF(Prezentace!B92=0,\"\",Prezentace!B92)","v":""},{"$f":"Prezentace!D92","v":"P"},{"$f":"IF(Prezentace!F92=0,\"\",Prezentace!F92)","v":""},{"$f":"IF(Prezentace!E92=0,\"\",Prezentace!E92)","v":""},null,null,null,null,null,null,null,null,null,null,null,null,null,null,0]
[{"$f":"IF(Prezentace!A93=0,\"\",Prezentace!A93)","v":""},{"$f":"IF(Prezentace!B93=0,\"\",Prezentace!B93)","v":""},{"$f":"Prezentace!D93","v":"P"},{"$f":"IF(Prezentace!F93=0,\"\",Prezentace!F93)","v":""},{"$f":"IF(Prezentace!E93=0,\"\",Prezentace!E93)","v":""},null,null,null,null,null,null,null,null,null,null,null,null,null,null,0]
[{"$f":"IF(Prezentace!A94=0,\"\",Prezentace!A94)","v":""},{"$f":"IF(Prezentace!B94=0,\"\",Prezentace!B94)","v":""},{"$f":"Prezentace!D94","v":"P"},{"$f":"IF(Prezentace!F94=0,\"\",Prezentace!F94)","v":""},{"$f":"IF(Prezentace!E94=0,\"\",Prezentace!E94)","v":""},null,null,null,null,null,null,null,null,null,null,null,null,null,null,0]
[{"$f":"IF(Prezentace!A95=0,\"\",Prezentace!A95)","v":""},{"$f":"IF(Prezentace!B95=0,\"\",Prezentace!B95)","v":""},{"$f":"Prezentace!D95","v":"P"},{"$f":"IF(Prezentace!F95=0,\"\",Prezentace!F95)","v":""},{"$f":"IF(Prezentace!E95=0,\"\",Prezentace!E95)","v":""},null,null,null,null,null,null,null,null,null,null,null,null,null,null,0]
[{"$f":"IF(Prezentace!A96=0,\"\",Prezentace!A96)","v":""},{"$f":"IF(Prezentace!B96=0,\"\",Prezentace!B96)","v":""},{"$f":"Prezentace!D96","v":"P"},{"$f":"IF(Prezentace!F96=0,\"\",Prezentace!F96)","v":""},{"$f":"IF(Prezentace!E96=0,\"\",Prezentace!E96)","v":""},null,null,null,null,null,null,null,null,null,null,null,null,null,null,0]
[{"$f":"IF(Prezentace!A97=0,\"\",Prezentace!A97)","v":""},{"$f":"IF(Prezentace!B97=0,\"\",Prezentace!B97)","v":""},{"$f":"Prezentace!D97","v":"P"},{"$f":"IF(Prezentace!F97=0,\"\",Prezentace!F97)","v":""},{"$f":"IF(Prezentace!E97=0,\"\",Prezentace!E97)","v":""},null,null,null,null,null,null,null,null,null,null,null,null,null,null,0]
[{"$f":"IF(Prezentace!A98=0,\"\",Prezentace!A98)","v":""},{"$f":"IF(Prezentace!B98=0,\"\",Prezentace!B98)","v":""},{"$f":"Prezentace!D98","v":"P"},{"$f":"IF(Prezentace!F98=0,\"\",Prezentace!F98)","v":""},{"$f":"IF(Prezentace!E98=0,\"\",Prezentace!E98)","v":""},null,null,null,null,null,null,null,null,null,null,null,null,null,null,0]
[{"$f":"IF(Prezentace!A99=0,\"\",Prezentace!A99)","v":""},{"$f":"IF(Prezentace!B99=0,\"\",Prezentace!B99)","v":""},{"$f":"Prezentace!D99","v":"P"},{"$f":"IF(Prezentace!F99=0,\"\",Prezentace!F99)","v":""},{"$f":"IF(Prezentace!E99=0,\"\",Prezentace!E99)","v":""},null,null,null,null,null,null,null,null,null,null,null,null,null,null,0]
[{"$f":"IF(Prezentace!A100=0,\"\",Prezentace!A100)","v":""},{"$f":"IF(Prezentace!B100=0,\"\",Prezentace!B100)","v":""},"P",{"$f":"IF(Prezentace!F100=0,\"\",Prezentace!F100)","v":""},{"$f":"IF(Prezentace!E100=0,\"\",Prezentace!E100)","v":""},null,null,null,null,null,null,null,null,null,null,null,null,null,null,0]
[{"$f":"IF(Prezentace!A101=0,\"\",Prezentace!A101)","v":""},{"$f":"IF(Prezentace!B101=0,\"\",Prezentace!B101)","v":""},{"$f":"Prezentace!D101","v":"P"},{"$f":"IF(Prezentace!F101=0,\"\",Prezentace!F101)","v":""},{"$f":"IF(Prezentace!E101=0,\"\",Prezentace!E101)","v":""},null,null,null,null,null,null,null,null,null,null,null,null,null,null,0]
[{"$f":"IF(Prezentace!A102=0,\"\",Prezentace!A102)","v":""},{"$f":"IF(Prezentace!B102=0,\"\",Prezentace!B102)","v":""},{"$f":"Prezentace!D102","v":"P"},{"$f":"IF(Prezentace!F102=0,\"\",Prezentace!F102)","v":""},{"$f":"IF(Prezentace!E102=0,\"\",Prezentace!E102)","v":""},null,null,null,null,null,null,null,null,null,null,null,null,null,null,0]
[{"$f":"IF(Prezentace!A103=0,\"\",Prezentace!A103)","v":""},{"$f":"IF(Prezentace!B103=0,\"\",Prezentace!B103)","v":""},{"$f":"Prezentace!D103","v":"P"},{"$f":"IF(Prezentace!F103=0,\"\",Prezentace!F103)","v":""},{"$f":"IF(Prezentace!E103=0,\"\",Prezentace!E103)","v":""},null,null,null,null,null,null,null,null,null,null,null,null,null,null,0]
[{"$f":"IF(Prezentace!A104=0,\"\",Prezentace!A104)","v":""},{"$f":"IF(Prezentace!B104=0,\"\",Prezentace!B104)","v":""},"P",{"$f":"IF(Prezentace!F104=0,\"\",Prezentace!F104)","v":""},{"$f":"IF(Prezentace!E104=0,\"\",Prezentace!E104)","v":""},null,null,null,null,null,null,null,null,null,null,null,null,null,null,{"$f":"(SUM(F102*$F$3,G102*$G$3,H102*$H$3,I102*$I$3,J102*$J$3,K102*$K$3,L102*$L$3,M102*$M$3,N102*$N$3,O102*$O$3,P102*$P$3,Q102*$Q$3,R102*$R$3))-S102","v":0}]

{"sheet":"2","index":4,"n_rows":102,"n_cols":22,"rows_kept":102,"cut":false,"hidden":false,"merged":[[0,3,0,20],[0,0,2,0],[0,1,2,1]]}
["Druž.","Kap.",null,"Disciplina 2"]
[]
[null,null,null,null,null,"K","M",1,2,3,4,5,6,7,8,9,10,11,12,"TB","Čas","Součet"]
[{"$f":"IF(Prezentace!A6=0,\"\",Prezentace!A6)","v":""},{"$f":"IF(Prezentace!B6=0,\"\",Prezentace!B6)","v":""},{"$f":"Prezentace!D6","v":"P"},{"$f":"IF(Prezentace!F6=0,\"\",Prezentace!F6)","v":"Martin"},{"$f":"IF(Prezentace!E6=0,\"\",Prezentace!E6)","v":"Adensam "},320,null,10,7,10,10,7,7,null,null,null,null,null,null,null,82.59,{"$f":"(SUM(F4:T4))-U4","v":288.40999999999997}]
[{"$f":"IF(Prezentace!A7=0,\"\",Prezentace!A7)","v":""},{"$f":"IF(Prezentace!B7=0,\"\",Prezentace!B7)","v":""},{"$f":"Prezentace!D7","v":"R"},{"$f":"IF(Prezentace!F7=0,\"\",Prezentace!F7)","v":"Martin"},{"$f":"IF(Prezentace!E7=0,\"\",Prezentace!E7)","v":"Adensam"},240,null,7,6,9,9,9,6,null,null,null,null,null,null,null,89.46,{"$f":"(SUM(F5:T5))-U5","v":196.54000000000002}]
[{"$f":"IF(Prezentace!A8=0,\"\",Prezentace!A8)","v":""},{"$f":"IF(Prezentace!B8=0,\"\",Prezentace!B8)","v":""},{"$f":"Prezentace!D8","v":"P"},{"$f":"IF(Prezentace!F8=0,\"\",Prezentace!F8)","v":"Jaroslav"},{"$f":"IF(Prezentace!E8=0,\"\",Prezentace!E8)","v":"Kostříž "},330,null,10,9,10,8,9,8,null,null,null,null,null,null,null,78.8,305.2]
[{"$f":"IF(Prezentace!A9=0,\"\",Prezentace!A9)","v":""},{"$f":"IF(Prezentace!B9=0,\"\",Prezentace!B9)","v":""},{"$f":"Prezentace!D9","v":"P"},{"$f":"IF(Prezentace!F9=0,\"\",Prezentace!F9)","v":"Miroslav"},{"$f":"IF(Prezentace!E9=0,\"\",Prezentace!E9)","v":"Koch   ml."},320,null,8,3,11,10,9,6,null,null,null,null,null,null,null,101.7,265.3]
[{"$f":"IF(Prezentace!A10=0,\"\",Prezentace!A10)","v":""},{"$f":"IF(Prezentace!B10=0,\"\",Prezentace!B10)","v":""},{"$f":"Prezentace!D10","v":"P"},{"$f":"IF(Prezentace!F10=0,\"\",Prezentace!F10)","v":"Miroslav"},{"$f":"IF(Prezentace!E10=0,\"\",Prezentace!E10)","v":"Koch  st. "},330,null,6,8,10,10,10,8,null,null,null,null,null,null,null,83.69,298.31]
[{"$f":"IF(Prezentace!A11=0,\"\",Prezentace!A11)","v":""},{"$f":"IF(Prezentace!B11=0,\"\",Prezentace!B11)","v":""},{"$f":"Prezentace!D11","v":"P"},{"$f":"IF(Prezentace!F11=0,\"\",Prezentace!F11)","v":"Bohumil"},{"$f":"IF(Prezentace!E11=0,\"\",Prezentace!E11)","v":"Herceg"},330,null,7,5,11,9,8,8,null,null,null,null,null,null,null,123.5,254.5]
[{"$f":"IF(Prezentace!A12=0,\"\",Prezentace!A12)","v":""},{"$f":"IF(Prezentace!B12=0,\"\",Prezentace!B12)","v":""},{"$f":"Prezentace!D12","v":"P"},{"$f":"IF(Prezentace!F12=0,\"\",Prezentace!F12)","v":"Viktor"},{"$f":"IF(Prezentace!E12=0,\"\",Prezentace!E12)","v":"Fuksa  "},330,null,10,5,10,10,9,6,null,null,null,null,null,null,null,91.44,288.56]
[{"$f":"IF(Prezentace!A13=0,\"\",Prezentace!A13)","v":""},{"$f":"IF(Prezentace!B13=0,\"\",Prezentace!B13)","v":""},{"$f":"Prezentace!D13","v":"P"},{"$f":"IF(Prezentace!F13=0,\"\",Prezentace!F13)","v":"Milan"},{"$f":"IF(Prezentace!E13=0,\"\",Prezentace!E13)","v":"Matějka  ml."},330,null,9,8,11,10,10,8,null,null,null,null,null,null,null,78.56,307.44]
[{"$f":"IF(Prezentace!A14=0,\"\",Prezentace!A14)","v":""},{"$f":"IF(Prezentace!B14=0,\"\",Prezentace!B14)","v":""},{"$f":"Prezentace!D14","v":"P"},{"$f":"IF(Prezentace!F14=0,\"\",Prezentace!F14)","v":"Michal"},{"$f":"IF(Prezentace!E14=0,\"\",Prezentace!E14)","v":"Svoboda"},330,null,10,7,10,9,10,9,null,null,null,null,null,null,null,57.13,327.87]
[{"$f":"IF(Prezentace!A15=0,\"\",Prezentace!A15)","v":""},{"$f":"IF(Prezentace!B15=0,\"\",Prezentace!B15)","v":""},{"$f":"Prezentace!D15","v":"R"},{"$f":"IF(Prezentace!F15=0,\"\",Prezentace!F15)","v":"Lukáš"},{"$f":"IF(Prezentace!E15=0,\"\",Prezentace!E15)","v":"Bouda "},330,null,9,7,10,10,9,7,null,null,null,null,null,null,null,97.1,284.89999999999998]
[{"$f":"IF(Prezentace!A16=0,\"\",Prezentace!A16)","v":""},{"$f":"IF(Prezentace!B16=0,\"\",Prezentace!B16)","v":""},{"$f":"Prezentace!D16","v":"P"},{"$f":"IF(Prezentace!F16=0,\"\",Prezentace!F16)","v":"Lukáš"},{"$f":"IF(Prezentace!E16=0,\"\",Prezentace!E16)","v":"Bouda "},330,null,9,8,11,10,7,7,null,null,null,null,null,null,null,53.05,328.95]
[{"$f":"IF(Prezentace!A17=0,\"\",Prezentace!A17)","v":""},{"$f":"IF(Prezentace!B17=0,\"\",Prezentace!B17)","v":""},{"$f":"Prezentace!D17","v":"P"},{"$f":"IF(Prezentace!F17=0,\"\",Prezentace!F17)","v":"Pavel"},{"$f":"IF(Prezentace!E17=0,\"\",Prezentace!E17)","v":"Koltai"},330,null,10,9,10,9,10,9,null,null,null,null,null,null,null,70.72,316.27999999999997]
[{"$f":"IF(Prezentace!A18=0,\"\",Prezentace!A18)","v":""},{"$f":"IF(Prezentace!B18=0,\"\",Prezentace!B18)","v":""},{"$f":"Prezentace!D18","v":"P"},{"$f":"IF(Prezentace!F18=0,\"\",Prezentace!F18)","v":"Vladislav"},{"$f":"IF(Prezentace!E18=0,\"\",Prezentace!E18)","v":"Přibyl"},260,null,8,6,10,9,7,4,null,null,null,null,null,null,null,122.7,181.3]
[{"$f":"IF(Prezentace!A19=0,\"\",Prezentace!A19)","v":""},{"$f":"IF(Prezentace!B19=0,\"\",Prezentace!B19)","v":""},{"$f":"Prezentace!D19","v":"P"},{"$f":"IF(Prezentace!F19=0,\"\",Prezentace!F19)","v":"Milan"},{"$f":"IF(Prezentace!E19=0,\"\",Prezentace!E19)","v":"Matějka st."},330,null,1,2,10,8,3,3,null,null,null,null,null,null,null,216.2,140.80000000000001]
[{"$f":"IF(Prezentace!A20=0,\"\",Prezentace!A20)","v":""},{"$f":"IF(Prezentace!B20=0,\"\",Prezentace!B20)","v":""},{"$f":"Prezentace!D20","v":"P"},{"$f":"IF(Prezentace!F20=0,\"\",Prezentace!F20)","v":"Miroslav"},{"$f":"IF(Prezentace!E20=0,\"\",Prezentace!E20)","v":"Fiala  "},330,null,7,7,10,10,8,7,null,null,null,null,null,null,null,80.38,298.62]
[{"$f":"IF(Prezentace!A21=0,\"\",Prezentace!A21)","v":""},{"$f":"IF(Prezentace!B21=0,\"\",Prezentace!B21)","v":""},{"$f":"Prezentace!D21","v":"P"},{"$f":"IF(Prezentace!F21=0,\"\",Prezentace!F21)","v":"Karel"},{"$f":"IF(Prezentace!E21=0,\"\",Prezentace!E21)","v":"Gažák "},330,null,9,6,10,9,9,5,null,null,null,null,null,null,null,68.900000000000006,309.10000000000002]
[{"$f":"IF(Prezentace!A22=0,\"\",Prezentace!A22)","v":""},{"$f":"IF(Prezentace!B22=0,\"\",Prezentace!B22)","v":""},{"$f":"Prezentace!D22","v":"P"},{"$f":"IF(Prezentace!F22=0,\"\",Prezentace!F22)","v":"Václav"},{"$f":"IF(Prezentace!E22=0,\"\",Prezentace!E22)","v":"Landkammer"},330,null,6,7,9,9,9,8,null,null,null,null,null,null,null,105.2,272.8]
[{"$f":"IF(Prezentace!A23=0,\"\",Prezentace!A23)","v":""},{"$f":"IF(Prezentace!B23=0,\"\",Prezentace!B23)","v":""},{"$f":"Prezentace!D23","v":"P"},{"$f":"IF(Prezentace!F23=0,\"\",Prezentace!F23)","v":"Vojtěch"},{"$f":"IF(Prezentace!E23=0,\"\",Prezentace!E23)","v":"Brejžek "},310,null,10,10,9,8,8,6,null,null,null,null,null,null,null,91.73,269.27]
[{"$f":"IF(Prezentace!A24=0,\"\",Prezentace!A24)","v":""},{"$f":"IF(Prezentace!B24=0,\"\",Prezentace!B24)","v":""},{"$f":"Prezentace!D24","v":"P"},{"$f":"IF(Prezentace!F24=0,\"\",Prezentace!F24)","v":"Antonín"},{"$f":"IF(Prezentace!E24=0,\"\",Prezentace!E24)","v":"Urbanec  "},270,null,6,2,10,10,7,4,null,null,null,null,null,null,null,145.6,163.4]
[{"$f":"IF(Prezentace!A25=0,\"\",Prezentace!A25)","v":""},{"$f":"IF(Prezentace!B25=0,\"\",Prezentace!B25)","v":""},{"$f":"Prezentace!D25","v":"P"},{"$f":"IF(Prezentace!F25=0,\"\",Prezentace!F25)","v":"Milan"},{"$f":"IF(Prezentace!E25=0,\"\",Prezentace!E25)","v":"Jílek  "},330,null,5,5,10,10,8,4,null,null,null,null,null,null,null,123.7,248.3]
[{"$f":"IF(Prezentace!A26=0,\"\",Prezentace!A26)","v":""},{"$f":"IF(Prezentace!B26=0,\"\",Prezentace!B26)","v":""},{"$f":"Prezentace!D26","v":"P"},{"$f":"IF(Prezentace!F26=0,\"\",Prezentace!F26)","v":"Václav"},{"$f":"IF(Prezentace!E26=0,\"\",Prezentace!E26)","v":"Jírů"},330,null,9,6,10,9,10,8,null,null,null,null,null,null,null,66.069999999999993,315.93]
[{"$f":"IF(Prezentace!A27=0,\"\",Prezentace!A27)","v":""},{"$f":"IF(Prezentace!B27=0,\"\",Prezentace!B27)","v":""},{"$f":"Prezentace!D27","v":"P"},{"$f":"IF(Prezentace!F27=0,\"\",Prezentace!F27)","v":"Milan"},{"$f":"IF(Prezentace!E27=0,\"\",Prezentace!E27)","v":"Krupica"},330,null,8,8,11,10,9,9,null,null,null,null,null,null,null,77.58,307.42]
[{"$f":"IF(Prezentace!A28=0,\"\",Prezentace!A28)","v":""},{"$f":"IF(Prezentace!B28=0,\"\",Prezentace!B28)","v":""},{"$f":"Prezentace!D28","v":"R"},{"$f":"IF(Prezentace!F28=0,\"\",Prezentace!F28)","v":"Milan"},{"$f":"IF(Prezentace!E28=0,\"\",Prezentace!E28)","v":"Krupica "},330,null,10,9,9,0,9,8,null,null,null,null,null,null,null,123.3,251.7]
[{"$f":"IF(Prezentace!A29=0,\"\",Prezentace!A29)","v":""},{"$f":"IF(Prezentace!B29=0,\"\",Prezentace!B29)","v":""},{"$f":"Prezentace!D29","v":"P"},{"$f":"IF(Prezentace!F29=0,\"\",Prezentace!F29)","v":"Miloslav"},{"$f":"IF(Prezentace!E29=0,\"\",Prezentace!E29)","v":"Petržílka"},330,null,10,7,10,9,9,6,null,null,null,null,null,null,null,80.55,300.45]
[{"$f":"IF(Prezentace!A30=0,\"\",Prezentace!A30)","v":""},{"$f":"IF(Prezentace!B30=0,\"\",Prezentace!B30)","v":""},{"$f":"Prezentace!D30","v":"R"},{"$f":"IF(Prezentace!F30=0,\"\",Prezentace!F30)","v":"Aleš"},{"$f":"IF(Prezentace!E30=0,\"\",Prezentace!E30)","v":"Seitl "},330,null,8,6,11,11,8,8,null,null,null,null,null,null,null,109.2,272.8]
[{"$f":"IF(Prezentace!A31=0,\"\",Prezentace!A31)","v":""},{"$f":"IF(Prezentace!B31=0,\"\",Prezentace!B31)","v":""},{"$f":"Prezentace!D31","v":"P"},{"$f":"IF(Prezentace!F31=0,\"\",Prezentace!F31)","v":"Aleš"},{"$f":"IF(Prezentace!E31=0,\"\",Prezentace!E31)","v":"Seitl "},270,null,6,0,10,9,9,4,null,null,null,null,null,null,null,86.31,221.69]
[{"$f":"IF(Prezentace!A32=0,\"\",Prezentace!A32)","v":""},{"$f":"IF(Prezentace!B32=0,\"\",Prezentace!B32)","v":""},{"$f":"Prezentace!D32","v":"P"},{"$f":"IF(Prezentace!F32=0,\"\",Prezentace!F32)","v":"Karel"},{"$f":"IF(Prezentace!E32=0,\"\",Prezentace!E32)","v":"Seitl"},330,null,9,5,10,10,6,6,null,null,null,null,null,null,null,95.78,280.22000000000003]
[{"$f":"IF(Prezentace!A33=0,\"\",Prezentace!A33)","v":""},{"$f":"IF(Prezentace!B33=0,\"\",Prezentace!B33)","v":""},{"$f":"Prezentace!D33","v":"P"},{"$f":"IF(Prezentace!F33=0,\"\",Prezentace!F33)","v":"David"},{"$f":"IF(Prezentace!E33=0,\"\",Prezentace!E33)","v":"Nikodým"},330,null,8,6,8,8,6,6,null,null,null,null,null,null,null,60.3,311.7]
[{"$f":"IF(Prezentace!A34=0,\"\",Prezentace!A34)","v":""},{"$f":"IF(Prezentace!B34=0,\"\",Prezentace!B34)","v":""},{"$f":"Prezentace!D34","v":"R"},{"$f":"IF(Prezentace!F34=0,\"\",Prezentace!F34)","v":"David"},{"$f":"IF(Prezentace!E34=0,\"\",Prezentace!E34)","v":"Nikodým "},330,null,10,8,11,10,10,9,null,null,null,null,null,null,null,101.9,286.10000000000002]
[{"$f":"IF(Prezentace!A35=0,\"\",Prezentace!A35)","v":""},{"$f":"IF(Prezentace!B35=0,\"\",Prezentace!B35)","v":""},{"$f":"Prezentace!D35","v":"P"},{"$f":"IF(Prezentace!F35=0,\"\",Prezentace!F35)","v":"Lukáš"},{"$f":"IF(Prezentace!E35=0,\"\",Prezentace!E35)","v":"Hobza"},330,null,7,6,5,5,8,7,null,null,null,null,null,null,null,78.209999999999994,289.79000000000002]
[{"$f":"IF(Prezentace!A36=0,\"\",Prezentace!A36)","v":""},{"$f":"IF(Prezentace!B36=0,\"\",Prezentace!B36)","v":""},{"$f":"Prezentace!D36","v":"P"},{"$f":"IF(Prezentace!F36=0,\"\",Prezentace!F36)","v":"Antonín"},{"$f":"IF(Prezentace!E36=0,\"\",Prezentace!E36)","v":"Jelínek "},320,null,10,6,9,9,9,7,null,null,null,null,null,null,null,82,288]
[{"$f":"IF(Prezentace!A37=0,\"\",Prezentace!A37)","v":""},{"$f":"IF(Prezentace!B37=0,\"\",Prezentace!B37)","v":""},{"$f":"Prezentace!D37","v":"R"},{"$f":"IF(Prezentace!F37=0,\"\",Prezentace!F37)","v":"Antonín"},{"$f":"IF(Prezentace!E37=0,\"\",Prezentace!E37)","v":"Jelínek "},330,null,10,7,10,10,9,7,null,null,null,null,null,null,null,78.319999999999993,304.68]
[{"$f":"IF(Prezentace!A38=0,\"\",Prezentace!A38)","v":""},{"$f":"IF(Prezentace!B38=0,\"\",Prezentace!B38)","v":""},{"$f":"Prezentace!D38","v":"P"},{"$f":"IF(Prezentace!F38=0,\"\",Prezentace!F38)","v":"Ladislav"},{"$f":"IF(Prezentace!E38=0,\"\",Prezentace!E38)","v":"Píša "},270,null,0,0,0,0,0,0,null,null,null,null,null,null,null,83.39,186.61]
[{"$f":"IF(Prezentace!A39=0,\"\",Prezentace!A39)","v":""},{"$f":"IF(Prezentace!B39=0,\"\",Prezentace!B39)","v":""},{"$f":"Prezentace!D39","v":"P"},{"$f":"IF(Prezentace!F39=0,\"\",Prezentace!F39)","v":"Štefan"},{"$f":"IF(Prezentace!E39=0,\"\",Prezentace!E39)","v":"Mesároš"},330,null,10,9,10,10,8,6,null,null,null,null,null,null,null,60.08,322.92]
[{"$f":"IF(Prezentace!A40=0,\"\",Prezentace!A40)","v":""},{"$f":"IF(Prezentace!B40=0,\"\",Prezentace!B40)","v":""},{"$f":"Prezentace!D40","v":"P"},{"$f":"IF(Prezentace!F40=0,\"\",Prezentace!F40)","v":"Pavel"},{"$f":"IF(Prezentace!E40=0,\"\",Prezentace!E40)","v":"Červenka"},330,null,9,8,10,10,10,5,null,null,null,null,null,null,null,55.05,{"$f":"(SUM(F38:T38))-U38","v":326.95}]
[{"$f":"IF(Prezentace!A41=0,\"\",Prezentace!A41)","v":""},{"$f":"IF(Prezentace!B41=0,\"\",Prezentace!B41)","v":""},{"$f":"Prezentace!D41","v":"R"},{"$f":"IF(Prezentace!F41=0,\"\",Prezentace!F41)","v":"Pavel"},{"$f":"IF(Prezentace!E41=0,\"\",Prezentace!E41)","v":"Červenka "},330,null,8,2,10,9,9,9,null,null,null,null,null,null,null,95.17,281.83]
[{"$f":"IF(Prezentace!A42=0,\"\",Prezentace!A42)","v":""},{"$f":"IF(Prezentace!B42=0,\"\",Prezentace!B42)","v":""},{"$f":"Prezentace!D42","v":"P"},{"$f":"IF(Prezentace!F42=0,\"\",Prezentace!F42)","v":"Jiří"},{"$f":"IF(Prezentace!E42=0,\"\",Prezentace!E42)","v":"Švihálek "},330,null,7,6,11,9,8,6,null,null,null,null,null,null,null,76.52,300.48]
[{"$f":"IF(Prezentace!A43=0,\"\",Prezentace!A43)","v":""},{"$f":"IF(Prezentace!B43=0,\"\",Prezentace!B43)","v":""},{"$f":"Prezentace!D43","v":"R"},{"$f":"IF(Prezentace!F43=0,\"\",Prezentace!F43)","v":"Jiří"},{"$f":"IF(Prezentace!E43=0,\"\",Prezentace!E43)","v":"Švihálek "},330,null,10,7,9,9,8,8,null,null,null,null,null,null,null,85.53,295.47000000000003]
[{"$f":"IF(Prezentace!A44=0,\"\",Prezentace!A44)","v":""},{"$f":"IF(Prezentace!B44=0,\"\",Prezentace!B44)","v":""},{"$f":"Prezentace!D44","v":"P"},{"$f":"IF(Prezentace!F44=0,\"\",Prezentace!F44)","v":"František"},{"$f":"IF(Prezentace!E44=0,\"\",Prezentace!E44)","v":"Toman "},330,null,8,7,10,10,9,7,null,null,null,null,null,null,null,63.9,317.10000000000002]
[{"$f":"IF(Prezentace!A45=0,\"\",Prezentace!A45)","v":""},{"$f":"IF(Prezentace!B45=0,\"\",Prezentace!B45)","v":""},{"$f":"Prezentace!D45","v":"P"},{"$f":"IF(Prezentace!F45=0,\"\",Prezentace!F45)","v":"Vladimír"},{"$f":"IF(Prezentace!E45=0,\"\",Prezentace!E45)","v":"VejslíK "},330,null,9,8,11,10,8,7,null,null,null,null,null,null,null,54.81,328.19]
[{"$f":"IF(Prezentace!A46=0,\"\",Prezentace!A46)","v":""},{"$f":"IF(Prezentace!B46=0,\"\",Prezentace!B46)","v":""},{"$f":"Prezentace!D46","v":"P"},{"$f":"IF(Prezentace!F46=0,\"\",Prezentace!F46)","v":"Karel"},{"$f":"IF(Prezentace!E46=0,\"\",Prezentace!E46)","v":"Získal "},330,null,9,6,10,11,7,6,null,null,null,null,null,null,null,66.650000000000006,312.35000000000002]
[{"$f":"IF(Prezentace!A47=0,\"\",Prezentace!A47)","v":""},{"$f":"IF(Prezentace!B47=0,\"\",Prezentace!B47)","v":""},{"$f":"Prezentace!D47","v":"R"},{"$f":"IF(Prezentace!F47=0,\"\",Prezentace!F47)","v":"Karel"},{"$f":"IF(Prezentace!E47=0,\"\",Prezentace!E47)","v":"Získal "},330,null,8,8,11,11,9,9,null,null,null,null,null,null,null,141,245]
[{"$f":"IF(Prezentace!A48=0,\"\",Prezentace!A48)","v":""},{"$f":"IF(Prezentace!B48=0,\"\",Prezentace!B48)","v":""},{"$f":"Prezentace!D48","v":"P"},{"$f":"IF(Prezentace!F48=0,\"\",Prezentace!F48)","v":"Jaroslav"},{"$f":"IF(Prezentace!E48=0,\"\",Prezentace!E48)","v":"Sokolík "},330,null,8,8,10,10,10,8,null,null,null,null,null,null,null,51.47,332.53]
[{"$f":"IF(Prezentace!A49=0,\"\",Prezentace!A49)","v":""},{"$f":"IF(Prezentace!B49=0,\"\",Prezentace!B49)","v":""},{"$f":"Prezentace!D49","v":"P"},{"$f":"IF(Prezentace!F49=0,\"\",Prezentace!F49)","v":"Milan"},{"$f":"IF(Prezentace!E49=0,\"\",Prezentace!E49)","v":"Kraus "},330,null,10,7,10,9,8,4,null,null,null,null,null,null,null,67.53,310.47000000000003]
[{"$f":"IF(Prezentace!A50=0,\"\",Prezentace!A50)","v":""},{"$f":"IF(Prezentace!B50=0,\"\",Prezentace!B50)","v":""},{"$f":"Prezentace!D50","v":"P"},{"$f":"IF(Prezentace!F50=0,\"\",Prezentace!F50)","v":""},{"$f":"IF(Prezentace!E50=0,\"\",Prezentace!E50)","v":""},null,null,null,null,null,null,null,null,null,null,null,null,null,null,null,null,0]
[{"$f":"IF(Prezentace!A51=0,\"\",Prezentace!A51)","v":""},{"$f":"IF(Prezentace!B51=0,\"\",Prezentace!B51)","v":""},{"$f":"Prezentace!D51","v":"P"},{"$f":"IF(Prezentace!F51=0,\"\",Prezentace!F51)","v":""},{"$f":"IF(Prezentace!E51=0,\"\",Prezentace!E51)","v":""},null,null,null,null,null,null,null,null,null,null,null,null,null,null,null,null,0]
[{"$f":"IF(Prezentace!A52=0,\"\",Prezentace!A52)","v":""},{"$f":"IF(Prezentace!B52=0,\"\",Prezentace!B52)","v":""},{"$f":"Prezentace!D52","v":"P"},{"$f":"IF(Prezentace!F52=0,\"\",Prezentace!F52)","v":""},{"$f":"IF(Prezentace!E52=0,\"\",Prezentace!E52)","v":""},null,null,null,null,null,null,null,null,null,null,null,null,null,null,null,null,0]
[{"$f":"IF(Prezentace!A53=0,\"\",Prezentace!A53)","v":""},{"$f":"IF(Prezentace!B53=0,\"\",Prezentace!B53)","v":""},{"$f":"Prezentace!D53","v":"P"},{"$f":"IF(Prezentace!F53=0,\"\",Prezentace!F53)","v":""},{"$f":"IF(Prezentace!E53=0,\"\",Prezentace!E53)","v":""},null,null,null,null,null,null,null,null,null,null,null,null,null,null,null,null,0]
[{"$f":"IF(Prezentace!A54=0,\"\",Prezentace!A54)","v":""},{"$f":"IF(Prezentace!B54=0,\"\",Prezentace!B54)","v":""},{"$f":"Prezentace!D54","v":"P"},{"$f":"IF(Prezentace!F54=0,\"\",Prezentace!F54)","v":""},{"$f":"IF(Prezentace!E54=0,\"\",Prezentace!E54)","v":""},null,null,null,null,null,null,null,null,null,null,null,null,null,null,null,null,0]
[{"$f":"IF(Prezentace!A55=0,\"\",Prezentace!A55)","v":""},{"$f":"IF(Prezentace!B55=0,\"\",Prezentace!B55)","v":""},{"$f":"Prezentace!D55","v":"P"},{"$f":"IF(Prezentace!F55=0,\"\",Prezentace!F55)","v":""},{"$f":"IF(Prezentace!E55=0,\"\",Prezentace!E55)","v":""},null,null,null,null,null,null,null,null,null,null,null,null,null,null,null,null,0]
[{"$f":"IF(Prezentace!A56=0,\"\",Prezentace!A56)","v":""},{"$f":"IF(Prezentace!B56=0,\"\",Prezentace!B56)","v":""},{"$f":"Prezentace!D56","v":"P"},{"$f":"IF(Prezentace!F56=0,\"\",Prezentace!F56)","v":""},{"$f":"IF(Prezentace!E56=0,\"\",Prezentace!E56)","v":""},null,null,null,null,null,null,null,null,null,null,null,null,null,null,null,null,0]
[{"$f":"IF(Prezentace!A57=0,\"\",Prezentace!A57)","v":""},{"$f":"IF(Prezentace!B57=0,\"\",Prezentace!B57)","v":""},{"$f":"Prezentace!D57","v":"P"},{"$f":"IF(Prezentace!F57=0,\"\",Prezentace!F57)","v":""},{"$f":"IF(Prezentace!E57=0,\"\",Prezentace!E57)","v":""},null,null,null,null,null,null,null,null,null,null,null,null,null,null,null,null,0]
[{"$f":"IF(Prezentace!A58=0,\"\",Prezentace!A58)","v":""},{"$f":"IF(Prezentace!B58=0,\"\",Prezentace!B58)","v":""},{"$f":"Prezentace!D58","v":"P"},{"$f":"IF(Prezentace!F58=0,\"\",Prezentace!F58)","v":""},{"$f":"IF(Prezentace!E58=0,\"\",Prezentace!E58)","v":""},null,null,null,null,null,null,null,null,null,null,null,null,null,null,null,null,0]
[{"$f":"IF(Prezentace!A59=0,\"\",Prezentace!A59)","v":""},{"$f":"IF(Prezentace!B59=0,\"\",Prezentace!B59)","v":""},{"$f":"Prezentace!D59","v":"P"},{"$f":"IF(Prezentace!F59=0,\"\",Prezentace!F59)","v":""},{"$f":"IF(Prezentace!E59=0,\"\",Prezentace!E59)","v":""},null,null,null,null,null,null,null,null,null,null,null,null,null,null,null,null,0]
[{"$f":"IF(Prezentace!A60=0,\"\",Prezentace!A60)","v":""},{"$f":"IF(Prezentace!B60=0,\"\",Prezentace!B60)","v":""},{"$f":"Prezentace!D60","v":"P"},{"$f":"IF(Prezentace!F60=0,\"\",Prezentace!F60)","v":""},{"$f":"IF(Prezentace!E60=0,\"\",Prezentace!E60)","v":""},null,null,null,null,null,null,null,null,null,null,null,null,null,null,null,null,0]
[{"$f":"IF(Prezentace!A61=0,\"\",Prezentace!A61)","v":""},{"$f":"IF(Prezentace!B61=0,\"\",Prezentace!B61)","v":""},{"$f":"Prezentace!D61","v":"P"},{"$f":"IF(Prezentace!F61=0,\"\",Prezentace!F61)","v":""},{"$f":"IF(Prezentace!E61=0,\"\",Prezentace!E61)","v":""},null,null,null,null,null,null,null,null,null,null,null,null,null,null,null,null,0]
[{"$f":"IF(Prezentace!A62=0,\"\",Prezentace!A62)","v":""},{"$f":"IF(Prezentace!B62=0,\"\",Prezentace!B62)","v":""},{"$f":"Prezentace!D62","v":"P"},{"$f":"IF(Prezentace!F62=0,\"\",Prezentace!F62)","v":""},{"$f":"IF(Prezentace!E62=0,\"\",Prezentace!E62)","v":""},null,null,null,null,null,null,null,null,null,null,null,null,null,null,null,null,0]
[{"$f":"IF(Prezentace!A63=0,\"\",Prezentace!A63)","v":""},{"$f":"IF(Prezentace!B63=0,\"\",Prezentace!B63)","v":""},{"$f":"Prezentace!D63","v":"P"},{"$f":"IF(Prezentace!F63=0,\"\",Prezentace!F63)","v":""},{"$f":"IF(Prezentace!E63=0,\"\",Prezentace!E63)","v":""},null,null,null,null,null,null,null,null,null,null,null,null,null,null,null,null,0]
[{"$f":"IF(Prezentace!A64=0,\"\",Prezentace!A64)","v":""},{"$f":"IF(Prezentace!B64=0,\"\",Prezentace!B64)","v":""},{"$f":"Prezentace!D64","v":"P"},{"$f":"IF(Prezentace!F64=0,\"\",Prezentace!F64)","v":""},{"$f":"IF(Prezentace!E64=0,\"\",Prezentace!E64)","v":""},null,null,null,null,null,null,null,null,null,null,null,null,null,null,null,null,0]
[{"$f":"IF(Prezentace!A65=0,\"\",Prezentace!A65)","v":""},{"$f":"IF(Prezentace!B65=0,\"\",Prezentace!B65)","v":""},{"$f":"Prezentace!D65","v":"P"},{"$f":"IF(Prezentace!F65=0,\"\",Prezentace!F65)","v":""},{"$f":"IF(Prezentace!E65=0,\"\",Prezentace!E65)","v":""},null,null,null,null,null,null,null,null,null,null,null,null,null,null,null,null,0]
[{"$f":"IF(Prezentace!A66=0,\"\",Prezentace!A66)","v":""},{"$f":"IF(Prezentace!B66=0,\"\",Prezentace!B66)","v":""},{"$f":"Prezentace!D66","v":"P"},{"$f":"IF(Prezentace!F66=0,\"\",Prezentace!F66)","v":""},{"$f":"IF(Prezentace!E66=0,\"\",Prezentace!E66)","v":""},null,null,null,null,null,null,null,null,null,null,null,null,null,null,null,null,0]
[{"$f":"IF(Prezentace!A67=0,\"\",Prezentace!A67)","v":""},{"$f":"IF(Prezentace!B67=0,\"\",Prezentace!B67)","v":""},{"$f":"Prezentace!D67","v":"P"},{"$f":"IF(Prezentace!F67=0,\"\",Prezentace!F67)","v":""},{"$f":"IF(Prezentace!E67=0,\"\",Prezentace!E67)","v":""},null,null,null,null,null,null,null,null,null,null,null,null,null,null,null,null,0]
[{"$f":"IF(Prezentace!A68=0,\"\",Prezentace!A68)","v":""},{"$f":"IF(Prezentace!B68=0,\"\",Prezentace!B68)","v":""},{"$f":"Prezentace!D68","v":"P"},{"$f":"IF(Prezentace!F68=0,\"\",Prezentace!F68)","v":""},{"$f":"IF(Prezentace!E68=0,\"\",Prezentace!E68)","v":""},null,null,null,null,null,null,null,null,null,null,null,null,null,null,null,null,0]
[{"$f":"IF(Prezentace!A69=0,\"\",Prezentace!A69)","v":""},{"$f":"IF(Prezentace!B69=0,\"\",Prezentace!B69)","v":""},{"$f":"Prezentace!D69","v":"P"},{"$f":"IF(Prezentace!F69=0,\"\",Prezentace!F69)","v":""},{"$f":"IF(Prezentace!E69=0,\"\",Prezentace!E69)","v":""},null,null,null,null,null,null,null,null,null,null,null,null,null,null,null,null,0]
[{"$f":"IF(Prezentace!A70=0,\"\",Prezentace!A70)","v":""},{"$f":"IF(Prezentace!B70=0,\"\",Prezentace!B70)","v":""},{"$f":"Prezentace!D70","v":"P"},{"$f":"IF(Prezentace!F70=0,\"\",Prezentace!F70)","v":""},{"$f":"IF(Prezentace!E70=0,\"\",Prezentace!E70)","v":""},null,null,null,null,null,null,null,null,null,null,null,null,null,null,null,null,0]
[{"$f":"IF(Prezentace!A71=0,\"\",Prezentace!A71)","v":""},{"$f":"IF(Prezentace!B71=0,\"\",Prezentace!B71)","v":""},{"$f":"Prezentace!D71","v":"P"},{"$f":"IF(Prezentace!F71=0,\"\",Prezentace!F71)","v":""},{"$f":"IF(Prezentace!E71=0,\"\",Prezentace!E71)","v":""},null,null,null,null,null,null,null,null,null,null,null,null,null,null,null,null,0]
[{"$f":"IF(Prezentace!A72=0,\"\",Prezentace!A72)","v":""},{"$f":"IF(Prezentace!B72=0,\"\",Prezentace!B72)","v":""},{"$f":"Prezentace!D72","v":"P"},{"$f":"IF(Prezentace!F72=0,\"\",Prezentace!F72)","v":""},{"$f":"IF(Prezentace!E72=0,\"\",Prezentace!E72)","v":""},null,null,null,null,null,null,null,null,null,null,null,null,null,null,null,null,0]
[{"$f":"IF(Prezentace!A73=0,\"\",Prezentace!A73)","v":""},{"$f":"IF(Prezentace!B73=0,\"\",Prezentace!B73)","v":""},{"$f":"Prezentace!D73","v":"P"},{"$f":"IF(Prezentace!F73=0,\"\",Prezentace!F73)","v":""},{"$f":"IF(Prezentace!E73=0,\"\",Prezentace!E73)","v":""},null,null,null,null,null,null,null,null,null,null,null,null,null,null,null,null,0]
[{"$f":"IF(Prezentace!A74=0,\"\",Prezentace!A74)","v":""},{"$f":"IF(Prezentace!B74=0,\"\",Prezentace!B74)","v":""},{"$f":"Prezentace!D74","v":"P"},{"$f":"IF(Prezentace!F74=0,\"\",Prezentace!F74)","v":""},{"$f":"IF(Prezentace!E74=0,\"\",Prezentace!E74)","v":""},null,null,null,null,null,null,null,null,null,null,null,null,null,null,null,null,0]
[{"$f":"IF(Prezentace!A75=0,\"\",Prezentace!A75)","v":""},{"$f":"IF(Prezentace!B75=0,\"\",Prezentace!B75)","v":""},{"$f":"Prezentace!D75","v":"P"},{"$f":"IF(Prezentace!F75=0,\"\",Prezentace!F75)","v":""},{"$f":"IF(Prezentace!E75=0,\"\",Prezentace!E75)","v":""},null,null,null,null,null,null,null,null,null,null,null,null,null,null,null,null,0]
[{"$f":"IF(Prezentace!A76=0,\"\",Prezentace!A76)","v":""},{"$f":"IF(Prezentace!B76=0,\"\",Prezentace!B76)","v":""},{"$f":"Prezentace!D76","v":"P"},{"$f":"IF(Prezentace!F76=0,\"\",Prezentace!F76)","v":""},{"$f":"IF(Prezentace!E76=0,\"\",Prezentace!E76)","v":""},null,null,null,null,null,null,null,null,null,null,null,null,null,null,null,null,0]
[{"$f":"IF(Prezentace!A77=0,\"\",Prezentace!A77)","v":""},{"$f":"IF(Prezentace!B77=0,\"\",Prezentace!B77)","v":""},{"$f":"Prezentace!D77","v":"P"},{"$f":"IF(Prezentace!F77=0,\"\",Prezentace!F77)","v":""},{"$f":"IF(Prezentace!E77=0,\"\",Prezentace!E77)","v":""},null,null,null,null,null,null,null,null,null,null,null,null,null,null,null,null,0]
[{"$f":"IF(Prezentace!A78=0,\"\",Prezentace!A78)","v":""},{"$f":"IF(Prezentace!B78=0,\"\",Prezentace!B78)","v":""},{"$f":"Prezentace!D78","v":"P"},{"$f":"IF(Prezentace!F78=0,\"\",Prezentace!F78)","v":""},{"$f":"IF(Prezentace!E78=0,\"\",Prezentace!E78)","v":""},null,null,null,null,null,null,null,null,null,null,null,null,null,null,null,null,0]
[{"$f":"IF(Prezentace!A79=0,\"\",Prezentace!A79)","v":""},{"$f":"IF(Prezentace!B79=0,\"\",Prezentace!B79)","v":""},{"$f":"Prezentace!D79","v":"P"},{"$f":"IF(Prezentace!F79=0,\"\",Prezentace!F79)","v":""},{"$f":"IF(Prezentace!E79=0,\"\",Prezentace!E79)","v":""},null,null,null,null,null,null,null,null,null,null,null,null,null,null,null,null,0]
[{"$f":"IF(Prezentace!A80=0,\"\",Prezentace!A80)","v":""},{"$f":"IF(Prezentace!B80=0,\"\",Prezentace!B80)","v":""},{"$f":"Prezentace!D80","v":"P"},{"$f":"IF(Prezentace!F80=0,\"\",Prezentace!F80)","v":""},{"$f":"IF(Prezentace!E80=0,\"\",Prezentace!E80)","v":""},null,null,null,null,null,null,null,null,null,null,null,null,null,null,null,null,0]
[{"$f":"IF(Prezentace!A81=0,\"\",Prezentace!A81)","v":""},{"$f":"IF(Prezentace!B81=0,\"\",Prezentace!B81)","v":""},{"$f":"Prezentace!D81","v":"P"},{"$f":"IF(Prezentace!F81=0,\"\",Prezentace!F81)","v":""},{"$f":"IF(Prezentace!E81=0,\"\",Prezentace!E81)","v":""},null,null,null,null,null,null,null,null,null,null,null,null,null,null,null,null,0]
[{"$f":"IF(Prezentace!A82=0,\"\",Prezentace!A82)","v":""},{"$f":"IF(Prezentace!B82=0,\"\",Prezentace!B82)","v":""},{"$f":"Prezentace!D82","v":"P"},{"$f":"IF(Prezentace!F82=0,\"\",Prezentace!F82)","v":""},{"$f":"IF(Prezentace!E82=0,\"\",Prezentace!E82)","v":""},null,null,null,null,null,null,null,null,null,null,null,null,null,null,null,null,0]
[{"$f":"IF(Prezentace!A83=0,\"\",Prezentace!A83)","v":""},{"$f":"IF(Prezentace!B83=0,\"\",Prezentace!B83)","v":""},{"$f":"Prezentace!D83","v":"P"},{"$f":"IF(Prezentace!F83=0,\"\",Prezentace!F83)","v":""},{"$f":"IF(Prezentace!E83=0,\"\",Prezentace!E83)","v":""},null,null,null,null,null,null,null,null,null,null,null,null,null,null,null,null,0]
[{"$f":"IF(Prezentace!A84=0,\"\",Prezentace!A84)","v":""},{"$f":"IF(Prezentace!B84=0,\"\",Prezentace!B84)","v":""},{"$f":"Prezentace!D84","v":"P"},{"$f":"IF(Prezentace!F84=0,\"\",Prezentace!F84)","v":""},{"$f":"IF(Prezentace!E84=0,\"\",Prezentace!E84)","v":""},null,null,null,null,null,null,null,null,null,null,null,null,null,null,null,null,0]
[{"$f":"IF(Prezentace!A85=0,\"\",Prezentace!A85)","v":""},{"$f":"IF(Prezentace!B85=0,\"\",Prezentace!B85)","v":""},{"$f":"Prezentace!D85","v":"P"},{"$f":"IF(Prezentace!F85=0,\"\",Prezentace!F85)","v":""},{"$f":"IF(Prezentace!E85=0,\"\",Prezentace!E85)","v":""},null,null,null,null,null,null,null,null,null,null,null,null,null,null,null,null,0]
[{"$f":"IF(Prezentace!A86=0,\"\",Prezentace!A86)","v":""},{"$f":"IF(Prezentace!B86=0,\"\",Prezentace!B86)","v":""},{"$f":"Prezentace!D86","v":"P"},{"$f":"IF(Prezentace!F86=0,\"\",Prezentace!F86)","v":""},{"$f":"IF(Prezentace!E86=0,\"\",Prezentace!E86)","v":""},null,null,null,null,null,null,null,null,null,null,null,null,null,null,null,null,0]
[{"$f":"IF(Prezentace!A87=0,\"\",Prezentace!A87)","v":""},{"$f":"IF(Prezentace!B87=0,\"\",Prezentace!B87)","v":""},{"$f":"Prezentace!D87","v":"P"},{"$f":"IF(Prezentace!F87=0,\"\",Prezentace!F87)","v":""},{"$f":"IF(Prezentace!E87=0,\"\",Prezentace!E87)","v":""},null,null,null,null,null,null,null,null,null,null,null,null,null,null,null,null,0]
[{"$f":"IF(Prezentace!A88=0,\"\",Prezentace!A88)","v":""},{"$f":"IF(Prezentace!B88=0,\"\",Prezentace!B88)","v":""},{"$f":"Prezentace!D88","v":"P"},{"$f":"IF(Prezentace!F88=0,\"\",Prezentace!F88)","v":""},{"$f":"IF(Prezentace!E88=0,\"\",Prezentace!E88)","v":""},null,null,null,null,null,null,null,null,null,null,null,null,null,null,null,null,0]
[{"$f":"IF(Prezentace!A89=0,\"\",Prezentace!A89)","v":""},{"$f":"IF(Prezentace!B89=0,\"\",Prezentace!B89)","v":""},{"$f":"Prezentace!D89","v":"P"},{"$f":"IF(Prezentace!F89=0,\"\",Prezentace!F89)","v":""},{"$f":"IF(Prezentace!E89=0,\"\",Prezentace!E89)","v":""},null,null,null,null,null,null,null,null,null,null,null,null,null,null,null,null,0]
[{"$f":"IF(Prezentace!A90=0,\"\",Prezentace!A90)","v":""},{"$f":"IF(Prezentace!B90=0,\"\",Prezentace!B90)","v":""},{"$f":"Prezentace!D90","v":"P"},{"$f":"IF(Prezentace!F90=0,\"\",Prezentace!F90)","v":""},{"$f":"IF(Prezentace!E90=0,\"\",Prezentace!E90)","v":""},null,null,null,null,null,null,null,null,null,null,null,null,null,null,null,null,0]
[{"$f":"IF(Prezentace!A91=0,\"\",Prezentace!A91)","v":""},{"$f":"IF(Prezentace!B91=0,\"\",Prezentace!B91)","v":""},{"$f":"Prezentace!D91","v":"P"},{"$f":"IF(Prezentace!F91=0,\"\",Prezentace!F91)","v":""},{"$f":"IF(Prezentace!E91=0,\"\",Prezentace!E91)","v":""},null,null,null,null,null,null,null,null,null,null,null,null,null,null,null,null,0]
[{"$f":"IF(Prezentace!A92=0,\"\",Prezentace!A92)","v":""},{"$f":"IF(Prezentace!B92=0,\"\",Prezentace!B92)","v":""},{"$f":"Prezentace!D92","v":"P"},{"$f":"IF(Prezentace!F92=0,\"\",Prezentace!F92)","v":""},{"$f":"IF(Prezentace!E92=0,\"\",Prezentace!E92)","v":""},null,null,null,null,null,null,null,null,null,null,null,null,null,null,null,null,0]
[{"$f":"IF(Prezentace!A93=0,\"\",Prezentace!A93)","v":""},{"$f":"IF(Prezentace!B93=0,\"\",Prezentace!B93)","v":""},{"$f":"Prezentace!D93","v":"P"},{"$f":"IF(Prezentace!F93=0,\"\",Prezentace!F93)","v":""},{"$f":"IF(Prezentace!E93=0,\"\",Prezentace!E93)","v":""},null,null,null,null,null,null,null,null,null,null,null,null,null,null,null,null,0]
[{"$f":"IF(Prezentace!A94=0,\"\",Prezentace!A94)","v":""},{"$f":"IF(Prezentace!B94=0,\"\",Prezentace!B94)","v":""},{"$f":"Prezentace!D94","v":"P"},{"$f":"IF(Prezentace!F94=0,\"\",Prezentace!F94)","v":""},{"$f":"IF(Prezentace!E94=0,\"\",Prezentace!E94)","v":""},null,null,null,null,null,null,null,null,null,null,null,null,null,null,null,null,0]
[{"$f":"IF(Prezentace!A95=0,\"\",Prezentace!A95)","v":""},{"$f":"IF(Prezentace!B95=0,\"\",Prezentace!B95)","v":""},{"$f":"Prezentace!D95","v":"P"},{"$f":"IF(Prezentace!F95=0,\"\",Prezentace!F95)","v":""},{"$f":"IF(Prezentace!E95=0,\"\",Prezentace!E95)","v":""},null,null,null,null,null,null,null,null,null,null,null,null,null,null,null,null,0]
[{"$f":"IF(Prezentace!A96=0,\"\",Prezentace!A96)","v":""},{"$f":"IF(Prezentace!B96=0,\"\",Prezentace!B96)","v":""},{"$f":"Prezentace!D96","v":"P"},{"$f":"IF(Prezentace!F96=0,\"\",Prezentace!F96)","v":""},{"$f":"IF(Prezentace!E96=0,\"\",Prezentace!E96)","v":""},null,null,null,null,null,null,null,null,null,null,null,null,null,null,null,null,0]
[{"$f":"IF(Prezentace!A97=0,\"\",Prezentace!A97)","v":""},{"$f":"IF(Prezentace!B97=0,\"\",Prezentace!B97)","v":""},{"$f":"Prezentace!D97","v":"P"},{"$f":"IF(Prezentace!F97=0,\"\",Prezentace!F97)","v":""},{"$f":"IF(Prezentace!E97=0,\"\",Prezentace!E97)","v":""},null,null,null,null,null,null,null,null,null,null,null,null,null,null,null,null,0]
[{"$f":"IF(Prezentace!A98=0,\"\",Prezentace!A98)","v":""},{"$f":"IF(Prezentace!B98=0,\"\",Prezentace!B98)","v":""},{"$f":"Prezentace!D98","v":"P"},{"$f":"IF(Prezentace!F98=0,\"\",Prezentace!F98)","v":""},{"$f":"IF(Prezentace!E98=0,\"\",Prezentace!E98)","v":""},null,null,null,null,null,null,null,null,null,null,null,null,null,null,null,null,0]
[{"$f":"IF(Prezentace!A99=0,\"\",Prezentace!A99)","v":""},{"$f":"IF(Prezentace!B99=0,\"\",Prezentace!B99)","v":""},{"$f":"Prezentace!D99","v":"P"},{"$f":"IF(Prezentace!F99=0,\"\",Prezentace!F99)","v":""},{"$f":"IF(Prezentace!E99=0,\"\",Prezentace!E99)","v":""},null,null,null,null,null,null,null,null,null,null,null,null,null,null,null,null,0]
[{"$f":"IF(Prezentace!A100=0,\"\",Prezentace!A100)","v":""},{"$f":"IF(Prezentace!B100=0,\"\",Prezentace!B100)","v":""},{"$f":"Prezentace!D100","v":"P"},{"$f":"IF(Prezentace!F100=0,\"\",Prezentace!F100)","v":""},{"$f":"IF(Prezentace!E100=0,\"\",Prezentace!E100)","v":""},null,null,null,null,null,null,null,null,null,null,null,null,null,null,null,null,0]
[{"$f":"IF(Prezentace!A101=0,\"\",Prezentace!A101)","v":""},{"$f":"IF(Prezentace!B101=0,\"\",Prezentace!B101)","v":""},{"$f":"Prezentace!D101","v":"P"},{"$f":"IF(Prezentace!F101=0,\"\",Prezentace!F101)","v":""},{"$f":"IF(Prezentace!E101=0,\"\",Prezentace!E101)","v":""},null,null,null,null,null,null,null,null,null,null,null,null,null,null,null,null,0]
[{"$f":"IF(Prezentace!A102=0,\"\",Prezentace!A102)","v":""},{"$f":"IF(Prezentace!B102=0,\"\",Prezentace!B102)","v":""},{"$f":"Prezentace!D102","v":"P"},{"$f":"IF(Prezentace!F102=0,\"\",Prezentace!F102)","v":""},{"$f":"IF(Prezentace!E102=0,\"\",Prezentace!E102)","v":""},null,null,null,null,null,null,null,null,null,null,null,null,null,null,null,null,0]
[{"$f":"IF(Prezentace!A103=0,\"\",Prezentace!A103)","v":""},{"$f":"IF(Prezentace!B103=0,\"\",Prezentace!B103)","v":""},{"$f":"Prezentace!D103","v":"P"},{"$f":"IF(Prezentace!F103=0,\"\",Prezentace!F103)","v":""},{"$f":"IF(Prezentace!E103=0,\"\",Prezentace!E103)","v":""},null,null,null,null,null,null,null,null,null,null,null,null,null,null,null,null,0]
[{"$f":"IF(Prezentace!A104=0,\"\",Prezentace!A104)","v":""},{"$f":"IF(Prezentace!B104=0,\"\",Prezentace!B104)","v":""},{"$f":"Prezentace!D104","v":"P"},{"$f":"IF(Prezentace!F104=0,\"\",Prezentace!F104)","v":""},{"$f":"IF(Prezentace!E104=0,\"\",Prezentace!E104)","v":""},null,null,null,null,null,null,null,null,null,null,null,null,null,null,null,null,{"$f":"(SUM(F102:T102))-U102","v":0}]

{"sheet":"2(M)","index":5,"n_rows":102,"n_cols":20,"rows_kept":102,"cut":false,"hidden":true,"merged":[[0,3,0,18],[0,0,2,0],[0,1,2,1]]}
["Druž.","Kap.",null,"Disciplina 2"]
[]
[null,null,null,null,null,0,1,2,3,4,5,6,7,8,9,10,12,15,"Čas","Součet"]
[{"$f":"IF(Prezentace!A6=0,\"\",Prezentace!A6)","v":""},{"$f":"IF(Prezentace!B6=0,\"\",Prezentace!B6)","v":""},{"$f":"Prezentace!D6","v":"P"},{"$f":"IF(Prezentace!F6=0,\"\",Prezentace!F6)","v":"Martin"},{"$f":"IF(Prezentace!E6=0,\"\",Prezentace!E6)","v":"Adensam "},null,null,null,null,null,null,null,null,null,null,null,null,null,null,{"$f":"(SUM(F4*$F$3,G4*$G$3,H4*$H$3,I4*$I$3,J4*$J$3,K4*$K$3,L4*$L$3,M4*$M$3,N4*$N$3,O4*$O$3,P4*$P$3,Q4*$Q$3,R4*$R$3))-S4","v":0}]
[{"$f":"IF(Prezentace!A7=0,\"\",Prezentace!A7)","v":""},{"$f":"IF(Prezentace!B7=0,\"\",Prezentace!B7)","v":""},{"$f":"Prezentace!D7","v":"R"},{"$f":"IF(Prezentace!F7=0,\"\",Prezentace!F7)","v":"Martin"},{"$f":"IF(Prezentace!E7=0,\"\",Prezentace!E7)","v":"Adensam"},null,null,null,null,null,null,null,null,null,null,null,null,null,null,{"$f":"(SUM(F5*$F$3,G5*$G$3,H5*$H$3,I5*$I$3,J5*$J$3,K5*$K$3,L5*$L$3,M5*$M$3,N5*$N$3,O5*$O$3,P5*$P$3,Q5*$Q$3,R5*$R$3))-S5","v":0}]
[{"$f":"IF(Prezentace!A8=0,\"\",Prezentace!A8)","v":""},{"$f":"IF(Prezentace!B8=0,\"\",Prezentace!B8)","v":""},{"$f":"Prezentace!D8","v":"P"},{"$f":"IF(Prezentace!F8=0,\"\",Prezentace!F8)","v":"Jaroslav"},{"$f":"IF(Prezentace!E8=0,\"\",Prezentace!E8)","v":"Kostříž "},null,null,null,null,null,null,null,null,null,null,null,null,null,null,0]
[{"$f":"IF(Prezentace!A9=0,\"\",Prezentace!A9)","v":""},{"$f":"IF(Prezentace!B9=0,\"\",Prezentace!B9)","v":""},{"$f":"Prezentace!D9","v":"P"},{"$f":"IF(Prezentace!F9=0,\"\",Prezentace!F9)","v":"Miroslav"},{"$f":"IF(Prezentace!E9=0,\"\",Prezentace!E9)","v":"Koch   ml."},null,null,null,null,null,null,null,null,null,null,null,null,null,null,0]
[{"$f":"IF(Prezentace!A10=0,\"\",Prezentace!A10)","v":""},{"$f":"IF(Prezentace!B10=0,\"\",Prezentace!B10)","v":""},{"$f":"Prezentace!D10","v":"P"},{"$f":"IF(Prezentace!F10=0,\"\",Prezentace!F10)","v":"Miroslav"},{"$f":"IF(Prezentace!E10=0,\"\",Prezentace!E10)","v":"Koch  st. "},null,null,null,null,null,null,null,null,null,null,null,null,null,null,0]
[{"$f":"IF(Prezentace!A11=0,\"\",Prezentace!A11)","v":""},{"$f":"IF(Prezentace!B11=0,\"\",Prezentace!B11)","v":""},{"$f":"Prezentace!D11","v":"P"},{"$f":"IF(Prezentace!F11=0,\"\",Prezentace!F11)","v":"Bohumil"},{"$f":"IF(Prezentace!E11=0,\"\",Prezentace!E11)","v":"Herceg"},null,null,null,null,null,null,null,null,null,null,null,null,null,null,0]
[{"$f":"IF(Prezentace!A12=0,\"\",Prezentace!A12)","v":""},{"$f":"IF(Prezentace!B12=0,\"\",Prezentace!B12)","v":""},{"$f":"Prezentace!D12","v":"P"},{"$f":"IF(Prezentace!F12=0,\"\",Prezentace!F12)","v":"Viktor"},{"$f":"IF(Prezentace!E12=0,\"\",Prezentace!E12)","v":"Fuksa  "},null,null,null,null,null,null,null,null,null,null,null,null,null,null,0]
[{"$f":"IF(Prezentace!A13=0,\"\",Prezentace!A13)","v":""},{"$f":"IF(Prezentace!B13=0,\"\",Prezentace!B13)","v":""},{"$f":"Prezentace!D13","v":"P"},{"$f":"IF(Prezentace!F13=0,\"\",Prezentace!F13)","v":"Milan"},{"$f":"IF(Prezentace!E13=0,\"\",Prezentace!E13)","v":"Matějka  ml."},null,null,null,null,null,null,null,null,null,null,null,null,null,null,0]
[{"$f":"IF(Prezentace!A14=0,\"\",Prezentace!A14)","v":""},{"$f":"IF(Prezentace!B14=0,\"\",Prezentace!B14)","v":""},{"$f":"Prezentace!D14","v":"P"},{"$f":"IF(Prezentace!F14=0,\"\",Prezentace!F14)","v":"Michal"},{"$f":"IF(Prezentace!E14=0,\"\",Prezentace!E14)","v":"Svoboda"},null,null,null,null,null,null,null,null,null,null,null,null,null,null,0]
[{"$f":"IF(Prezentace!A15=0,\"\",Prezentace!A15)","v":""},{"$f":"IF(Prezentace!B15=0,\"\",Prezentace!B15)","v":""},{"$f":"Prezentace!D15","v":"R"},{"$f":"IF(Prezentace!F15=0,\"\",Prezentace!F15)","v":"Lukáš"},{"$f":"IF(Prezentace!E15=0,\"\",Prezentace!E15)","v":"Bouda "},null,null,null,null,null,null,null,null,null,null,null,null,null,null,0]
[{"$f":"IF(Prezentace!A16=0,\"\",Prezentace!A16)","v":""},{"$f":"IF(Prezentace!B16=0,\"\",Prezentace!B16)","v":""},{"$f":"Prezentace!D16","v":"P"},{"$f":"IF(Prezentace!F16=0,\"\",Prezentace!F16)","v":"Lukáš"},{"$f":"IF(Prezentace!E16=0,\"\",Prezentace!E16)","v":"Bouda "},null,null,null,null,null,null,null,null,null,null,null,null,null,null,0]
[{"$f":"IF(Prezentace!A17=0,\"\",Prezentace!A17)","v":""},{"$f":"IF(Prezentace!B17=0,\"\",Prezentace!B17)","v":""},{"$f":"Prezentace!D17","v":"P"},{"$f":"IF(Prezentace!F17=0,\"\",Prezentace!F17)","v":"Pavel"},{"$f":"IF(Prezentace!E17=0,\"\",Prezentace!E17)","v":"Koltai"},null,null,null,null,null,null,null,null,null,null,null,null,null,null,0]
[{"$f":"IF(Prezentace!A18=0,\"\",Prezentace!A18)","v":""},{"$f":"IF(Prezentace!B18=0,\"\",Prezentace!B18)","v":""},{"$f":"Prezentace!D18","v":"P"},{"$f":"IF(Prezentace!F18=0,\"\",Prezentace!F18)","v":"Vladislav"},{"$f":"IF(Prezentace!E18=0,\"\",Prezentace!E18)","v":"Přibyl"},null,null,null,null,null,null,null,null,null,null,null,null,null,null,0]
[{"$f":"IF(Prezentace!A19=0,\"\",Prezentace!A19)","v":""},{"$f":"IF(Prezentace!B19=0,\"\",Prezentace!B19)","v":""},{"$f":"Prezentace!D19","v":"P"},{"$f":"IF(Prezentace!F19=0,\"\",Prezentace!F19)","v":"Milan"},{"$f":"IF(Prezentace!E19=0,\"\",Prezentace!E19)","v":"Matějka st."},null,null,null,null,null,null,null,null,null,null,null,null,null,null,0]
[{"$f":"IF(Prezentace!A20=0,\"\",Prezentace!A20)","v":""},{"$f":"IF(Prezentace!B20=0,\"\",Prezentace!B20)","v":""},{"$f":"Prezentace!D20","v":"P"},{"$f":"IF(Prezentace!F20=0,\"\",Prezentace!F20)","v":"Miroslav"},{"$f":"IF(Prezentace!E20=0,\"\",Prezentace!E20)","v":"Fiala  "},null,null,null,null,null,null,null,null,null,null,null,null,null,null,0]
[{"$f":"IF(Prezentace!A21=0,\"\",Prezentace!A21)","v":""},{"$f":"IF(Prezentace!B21=0,\"\",Prezentace!B21)","v":""},{"$f":"Prezentace!D21","v":"P"},{"$f":"IF(Prezentace!F21=0,\"\",Prezentace!F21)","v":"Karel"},{"$f":"IF(Prezentace!E21=0,\"\",Prezentace!E21)","v":"Gažák "},null,null,null,null,null,null,null,null,null,null,null,null,null,null,0]
[{"$f":"IF(Prezentace!A22=0,\"\",Prezentace!A22)","v":""},{"$f":"IF(Prezentace!B22=0,\"\",Prezentace!B22)","v":""},{"$f":"Prezentace!D22","v":"P"},{"$f":"IF(Prezentace!F22=0,\"\",Prezentace!F22)","v":"Václav"},{"$f":"IF(Prezentace!E22=0,\"\",Prezentace!E22)","v":"Landkammer"},null,null,null,null,null,null,null,null,null,null,null,null,null,null,0]
[{"$f":"IF(Prezentace!A23=0,\"\",Prezentace!A23)","v":""},{"$f":"IF(Prezentace!B23=0,\"\",Prezentace!B23)","v":""},{"$f":"Prezentace!D23","v":"P"},{"$f":"IF(Prezentace!F23=0,\"\",Prezentace!F23)","v":"Vojtěch"},{"$f":"IF(Prezentace!E23=0,\"\",Prezentace!E23)","v":"Brejžek "},null,null,null,null,null,null,null,null,null,null,null,null,null,null,0]
[{"$f":"IF(Prezentace!A24=0,\"\",Prezentace!A24)","v":""},{"$f":"IF(Prezentace!B24=0,\"\",Prezentace!B24)","v":""},{"$f":"Prezentace!D24","v":"P"},{"$f":"IF(Prezentace!F24=0,\"\",Prezentace!F24)","v":"Antonín"},{"$f":"IF(Prezentace!E24=0,\"\",Prezentace!E24)","v":"Urbanec  "},null,null,null,null,null,null,null,null,null,null,null,null,null,null,0]
[{"$f":"IF(Prezentace!A25=0,\"\",Prezentace!A25)","v":""},{"$f":"IF(Prezentace!B25=0,\"\",Prezentace!B25)","v":""},{"$f":"Prezentace!D25","v":"P"},{"$f":"IF(Prezentace!F25=0,\"\",Prezentace!F25)","v":"Milan"},{"$f":"IF(Prezentace!E25=0,\"\",Prezentace!E25)","v":"Jílek  "},null,null,null,null,null,null,null,null,null,null,null,null,null,null,0]
[{"$f":"IF(Prezentace!A26=0,\"\",Prezentace!A26)","v":""},{"$f":"IF(Prezentace!B26=0,\"\",Prezentace!B26)","v":""},{"$f":"Prezentace!D26","v":"P"},{"$f":"IF(Prezentace!F26=0,\"\",Prezentace!F26)","v":"Václav"},{"$f":"IF(Prezentace!E26=0,\"\",Prezentace!E26)","v":"Jírů"},null,null,null,null,null,null,null,null,null,null,null,null,null,null,0]
[{"$f":"IF(Prezentace!A27=0,\"\",Prezentace!A27)","v":""},{"$f":"IF(Prezentace!B27=0,\"\",Prezentace!B27)","v":""},{"$f":"Prezentace!D27","v":"P"},{"$f":"IF(Prezentace!F27=0,\"\",Prezentace!F27)","v":"Milan"},{"$f":"IF(Prezentace!E27=0,\"\",Prezentace!E27)","v":"Krupica"},null,null,null,null,null,null,null,null,null,null,null,null,null,null,0]
[{"$f":"IF(Prezentace!A28=0,\"\",Prezentace!A28)","v":""},{"$f":"IF(Prezentace!B28=0,\"\",Prezentace!B28)","v":""},{"$f":"Prezentace!D28","v":"R"},{"$f":"IF(Prezentace!F28=0,\"\",Prezentace!F28)","v":"Milan"},{"$f":"IF(Prezentace!E28=0,\"\",Prezentace!E28)","v":"Krupica "},null,null,null,null,null,null,null,null,null,null,null,null,null,null,0]
[{"$f":"IF(Prezentace!A29=0,\"\",Prezentace!A29)","v":""},{"$f":"IF(Prezentace!B29=0,\"\",Prezentace!B29)","v":""},{"$f":"Prezentace!D29","v":"P"},{"$f":"IF(Prezentace!F29=0,\"\",Prezentace!F29)","v":"Miloslav"},{"$f":"IF(Prezentace!E29=0,\"\",Prezentace!E29)","v":"Petržílka"},null,null,null,null,null,null,null,null,null,null,null,null,null,null,0]
[{"$f":"IF(Prezentace!A30=0,\"\",Prezentace!A30)","v":""},{"$f":"IF(Prezentace!B30=0,\"\",Prezentace!B30)","v":""},{"$f":"Prezentace!D30","v":"R"},{"$f":"IF(Prezentace!F30=0,\"\",Prezentace!F30)","v":"Aleš"},{"$f":"IF(Prezentace!E30=0,\"\",Prezentace!E30)","v":"Seitl "},null,null,null,null,null,null,null,null,null,null,null,null,null,null,0]
[{"$f":"IF(Prezentace!A31=0,\"\",Prezentace!A31)","v":""},{"$f":"IF(Prezentace!B31=0,\"\",Prezentace!B31)","v":""},{"$f":"Prezentace!D31","v":"P"},{"$f":"IF(Prezentace!F31=0,\"\",Prezentace!F31)","v":"Aleš"},{"$f":"IF(Prezentace!E31=0,\"\",Prezentace!E31)","v":"Seitl "},null,null,null,null,null,null,null,null,null,null,null,null,null,null,0]
[{"$f":"IF(Prezentace!A32=0,\"\",Prezentace!A32)","v":""},{"$f":"IF(Prezentace!B32=0,\"\",Prezentace!B32)","v":""},{"$f":"Prezentace!D32","v":"P"},{"$f":"IF(Prezentace!F32=0,\"\",Prezentace!F32)","v":"Karel"},{"$f":"IF(Prezentace!E32=0,\"\",Prezentace!E32)","v":"Seitl"},null,null,null,null,null,null,null,null,null,null,null,null,null,null,0]
[{"$f":"IF(Prezentace!A33=0,\"\",Prezentace!A33)","v":""},{"$f":"IF(Prezentace!B33=0,\"\",Prezentace!B33)","v":""},{"$f":"Prezentace!D33","v":"P"},{"$f":"IF(Prezentace!F33=0,\"\",Prezentace!F33)","v":"David"},{"$f":"IF(Prezentace!E33=0,\"\",Prezentace!E33)","v":"Nikodým"},null,null,null,null,null,null,null,null,null,null,null,null,null,null,0]
[{"$f":"IF(Prezentace!A34=0,\"\",Prezentace!A34)","v":""},{"$f":"IF(Prezentace!B34=0,\"\",Prezentace!B34)","v":""},{"$f":"Prezentace!D34","v":"R"},{"$f":"IF(Prezentace!F34=0,\"\",Prezentace!F34)","v":"David"},{"$f":"IF(Prezentace!E34=0,\"\",Prezentace!E34)","v":"Nikodým "},null,null,null,null,null,null,null,null,null,null,null,null,null,null,0]
[{"$f":"IF(Prezentace!A35=0,\"\",Prezentace!A35)","v":""},{"$f":"IF(Prezentace!B35=0,\"\",Prezentace!B35)","v":""},{"$f":"Prezentace!D35","v":"P"},{"$f":"IF(Prezentace!F35=0,\"\",Prezentace!F35)","v":"Lukáš"},{"$f":"IF(Prezentace!E35=0,\"\",Prezentace!E35)","v":"Hobza"},null,null,null,null,null,null,null,null,null,null,null,null,null,null,0]
[{"$f":"IF(Prezentace!A36=0,\"\",Prezentace!A36)","v":""},{"$f":"IF(Prezentace!B36=0,\"\",Prezentace!B36)","v":""},{"$f":"Prezentace!D36","v":"P"},{"$f":"IF(Prezentace!F36=0,\"\",Prezentace!F36)","v":"Antonín"},{"$f":"IF(Prezentace!E36=0,\"\",Prezentace!E36)","v":"Jelínek "},null,null,null,null,null,null,null,null,null,null,null,null,null,null,0]
[{"$f":"IF(Prezentace!A37=0,\"\",Prezentace!A37)","v":""},{"$f":"IF(Prezentace!B37=0,\"\",Prezentace!B37)","v":""},{"$f":"Prezentace!D37","v":"R"},{"$f":"IF(Prezentace!F37=0,\"\",Prezentace!F37)","v":"Antonín"},{"$f":"IF(Prezentace!E37=0,\"\",Prezentace!E37)","v":"Jelínek "},null,null,null,null,null,null,null,null,null,null,null,null,null,null,0]
[{"$f":"IF(Prezentace!A38=0,\"\",Prezentace!A38)","v":""},{"$f":"IF(Prezentace!B38=0,\"\",Prezentace!B38)","v":""},{"$f":"Prezentace!D38","v":"P"},{"$f":"IF(Prezentace!F38=0,\"\",Prezentace!F38)","v":"Ladislav"},{"$f":"IF(Prezentace!E38=0,\"\",Prezentace!E38)","v":"Píša "},null,null,null,null,null,null,null,null,null,null,null,null,null,null,0]
[{"$f":"IF(Prezentace!A39=0,\"\",Prezentace!A39)","v":""},{"$f":"IF(Prezentace!B39=0,\"\",Prezentace!B39)","v":""},{"$f":"Prezentace!D39","v":"P"},{"$f":"IF(Prezentace!F39=0,\"\",Prezentace!F39)","v":"Štefan"},{"$f":"IF(Prezentace!E39=0,\"\",Prezentace!E39)","v":"Mesároš"},null,null,null,null,null,null,null,null,null,null,null,null,null,null,0]
[{"$f":"IF(Prezentace!A40=0,\"\",Prezentace!A40)","v":""},{"$f":"IF(Prezentace!B40=0,\"\",Prezentace!B40)","v":""},{"$f":"Prezentace!D40","v":"P"},{"$f":"IF(Prezentace!F40=0,\"\",Prezentace!F40)","v":"Pavel"},{"$f":"IF(Prezentace!E40=0,\"\",Prezentace!E40)","v":"Červenka"},null,null,null,null,null,null,null,null,null,null,null,null,null,null,{"$f":"(SUM(F38*$F$3,G38*$G$3,H38*$H$3,I38*$I$3,J38*$J$3,K38*$K$3,L38*$L$3,M38*$M$3,N38*$N$3,O38*$O$3,P38*$P$3,Q38*$Q$3,R38*$R$3))-S38","v":0}]
[{"$f":"IF(Prezentace!A41=0,\"\",Prezentace!A41)","v":""},{"$f":"IF(Prezentace!B41=0,\"\",Prezentace!B41)","v":""},{"$f":"Prezentace!D41","v":"R"},{"$f":"IF(Prezentace!F41=0,\"\",Prezentace!F41)","v":"Pavel"},{"$f":"IF(Prezentace!E41=0,\"\",Prezentace!E41)","v":"Červenka "},null,null,null,null,null,null,null,null,null,null,null,null,null,null,0]
[{"$f":"IF(Prezentace!A42=0,\"\",Prezentace!A42)","v":""},{"$f":"IF(Prezentace!B42=0,\"\",Prezentace!B42)","v":""},{"$f":"Prezentace!D42","v":"P"},{"$f":"IF(Prezentace!F42=0,\"\",Prezentace!F42)","v":"Jiří"},{"$f":"IF(Prezentace!E42=0,\"\",Prezentace!E42)","v":"Švihálek "},null,null,null,null,null,null,null,null,null,null,null,null,null,null,0]
[{"$f":"IF(Prezentace!A43=0,\"\",Prezentace!A43)","v":""},{"$f":"IF(Prezentace!B43=0,\"\",Prezentace!B43)","v":""},{"$f":"Prezentace!D43","v":"R"},{"$f":"IF(Prezentace!F43=0,\"\",Prezentace!F43)","v":"Jiří"},{"$f":"IF(Prezentace!E43=0,\"\",Prezentace!E43)","v":"Švihálek "},null,null,null,null,null,null,null,null,null,null,null,null,null,null,0]
[{"$f":"IF(Prezentace!A44=0,\"\",Prezentace!A44)","v":""},{"$f":"IF(Prezentace!B44=0,\"\",Prezentace!B44)","v":""},{"$f":"Prezentace!D44","v":"P"},{"$f":"IF(Prezentace!F44=0,\"\",Prezentace!F44)","v":"František"},{"$f":"IF(Prezentace!E44=0,\"\",Prezentace!E44)","v":"Toman "},null,null,null,null,null,null,null,null,null,null,null,null,null,null,0]
[{"$f":"IF(Prezentace!A45=0,\"\",Prezentace!A45)","v":""},{"$f":"IF(Prezentace!B45=0,\"\",Prezentace!B45)","v":""},{"$f":"Prezentace!D45","v":"P"},{"$f":"IF(Prezentace!F45=0,\"\",Prezentace!F45)","v":"Vladimír"},{"$f":"IF(Prezentace!E45=0,\"\",Prezentace!E45)","v":"VejslíK "},null,null,null,null,null,null,null,null,null,null,null,null,null,null,0]
[{"$f":"IF(Prezentace!A46=0,\"\",Prezentace!A46)","v":""},{"$f":"IF(Prezentace!B46=0,\"\",Prezentace!B46)","v":""},{"$f":"Prezentace!D46","v":"P"},{"$f":"IF(Prezentace!F46=0,\"\",Prezentace!F46)","v":"Karel"},{"$f":"IF(Prezentace!E46=0,\"\",Prezentace!E46)","v":"Získal "},null,null,null,null,null,null,null,null,null,null,null,null,null,null,0]
[{"$f":"IF(Prezentace!A47=0,\"\",Prezentace!A47)","v":""},{"$f":"IF(Prezentace!B47=0,\"\",Prezentace!B47)","v":""},{"$f":"Prezentace!D47","v":"R"},{"$f":"IF(Prezentace!F47=0,\"\",Prezentace!F47)","v":"Karel"},{"$f":"IF(Prezentace!E47=0,\"\",Prezentace!E47)","v":"Získal "},null,null,null,null,null,null,null,null,null,null,null,null,null,null,0]
[{"$f":"IF(Prezentace!A48=0,\"\",Prezentace!A48)","v":""},{"$f":"IF(Prezentace!B48=0,\"\",Prezentace!B48)","v":""},{"$f":"Prezentace!D48","v":"P"},{"$f":"IF(Prezentace!F48=0,\"\",Prezentace!F48)","v":"Jaroslav"},{"$f":"IF(Prezentace!E48=0,\"\",Prezentace!E48)","v":"Sokolík "},null,null,null,null,null,null,null,null,null,null,null,null,null,null,0]
[{"$f":"IF(Prezentace!A49=0,\"\",Prezentace!A49)","v":""},{"$f":"IF(Prezentace!B49=0,\"\",Prezentace!B49)","v":""},{"$f":"Prezentace!D49","v":"P"},{"$f":"IF(Prezentace!F49=0,\"\",Prezentace!F49)","v":"Milan"},{"$f":"IF(Prezentace!E49=0,\"\",Prezentace!E49)","v":"Kraus "},null,null,null,null,null,null,null,null,null,null,null,null,null,null,0]
[{"$f":"IF(Prezentace!A50=0,\"\",Prezentace!A50)","v":""},{"$f":"IF(Prezentace!B50=0,\"\",Prezentace!B50)","v":""},{"$f":"Prezentace!D50","v":"P"},{"$f":"IF(Prezentace!F50=0,\"\",Prezentace!F50)","v":""},{"$f":"IF(Prezentace!E50=0,\"\",Prezentace!E50)","v":""},null,null,null,null,null,null,null,null,null,null,null,null,null,null,0]
[{"$f":"IF(Prezentace!A51=0,\"\",Prezentace!A51)","v":""},{"$f":"IF(Prezentace!B51=0,\"\",Prezentace!B51)","v":""},{"$f":"Prezentace!D51","v":"P"},{"$f":"IF(Prezentace!F51=0,\"\",Prezentace!F51)","v":""},{"$f":"IF(Prezentace!E51=0,\"\",Prezentace!E51)","v":""},null,null,null,null,null,null,null,null,null,null,null,null,null,null,0]
[{"$f":"IF(Prezentace!A52=0,\"\",Prezentace!A52)","v":""},{"$f":"IF(Prezentace!B52=0,\"\",Prezentace!B52)","v":""},{"$f":"Prezentace!D52","v":"P"},{"$f":"IF(Prezentace!F52=0,\"\",Prezentace!F52)","v":""},{"$f":"IF(Prezentace!E52=0,\"\",Prezentace!E52)","v":""},null,null,null,null,null,null,null,null,null,null,null,null,null,null,0]
[{"$f":"IF(Prezentace!A53=0,\"\",Prezentace!A53)","v":""},{"$f":"IF(Prezentace!B53=0,\"\",Prezentace!B53)","v":""},{"$f":"Prezentace!D53","v":"P"},{"$f":"IF(Prezentace!F53=0,\"\",Prezentace!F53)","v":""},{"$f":"IF(Prezentace!E53=0,\"\",Prezentace!E53)","v":""},null,null,null,null,null,null,null,null,null,null,null,null,null,null,0]
[{"$f":"IF(Prezentace!A54=0,\"\",Prezentace!A54)","v":""},{"$f":"IF(Prezentace!B54=0,\"\",Prezentace!B54)","v":""},{"$f":"Prezentace!D54","v":"P"},{"$f":"IF(Prezentace!F54=0,\"\",Prezentace!F54)","v":""},{"$f":"IF(Prezentace!E54=0,\"\",Prezentace!E54)","v":""},null,null,null,null,null,null,null,null,null,null,null,null,null,null,0]
[{"$f":"IF(Prezentace!A55=0,\"\",Prezentace!A55)","v":""},{"$f":"IF(Prezentace!B55=0,\"\",Prezentace!B55)","v":""},{"$f":"Prezentace!D55","v":"P"},{"$f":"IF(Prezentace!F55=0,\"\",Prezentace!F55)","v":""},{"$f":"IF(Prezentace!E55=0,\"\",Prezentace!E55)","v":""},null,null,null,null,null,null,null,null,null,null,null,null,null,null,0]
[{"$f":"IF(Prezentace!A56=0,\"\",Prezentace!A56)","v":""},{"$f":"IF(Prezentace!B56=0,\"\",Prezentace!B56)","v":""},{"$f":"Prezentace!D56","v":"P"},{"$f":"IF(Prezentace!F56=0,\"\",Prezentace!F56)","v":""},{"$f":"IF(Prezentace!E56=0,\"\",Prezentace!E56)","v":""},null,null,null,null,null,null,null,null,null,null,null,null,null,null,0]
[{"$f":"IF(Prezentace!A57=0,\"\",Prezentace!A57)","v":""},{"$f":"IF(Prezentace!B57=0,\"\",Prezentace!B57)","v":""},{"$f":"Prezentace!D57","v":"P"},{"$f":"IF(Prezentace!F57=0,\"\",Prezentace!F57)","v":""},{"$f":"IF(Prezentace!E57=0,\"\",Prezentace!E57)","v":""},null,null,null,null,null,null,null,null,null,null,null,null,null,null,0]
[{"$f":"IF(Prezentace!A58=0,\"\",Prezentace!A58)","v":""},{"$f":"IF(Prezentace!B58=0,\"\",Prezentace!B58)","v":""},{"$f":"Prezentace!D58","v":"P"},{"$f":"IF(Prezentace!F58=0,\"\",Prezentace!F58)","v":""},{"$f":"IF(Prezentace!E58=0,\"\",Prezentace!E58)","v":""},null,null,null,null,null,null,null,null,null,null,null,null,null,null,0]
[{"$f":"IF(Prezentace!A59=0,\"\",Prezentace!A59)","v":""},{"$f":"IF(Prezentace!B59=0,\"\",Prezentace!B59)","v":""},{"$f":"Prezentace!D59","v":"P"},{"$f":"IF(Prezentace!F59=0,\"\",Prezentace!F59)","v":""},{"$f":"IF(Prezentace!E59=0,\"\",Prezentace!E59)","v":""},null,null,null,null,null,null,null,null,null,null,null,null,null,null,0]
[{"$f":"IF(Prezentace!A60=0,\"\",Prezentace!A60)","v":""},{"$f":"IF(Prezentace!B60=0,\"\",Prezentace!B60)","v":""},{"$f":"Prezentace!D60","v":"P"},{"$f":"IF(Prezentace!F60=0,\"\",Prezentace!F60)","v":""},{"$f":"IF(Prezentace!E60=0,\"\",Prezentace!E60)","v":""},null,null,null,null,null,null,null,null,null,null,null,null,null,null,0]
[{"$f":"IF(Prezentace!A61=0,\"\",Prezentace!A61)","v":""},{"$f":"IF(Prezentace!B61=0,\"\",Prezentace!B61)","v":""},{"$f":"Prezentace!D61","v":"P"},{"$f":"IF(Prezentace!F61=0,\"\",Prezentace!F61)","v":""},{"$f":"IF(Prezentace!E61=0,\"\",Prezentace!E61)","v":""},null,null,null,null,null,null,null,null,null,null,null,null,null,null,0]
[{"$f":"IF(Prezentace!A62=0,\"\",Prezentace!A62)","v":""},{"$f":"IF(Prezentace!B62=0,\"\",Prezentace!B62)","v":""},{"$f":"Prezentace!D62","v":"P"},{"$f":"IF(Prezentace!F62=0,\"\",Prezentace!F62)","v":""},{"$f":"IF(Prezentace!E62=0,\"\",Prezentace!E62)","v":""},null,null,null,null,null,null,null,null,null,null,null,null,null,null,0]
[{"$f":"IF(Prezentace!A63=0,\"\",Prezentace!A63)","v":""},{"$f":"IF(Prezentace!B63=0,\"\",Prezentace!B63)","v":""},{"$f":"Prezentace!D63","v":"P"},{"$f":"IF(Prezentace!F63=0,\"\",Prezentace!F63)","v":""},{"$f":"IF(Prezentace!E63=0,\"\",Prezentace!E63)","v":""},null,null,null,null,null,null,null,null,null,null,null,null,null,null,0]
[{"$f":"IF(Prezentace!A64=0,\"\",Prezentace!A64)","v":""},{"$f":"IF(Prezentace!B64=0,\"\",Prezentace!B64)","v":""},{"$f":"Prezentace!D64","v":"P"},{"$f":"IF(Prezentace!F64=0,\"\",Prezentace!F64)","v":""},{"$f":"IF(Prezentace!E64=0,\"\",Prezentace!E64)","v":""},null,null,null,null,null,null,null,null,null,null,null,null,null,null,0]
[{"$f":"IF(Prezentace!A65=0,\"\",Prezentace!A65)","v":""},{"$f":"IF(Prezentace!B65=0,\"\",Prezentace!B65)","v":""},{"$f":"Prezentace!D65","v":"P"},{"$f":"IF(Prezentace!F65=0,\"\",Prezentace!F65)","v":""},{"$f":"IF(Prezentace!E65=0,\"\",Prezentace!E65)","v":""},null,null,null,null,null,null,null,null,null,null,null,null,null,null,0]
[{"$f":"IF(Prezentace!A66=0,\"\",Prezentace!A66)","v":""},{"$f":"IF(Prezentace!B66=0,\"\",Prezentace!B66)","v":""},{"$f":"Prezentace!D66","v":"P"},{"$f":"IF(Prezentace!F66=0,\"\",Prezentace!F66)","v":""},{"$f":"IF(Prezentace!E66=0,\"\",Prezentace!E66)","v":""},null,null,null,null,null,null,null,null,null,null,null,null,null,null,0]
[{"$f":"IF(Prezentace!A67=0,\"\",Prezentace!A67)","v":""},{"$f":"IF(Prezentace!B67=0,\"\",Prezentace!B67)","v":""},{"$f":"Prezentace!D67","v":"P"},{"$f":"IF(Prezentace!F67=0,\"\",Prezentace!F67)","v":""},{"$f":"IF(Prezentace!E67=0,\"\",Prezentace!E67)","v":""},null,null,null,null,null,null,null,null,null,null,null,null,null,null,0]
[{"$f":"IF(Prezentace!A68=0,\"\",Prezentace!A68)","v":""},{"$f":"IF(Prezentace!B68=0,\"\",Prezentace!B68)","v":""},{"$f":"Prezentace!D68","v":"P"},{"$f":"IF(Prezentace!F68=0,\"\",Prezentace!F68)","v":""},{"$f":"IF(Prezentace!E68=0,\"\",Prezentace!E68)","v":""},null,null,null,null,null,null,null,null,null,null,null,null,null,null,0]
[{"$f":"IF(Prezentace!A69=0,\"\",Prezentace!A69)","v":""},{"$f":"IF(Prezentace!B69=0,\"\",Prezentace!B69)","v":""},{"$f":"Prezentace!D69","v":"P"},{"$f":"IF(Prezentace!F69=0,\"\",Prezentace!F69)","v":""},{"$f":"IF(Prezentace!E69=0,\"\",Prezentace!E69)","v":""},null,null,null,null,null,null,null,null,null,null,null,null,null,null,0]
[{"$f":"IF(Prezentace!A70=0,\"\",Prezentace!A70)","v":""},{"$f":"IF(Prezentace!B70=0,\"\",Prezentace!B70)","v":""},{"$f":"Prezentace!D70","v":"P"},{"$f":"IF(Prezentace!F70=0,\"\",Prezentace!F70)","v":""},{"$f":"IF(Prezentace!E70=0,\"\",Prezentace!E70)","v":""},null,null,null,null,null,null,null,null,null,null,null,null,null,null,0]
[{"$f":"IF(Prezentace!A71=0,\"\",Prezentace!A71)","v":""},{"$f":"IF(Prezentace!B71=0,\"\",Prezentace!B71)","v":""},{"$f":"Prezentace!D71","v":"P"},{"$f":"IF(Prezentace!F71=0,\"\",Prezentace!F71)","v":""},{"$f":"IF(Prezentace!E71=0,\"\",Prezentace!E71)","v":""},null,null,null,null,null,null,null,null,null,null,null,null,null,null,0]
[{"$f":"IF(Prezentace!A72=0,\"\",Prezentace!A72)","v":""},{"$f":"IF(Prezentace!B72=0,\"\",Prezentace!B72)","v":""},{"$f":"Prezentace!D72","v":"P"},{"$f":"IF(Prezentace!F72=0,\"\",Prezentace!F72)","v":""},{"$f":"IF(Prezentace!E72=0,\"\",Prezentace!E72)","v":""},null,null,null,null,null,null,null,null,null,null,null,null,null,null,0]
[{"$f":"IF(Prezentace!A73=0,\"\",Prezentace!A73)","v":""},{"$f":"IF(Prezentace!B73=0,\"\",Prezentace!B73)","v":""},{"$f":"Prezentace!D73","v":"P"},{"$f":"IF(Prezentace!F73=0,\"\",Prezentace!F73)","v":""},{"$f":"IF(Prezentace!E73=0,\"\",Prezentace!E73)","v":""},null,null,null,null,null,null,null,null,null,null,null,null,null,null,0]
[{"$f":"IF(Prezentace!A74=0,\"\",Prezentace!A74)","v":""},{"$f":"IF(Prezentace!B74=0,\"\",Prezentace!B74)","v":""},{"$f":"Prezentace!D74","v":"P"},{"$f":"IF(Prezentace!F74=0,\"\",Prezentace!F74)","v":""},{"$f":"IF(Prezentace!E74=0,\"\",Prezentace!E74)","v":""},null,null,null,null,null,null,null,null,null,null,null,null,null,null,0]
[{"$f":"IF(Prezentace!A75=0,\"\",Prezentace!A75)","v":""},{"$f":"IF(Prezentace!B75=0,\"\",Prezentace!B75)","v":""},{"$f":"Prezentace!D75","v":"P"},{"$f":"IF(Prezentace!F75=0,\"\",Prezentace!F75)","v":""},{"$f":"IF(Prezentace!E75=0,\"\",Prezentace!E75)","v":""},null,null,null,null,null,null,null,null,null,null,null,null,null,null,0]
[{"$f":"IF(Prezentace!A76=0,\"\",Prezentace!A76)","v":""},{"$f":"IF(Prezentace!B76=0,\"\",Prezentace!B76)","v":""},{"$f":"Prezentace!D76","v":"P"},{"$f":"IF(Prezentace!F76=0,\"\",Prezentace!F76)","v":""},{"$f":"IF(Prezentace!E76=0,\"\",Prezentace!E76)","v":""},null,null,null,null,null,null,null,null,null,null,null,null,null,null,0]
[{"$f":"IF(Prezentace!A77=0,\"\",Prezentace!A77)","v":""},{"$f":"IF(Prezentace!B77=0,\"\",Prezentace!B77)","v":""},{"$f":"Prezentace!D77","v":"P"},{"$f":"IF(Prezentace!F77=0,\"\",Prezentace!F77)","v":""},{"$f":"IF(Prezentace!E77=0,\"\",Prezentace!E77)","v":""},null,null,null,null,null,null,null,null,null,null,null,null,null,null,0]
[{"$f":"IF(Prezentace!A78=0,\"\",Prezentace!A78)","v":""},{"$f":"IF(Prezentace!B78=0,\"\",Prezentace!B78)","v":""},{"$f":"Prezentace!D78","v":"P"},{"$f":"IF(Prezentace!F78=0,\"\",Prezentace!F78)","v":""},{"$f":"IF(Prezentace!E78=0,\"\",Prezentace!E78)","v":""},null,null,null,null,null,null,null,null,null,null,null,null,null,null,0]
[{"$f":"IF(Prezentace!A79=0,\"\",Prezentace!A79)","v":""},{"$f":"IF(Prezentace!B79=0,\"\",Prezentace!B79)","v":""},{"$f":"Prezentace!D79","v":"P"},{"$f":"IF(Prezentace!F79=0,\"\",Prezentace!F79)","v":""},{"$f":"IF(Prezentace!E79=0,\"\",Prezentace!E79)","v":""},null,null,null,null,null,null,null,null,null,null,null,null,null,null,0]
[{"$f":"IF(Prezentace!A80=0,\"\",Prezentace!A80)","v":""},{"$f":"IF(Prezentace!B80=0,\"\",Prezentace!B80)","v":""},{"$f":"Prezentace!D80","v":"P"},{"$f":"IF(Prezentace!F80=0,\"\",Prezentace!F80)","v":""},{"$f":"IF(Prezentace!E80=0,\"\",Prezentace!E80)","v":""},null,null,null,null,null,null,null,null,null,null,null,null,null,null,0]
[{"$f":"IF(Prezentace!A81=0,\"\",Prezentace!A81)","v":""},{"$f":"IF(Prezentace!B81=0,\"\",Prezentace!B81)","v":""},{"$f":"Prezentace!D81","v":"P"},{"$f":"IF(Prezentace!F81=0,\"\",Prezentace!F81)","v":""},{"$f":"IF(Prezentace!E81=0,\"\",Prezentace!E81)","v":""},null,null,null,null,null,null,null,null,null,null,null,null,null,null,0]
[{"$f":"IF(Prezentace!A82=0,\"\",Prezentace!A82)","v":""},{"$f":"IF(Prezentace!B82=0,\"\",Prezentace!B82)","v":""},{"$f":"Prezentace!D82","v":"P"},{"$f":"IF(Prezentace!F82=0,\"\",Prezentace!F82)","v":""},{"$f":"IF(Prezentace!E82=0,\"\",Prezentace!E82)","v":""},null,null,null,null,null,null,null,null,null,null,null,null,null,null,0]
[{"$f":"IF(Prezentace!A83=0,\"\",Prezentace!A83)","v":""},{"$f":"IF(Prezentace!B83=0,\"\",Prezentace!B83)","v":""},{"$f":"Prezentace!D83","v":"P"},{"$f":"IF(Prezentace!F83=0,\"\",Prezentace!F83)","v":""},{"$f":"IF(Prezentace!E83=0,\"\",Prezentace!E83)","v":""},null,null,null,null,null,null,null,null,null,null,null,null,null,null,0]
[{"$f":"IF(Prezentace!A84=0,\"\",Prezentace!A84)","v":""},{"$f":"IF(Prezentace!B84=0,\"\",Prezentace!B84)","v":""},{"$f":"Prezentace!D84","v":"P"},{"$f":"IF(Prezentace!F84=0,\"\",Prezentace!F84)","v":""},{"$f":"IF(Prezentace!E84=0,\"\",Prezentace!E84)","v":""},null,null,null,null,null,null,null,null,null,null,null,null,null,null,0]
[{"$f":"IF(Prezentace!A85=0,\"\",Prezentace!A85)","v":""},{"$f":"IF(Prezentace!B85=0,\"\",Prezentace!B85)","v":""},{"$f":"Prezentace!D85","v":"P"},{"$f":"IF(Prezentace!F85=0,\"\",Prezentace!F85)","v":""},{"$f":"IF(Prezentace!E85=0,\"\",Prezentace!E85)","v":""},null,null,null,null,null,null,null,null,null,null,null,null,null,null,0]
[{"$f":"IF(Prezentace!A86=0,\"\",Prezentace!A86)","v":""},{"$f":"IF(Prezentace!B86=0,\"\",Prezentace!B86)","v":""},{"$f":"Prezentace!D86","v":"P"},{"$f":"IF(Prezentace!F86=0,\"\",Prezentace!F86)","v":""},{"$f":"IF(Prezentace!E86=0,\"\",Prezentace!E86)","v":""},null,null,null,null,null,null,null,null,null,null,null,null,null,null,0]
[{"$f":"IF(Prezentace!A87=0,\"\",Prezentace!A87)","v":""},{"$f":"IF(Prezentace!B87=0,\"\",Prezentace!B87)","v":""},{"$f":"Prezentace!D87","v":"P"},{"$f":"IF(Prezentace!F87=0,\"\",Prezentace!F87)","v":""},{"$f":"IF(Prezentace!E87=0,\"\",Prezentace!E87)","v":""},null,null,null,null,null,null,null,null,null,null,null,null,null,null,0]
[{"$f":"IF(Prezentace!A88=0,\"\",Prezentace!A88)","v":""},{"$f":"IF(Prezentace!B88=0,\"\",Prezentace!B88)","v":""},{"$f":"Prezentace!D88","v":"P"},{"$f":"IF(Prezentace!F88=0,\"\",Prezentace!F88)","v":""},{"$f":"IF(Prezentace!E88=0,\"\",Prezentace!E88)","v":""},null,null,null,null,null,null,null,null,null,null,null,null,null,null,0]
[{"$f":"IF(Prezentace!A89=0,\"\",Prezentace!A89)","v":""},{"$f":"IF(Prezentace!B89=0,\"\",Prezentace!B89)","v":""},{"$f":"Prezentace!D89","v":"P"},{"$f":"IF(Prezentace!F89=0,\"\",Prezentace!F89)","v":""},{"$f":"IF(Prezentace!E89=0,\"\",Prezentace!E89)","v":""},null,null,null,null,null,null,null,null,null,null,null,null,null,null,0]
[{"$f":"IF(Prezentace!A90=0,\"\",Prezentace!A90)","v":""},{"$f":"IF(Prezentace!B90=0,\"\",Prezentace!B90)","v":""},{"$f":"Prezentace!D90","v":"P"},{"$f":"IF(Prezentace!F90=0,\"\",Prezentace!F90)","v":""},{"$f":"IF(Prezentace!E90=0,\"\",Prezentace!E90)","v":""},null,null,null,null,null,null,null,null,null,null,null,null,null,null,0]
[{"$f":"IF(Prezentace!A91=0,\"\",Prezentace!A91)","v":""},{"$f":"IF(Prezentace!B91=0,\"\",Prezentace!B91)","v":""},{"$f":"Prezentace!D91","v":"P"},{"$f":"IF(Prezentace!F91=0,\"\",Prezentace!F91)","v":""},{"$f":"IF(Prezentace!E91=0,\"\",Prezentace!E91)","v":""},null,null,null,null,null,null,null,null,null,null,null,null,null,null,0]
[{"$f":"IF(Prezentace!A92=0,\"\",Prezentace!A92)","v":""},{"$f":"IF(Prezentace!B92=0,\"\",Prezentace!B92)","v":""},{"$f":"Prezentace!D92","v":"P"},{"$f":"IF(Prezentace!F92=0,\"\",Prezentace!F92)","v":""},{"$f":"IF(Prezentace!E92=0,\"\",Prezentace!E92)","v":""},null,null,null,null,null,null,null,null,null,null,null,null,null,null,0]
[{"$f":"IF(Prezentace!A93=0,\"\",Prezentace!A93)","v":""},{"$f":"IF(Prezentace!B93=0,\"\",Prezentace!B93)","v":""},{"$f":"Prezentace!D93","v":"P"},{"$f":"IF(Prezentace!F93=0,\"\",Prezentace!F93)","v":""},{"$f":"IF(Prezentace!E93=0,\"\",Prezentace!E93)","v":""},null,null,null,null,null,null,null,null,null,null,null,null,null,null,0]
[{"$f":"IF(Prezentace!A94=0,\"\",Prezentace!A94)","v":""},{"$f":"IF(Prezentace!B94=0,\"\",Prezentace!B94)","v":""},{"$f":"Prezentace!D94","v":"P"},{"$f":"IF(Prezentace!F94=0,\"\",Prezentace!F94)","v":""},{"$f":"IF(Prezentace!E94=0,\"\",Prezentace!E94)","v":""},null,null,null,null,null,null,null,null,null,null,null,null,null,null,0]
[{"$f":"IF(Prezentace!A95=0,\"\",Prezentace!A95)","v":""},{"$f":"IF(Prezentace!B95=0,\"\",Prezentace!B95)","v":""},{"$f":"Prezentace!D95","v":"P"},{"$f":"IF(Prezentace!F95=0,\"\",Prezentace!F95)","v":""},{"$f":"IF(Prezentace!E95=0,\"\",Prezentace!E95)","v":""},null,null,null,null,null,null,null,null,null,null,null,null,null,null,0]
[{"$f":"IF(Prezentace!A96=0,\"\",Prezentace!A96)","v":""},{"$f":"IF(Prezentace!B96=0,\"\",Prezentace!B96)","v":""},{"$f":"Prezentace!D96","v":"P"},{"$f":"IF(Prezentace!F96=0,\"\",Prezentace!F96)","v":""},{"$f":"IF(Prezentace!E96=0,\"\",Prezentace!E96)","v":""},null,null,null,null,null,null,null,null,null,null,null,null,null,null,0]
[{"$f":"IF(Prezentace!A97=0,\"\",Prezentace!A97)","v":""},{"$f":"IF(Prezentace!B97=0,\"\",Prezentace!B97)","v":""},{"$f":"Prezentace!D97","v":"P"},{"$f":"IF(Prezentace!F97=0,\"\",Prezentace!F97)","v":""},{"$f":"IF(Prezentace!E97=0,\"\",Prezentace!E97)","v":""},null,null,null,null,null,null,null,null,null,null,null,null,null,null,0]
[{"$f":"IF(Prezentace!A98=0,\"\",Prezentace!A98)","v":""},{"$f":"IF(Prezentace!B98=0,\"\",Prezentace!B98)","v":""},{"$f":"Prezentace!D98","v":"P"},{"$f":"IF(Prezentace!F98=0,\"\",Prezentace!F98)","v":""},{"$f":"IF(Prezentace!E98=0,\"\",Prezentace!E98)","v":""},null,null,null,null,null,null,null,null,null,null,null,null,null,null,0]
[{"$f":"IF(Prezentace!A99=0,\"\",Prezentace!A99)","v":""},{"$f":"IF(Prezentace!B99=0,\"\",Prezentace!B99)","v":""},{"$f":"Prezentace!D99","v":"P"},{"$f":"IF(Prezentace!F99=0,\"\",Prezentace!F99)","v":""},{"$f":"IF(Prezentace!E99=0,\"\",Prezentace!E99)","v":""},null,null,null,null,null,null,null,null,null,null,null,null,null,null,0]
[{"$f":"IF(Prezentace!A100=0,\"\",Prezentace!A100)","v":""},{"$f":"IF(Prezentace!B100=0,\"\",Prezentace!B100)","v":""},{"$f":"Prezentace!D100","v":"P"},{"$f":"IF(Prezentace!F100=0,\"\",Prezentace!F100)","v":""},{"$f":"IF(Prezentace!E100=0,\"\",Prezentace!E100)","v":""},null,null,null,null,null,null,null,null,null,null,null,null,null,null,0]
[{"$f":"IF(Prezentace!A101=0,\"\",Prezentace!A101)","v":""},{"$f":"IF(Prezentace!B101=0,\"\",Prezentace!B101)","v":""},{"$f":"Prezentace!D101","v":"P"},{"$f":"IF(Prezentace!F101=0,\"\",Prezentace!F101)","v":""},{"$f":"IF(Prezentace!E101=0,\"\",Prezentace!E101)","v":""},null,null,null,null,null,null,null,null,null,null,null,null,null,null,0]
[{"$f":"IF(Prezentace!A102=0,\"\",Prezentace!A102)","v":""},{"$f":"IF(Prezentace!B102=0,\"\",Prezentace!B102)","v":""},{"$f":"Prezentace!D102","v":"P"},{"$f":"IF(Prezentace!F102=0,\"\",Prezentace!F102)","v":""},{"$f":"IF(Prezentace!E102=0,\"\",Prezentace!E102)","v":""},null,null,null,null,null,null,null,null,null,null,null,null,null,null,0]
[{"$f":"IF(Prezentace!A103=0,\"\",Prezentace!A103)","v":""},{"$f":"IF(Prezentace!B103=0,\"\",Prezentace!B103)","v":""},{"$f":"Prezentace!D103","v":"P"},{"$f":"IF(Prezentace!F103=0,\"\",Prezentace!F103)","v":""},{"$f":"IF(Prezentace!E103=0,\"\",Prezentace!E103)","v":""},null,null,null,null,null,null,null,null,null,null,null,null,null,null,0]
[{"$f":"IF(Prezentace!A104=0,\"\",Prezentace!A104)","v":""},{"$f":"IF(Prezentace!B104=0,\"\",Prezentace!B104)","v":""},{"$f":"Prezentace!D104","v":"P"},{"$f":"IF(Prezentace!F104=0,\"\",Prezentace!F104)","v":""},{"$f":"IF(Prezentace!E104=0,\"\",Prezentace!E104)","v":""},null,null,null,null,null,null,null,null,null,null,null,null,null,null,{"$f":"(SUM(F102*$F$3,G102*$G$3,H102*$H$3,I102*$I$3,J102*$J$3,K102*$K$3,L102*$L$3,M102*$M$3,N102*$N$3,O102*$O$3,P102*$P$3,Q102*$Q$3,R102*$R$3))-S102","v":0}]

{"sheet":"3(M)","index":6,"n_rows":102,"n_cols":20,"rows_kept":102,"cut":false,"hidden":true,"merged":[[0,3,0,18],[0,0,2,0],[0,1,2,1]]}
["Druž.","Kap.",null,"Disciplina 3"]
[]
[null,null,null,null,null,0,1,2,3,4,5,6,7,8,9,10,12,15,"Čas","Součet"]
[{"$f":"IF(Prezentace!A6=0,\"\",Prezentace!A6)","v":""},{"$f":"IF(Prezentace!B6=0,\"\",Prezentace!B6)","v":""},{"$f":"Prezentace!D6","v":"P"},{"$f":"IF(Prezentace!F6=0,\"\",Prezentace!F6)","v":"Martin"},{"$f":"IF(Prezentace!E6=0,\"\",Prezentace!E6)","v":"Adensam "},null,null,null,null,null,null,null,null,null,null,null,null,null,null,{"$f":"(SUM(F4*$F$3,G4*$G$3,H4*$H$3,I4*$I$3,J4*$J$3,K4*$K$3,L4*$L$3,M4*$M$3,N4*$N$3,O4*$O$3,P4*$P$3,Q4*$Q$3,R4*$R$3))-S4","v":0}]
[{"$f":"IF(Prezentace!A7=0,\"\",Prezentace!A7)","v":""},{"$f":"IF(Prezentace!B7=0,\"\",Prezentace!B7)","v":""},{"$f":"Prezentace!D7","v":"R"},{"$f":"IF(Prezentace!F7=0,\"\",Prezentace!F7)","v":"Martin"},{"$f":"IF(Prezentace!E7=0,\"\",Prezentace!E7)","v":"Adensam"},null,null,null,null,null,null,null,null,null,null,null,null,null,null,{"$f":"(SUM(F5*$F$3,G5*$G$3,H5*$H$3,I5*$I$3,J5*$J$3,K5*$K$3,L5*$L$3,M5*$M$3,N5*$N$3,O5*$O$3,P5*$P$3,Q5*$Q$3,R5*$R$3))-S5","v":0}]
[{"$f":"IF(Prezentace!A8=0,\"\",Prezentace!A8)","v":""},{"$f":"IF(Prezentace!B8=0,\"\",Prezentace!B8)","v":""},{"$f":"Prezentace!D8","v":"P"},{"$f":"IF(Prezentace!F8=0,\"\",Prezentace!F8)","v":"Jaroslav"},{"$f":"IF(Prezentace!E8=0,\"\",Prezentace!E8)","v":"Kostříž "},null,null,null,null,null,null,null,null,null,null,null,null,null,null,0]
[{"$f":"IF(Prezentace!A9=0,\"\",Prezentace!A9)","v":""},{"$f":"IF(Prezentace!B9=0,\"\",Prezentace!B9)","v":""},{"$f":"Prezentace!D9","v":"P"},{"$f":"IF(Prezentace!F9=0,\"\",Prezentace!F9)","v":"Miroslav"},{"$f":"IF(Prezentace!E9=0,\"\",Prezentace!E9)","v":"Koch   ml."},null,null,null,null,null,null,null,null,null,null,null,null,null,null,0]
[{"$f":"IF(Prezentace!A10=0,\"\",Prezentace!A10)","v":""},{"$f":"IF(Prezentace!B10=0,\"\",Prezentace!B10)","v":""},{"$f":"Prezentace!D10","v":"P"},{"$f":"IF(Prezentace!F10=0,\"\",Prezentace!F10)","v":"Miroslav"},{"$f":"IF(Prezentace!E10=0,\"\",Prezentace!E10)","v":"Koch  st. "},null,null,null,null,null,null,null,null,null,null,null,null,null,null,0]
[{"$f":"IF(Prezentace!A11=0,\"\",Prezentace!A11)","v":""},{"$f":"IF(Prezentace!B11=0,\"\",Prezentace!B11)","v":""},{"$f":"Prezentace!D11","v":"P"},{"$f":"IF(Prezentace!F11=0,\"\",Prezentace!F11)","v":"Bohumil"},{"$f":"IF(Prezentace!E11=0,\"\",Prezentace!E11)","v":"Herceg"},null,null,null,null,null,null,null,null,null,null,null,null,null,null,0]
[{"$f":"IF(Prezentace!A12=0,\"\",Prezentace!A12)","v":""},{"$f":"IF(Prezentace!B12=0,\"\",Prezentace!B12)","v":""},{"$f":"Prezentace!D12","v":"P"},{"$f":"IF(Prezentace!F12=0,\"\",Prezentace!F12)","v":"Viktor"},{"$f":"IF(Prezentace!E12=0,\"\",Prezentace!E12)","v":"Fuksa  "},null,null,null,null,null,null,null,null,null,null,null,null,null,null,0]
[{"$f":"IF(Prezentace!A13=0,\"\",Prezentace!A13)","v":""},{"$f":"IF(Prezentace!B13=0,\"\",Prezentace!B13)","v":""},{"$f":"Prezentace!D13","v":"P"},{"$f":"IF(Prezentace!F13=0,\"\",Prezentace!F13)","v":"Milan"},{"$f":"IF(Prezentace!E13=0,\"\",Prezentace!E13)","v":"Matějka  ml."},null,null,null,null,null,null,null,null,null,null,null,null,null,null,0]
[{"$f":"IF(Prezentace!A14=0,\"\",Prezentace!A14)","v":""},{"$f":"IF(Prezentace!B14=0,\"\",Prezentace!B14)","v":""},{"$f":"Prezentace!D14","v":"P"},{"$f":"IF(Prezentace!F14=0,\"\",Prezentace!F14)","v":"Michal"},{"$f":"IF(Prezentace!E14=0,\"\",Prezentace!E14)","v":"Svoboda"},null,null,null,null,null,null,null,null,null,null,null,null,null,null,0]
[{"$f":"IF(Prezentace!A15=0,\"\",Prezentace!A15)","v":""},{"$f":"IF(Prezentace!B15=0,\"\",Prezentace!B15)","v":""},{"$f":"Prezentace!D15","v":"R"},{"$f":"IF(Prezentace!F15=0,\"\",Prezentace!F15)","v":"Lukáš"},{"$f":"IF(Prezentace!E15=0,\"\",Prezentace!E15)","v":"Bouda "},null,null,null,null,null,null,null,null,null,null,null,null,null,null,0]
[{"$f":"IF(Prezentace!A16=0,\"\",Prezentace!A16)","v":""},{"$f":"IF(Prezentace!B16=0,\"\",Prezentace!B16)","v":""},{"$f":"Prezentace!D16","v":"P"},{"$f":"IF(Prezentace!F16=0,\"\",Prezentace!F16)","v":"Lukáš"},{"$f":"IF(Prezentace!E16=0,\"\",Prezentace!E16)","v":"Bouda "},null,null,null,null,null,null,null,null,null,null,null,null,null,null,0]
[{"$f":"IF(Prezentace!A17=0,\"\",Prezentace!A17)","v":""},{"$f":"IF(Prezentace!B17=0,\"\",Prezentace!B17)","v":""},{"$f":"Prezentace!D17","v":"P"},{"$f":"IF(Prezentace!F17=0,\"\",Prezentace!F17)","v":"Pavel"},{"$f":"IF(Prezentace!E17=0,\"\",Prezentace!E17)","v":"Koltai"},null,null,null,null,null,null,null,null,null,null,null,null,null,null,0]
[{"$f":"IF(Prezentace!A18=0,\"\",Prezentace!A18)","v":""},{"$f":"IF(Prezentace!B18=0,\"\",Prezentace!B18)","v":""},{"$f":"Prezentace!D18","v":"P"},{"$f":"IF(Prezentace!F18=0,\"\",Prezentace!F18)","v":"Vladislav"},{"$f":"IF(Prezentace!E18=0,\"\",Prezentace!E18)","v":"Přibyl"},null,null,null,null,null,null,null,null,null,null,null,null,null,null,0]
[{"$f":"IF(Prezentace!A19=0,\"\",Prezentace!A19)","v":""},{"$f":"IF(Prezentace!B19=0,\"\",Prezentace!B19)","v":""},{"$f":"Prezentace!D19","v":"P"},{"$f":"IF(Prezentace!F19=0,\"\",Prezentace!F19)","v":"Milan"},{"$f":"IF(Prezentace!E19=0,\"\",Prezentace!E19)","v":"Matějka st."},null,null,null,null,null,null,null,null,null,null,null,null,null,null,0]
[{"$f":"IF(Prezentace!A20=0,\"\",Prezentace!A20)","v":""},{"$f":"IF(Prezentace!B20=0,\"\",Prezentace!B20)","v":""},{"$f":"Prezentace!D20","v":"P"},{"$f":"IF(Prezentace!F20=0,\"\",Prezentace!F20)","v":"Miroslav"},{"$f":"IF(Prezentace!E20=0,\"\",Prezentace!E20)","v":"Fiala  "},null,null,null,null,null,null,null,null,null,null,null,null,null,null,0]
[{"$f":"IF(Prezentace!A21=0,\"\",Prezentace!A21)","v":""},{"$f":"IF(Prezentace!B21=0,\"\",Prezentace!B21)","v":""},{"$f":"Prezentace!D21","v":"P"},{"$f":"IF(Prezentace!F21=0,\"\",Prezentace!F21)","v":"Karel"},{"$f":"IF(Prezentace!E21=0,\"\",Prezentace!E21)","v":"Gažák "},null,null,null,null,null,null,null,null,null,null,null,null,null,null,0]
[{"$f":"IF(Prezentace!A22=0,\"\",Prezentace!A22)","v":""},{"$f":"IF(Prezentace!B22=0,\"\",Prezentace!B22)","v":""},{"$f":"Prezentace!D22","v":"P"},{"$f":"IF(Prezentace!F22=0,\"\",Prezentace!F22)","v":"Václav"},{"$f":"IF(Prezentace!E22=0,\"\",Prezentace!E22)","v":"Landkammer"},null,null,null,null,null,null,null,null,null,null,null,null,null,null,0]
[{"$f":"IF(Prezentace!A23=0,\"\",Prezentace!A23)","v":""},{"$f":"IF(Prezentace!B23=0,\"\",Prezentace!B23)","v":""},{"$f":"Prezentace!D23","v":"P"},{"$f":"IF(Prezentace!F23=0,\"\",Prezentace!F23)","v":"Vojtěch"},{"$f":"IF(Prezentace!E23=0,\"\",Prezentace!E23)","v":"Brejžek "},null,null,null,null,null,null,null,null,null,null,null,null,null,null,0]
[{"$f":"IF(Prezentace!A24=0,\"\",Prezentace!A24)","v":""},{"$f":"IF(Prezentace!B24=0,\"\",Prezentace!B24)","v":""},{"$f":"Prezentace!D24","v":"P"},{"$f":"IF(Prezentace!F24=0,\"\",Prezentace!F24)","v":"Antonín"},{"$f":"IF(Prezentace!E24=0,\"\",Prezentace!E24)","v":"Urbanec  "},null,null,null,null,null,null,null,null,null,null,null,null,null,null,0]
[{"$f":"IF(Prezentace!A25=0,\"\",Prezentace!A25)","v":""},{"$f":"IF(Prezentace!B25=0,\"\",Prezentace!B25)","v":""},{"$f":"Prezentace!D25","v":"P"},{"$f":"IF(Prezentace!F25=0,\"\",Prezentace!F25)","v":"Milan"},{"$f":"IF(Prezentace!E25=0,\"\",Prezentace!E25)","v":"Jílek  "},null,null,null,null,null,null,null,null,null,null,null,null,null,null,0]
[{"$f":"IF(Prezentace!A26=0,\"\",Prezentace!A26)","v":""},{"$f":"IF(Prezentace!B26=0,\"\",Prezentace!B26)","v":""},{"$f":"Prezentace!D26","v":"P"},{"$f":"IF(Prezentace!F26=0,\"\",Prezentace!F26)","v":"Václav"},{"$f":"IF(Prezentace!E26=0,\"\",Prezentace!E26)","v":"Jírů"},null,null,null,null,null,null,null,null,null,null,null,null,null,null,0]
[{"$f":"IF(Prezentace!A27=0,\"\",Prezentace!A27)","v":""},{"$f":"IF(Prezentace!B27=0,\"\",Prezentace!B27)","v":""},{"$f":"Prezentace!D27","v":"P"},{"$f":"IF(Prezentace!F27=0,\"\",Prezentace!F27)","v":"Milan"},{"$f":"IF(Prezentace!E27=0,\"\",Prezentace!E27)","v":"Krupica"},null,null,null,null,null,null,null,null,null,null,null,null,null,null,0]
[{"$f":"IF(Prezentace!A28=0,\"\",Prezentace!A28)","v":""},{"$f":"IF(Prezentace!B28=0,\"\",Prezentace!B28)","v":""},{"$f":"Prezentace!D28","v":"R"},{"$f":"IF(Prezentace!F28=0,\"\",Prezentace!F28)","v":"Milan"},{"$f":"IF(Prezentace!E28=0,\"\",Prezentace!E28)","v":"Krupica "},null,null,null,null,null,null,null,null,null,null,null,null,null,null,0]
[{"$f":"IF(Prezentace!A29=0,\"\",Prezentace!A29)","v":""},{"$f":"IF(Prezentace!B29=0,\"\",Prezentace!B29)","v":""},{"$f":"Prezentace!D29","v":"P"},{"$f":"IF(Prezentace!F29=0,\"\",Prezentace!F29)","v":"Miloslav"},{"$f":"IF(Prezentace!E29=0,\"\",Prezentace!E29)","v":"Petržílka"},null,null,null,null,null,null,null,null,null,null,null,null,null,null,0]
[{"$f":"IF(Prezentace!A30=0,\"\",Prezentace!A30)","v":""},{"$f":"IF(Prezentace!B30=0,\"\",Prezentace!B30)","v":""},{"$f":"Prezentace!D30","v":"R"},{"$f":"IF(Prezentace!F30=0,\"\",Prezentace!F30)","v":"Aleš"},{"$f":"IF(Prezentace!E30=0,\"\",Prezentace!E30)","v":"Seitl "},null,null,null,null,null,null,null,null,null,null,null,null,null,null,0]
[{"$f":"IF(Prezentace!A31=0,\"\",Prezentace!A31)","v":""},{"$f":"IF(Prezentace!B31=0,\"\",Prezentace!B31)","v":""},{"$f":"Prezentace!D31","v":"P"},{"$f":"IF(Prezentace!F31=0,\"\",Prezentace!F31)","v":"Aleš"},{"$f":"IF(Prezentace!E31=0,\"\",Prezentace!E31)","v":"Seitl "},null,null,null,null,null,null,null,null,null,null,null,null,null,null,0]
[{"$f":"IF(Prezentace!A32=0,\"\",Prezentace!A32)","v":""},{"$f":"IF(Prezentace!B32=0,\"\",Prezentace!B32)","v":""},{"$f":"Prezentace!D32","v":"P"},{"$f":"IF(Prezentace!F32=0,\"\",Prezentace!F32)","v":"Karel"},{"$f":"IF(Prezentace!E32=0,\"\",Prezentace!E32)","v":"Seitl"},null,null,null,null,null,null,null,null,null,null,null,null,null,null,0]
[{"$f":"IF(Prezentace!A33=0,\"\",Prezentace!A33)","v":""},{"$f":"IF(Prezentace!B33=0,\"\",Prezentace!B33)","v":""},{"$f":"Prezentace!D33","v":"P"},{"$f":"IF(Prezentace!F33=0,\"\",Prezentace!F33)","v":"David"},{"$f":"IF(Prezentace!E33=0,\"\",Prezentace!E33)","v":"Nikodým"},null,null,null,null,null,null,null,null,null,null,null,null,null,null,0]
[{"$f":"IF(Prezentace!A34=0,\"\",Prezentace!A34)","v":""},{"$f":"IF(Prezentace!B34=0,\"\",Prezentace!B34)","v":""},{"$f":"Prezentace!D34","v":"R"},{"$f":"IF(Prezentace!F34=0,\"\",Prezentace!F34)","v":"David"},{"$f":"IF(Prezentace!E34=0,\"\",Prezentace!E34)","v":"Nikodým "},null,null,null,null,null,null,null,null,null,null,null,null,null,null,0]
[{"$f":"IF(Prezentace!A35=0,\"\",Prezentace!A35)","v":""},{"$f":"IF(Prezentace!B35=0,\"\",Prezentace!B35)","v":""},{"$f":"Prezentace!D35","v":"P"},{"$f":"IF(Prezentace!F35=0,\"\",Prezentace!F35)","v":"Lukáš"},{"$f":"IF(Prezentace!E35=0,\"\",Prezentace!E35)","v":"Hobza"},null,null,null,null,null,null,null,null,null,null,null,null,null,null,0]
[{"$f":"IF(Prezentace!A36=0,\"\",Prezentace!A36)","v":""},{"$f":"IF(Prezentace!B36=0,\"\",Prezentace!B36)","v":""},{"$f":"Prezentace!D36","v":"P"},{"$f":"IF(Prezentace!F36=0,\"\",Prezentace!F36)","v":"Antonín"},{"$f":"IF(Prezentace!E36=0,\"\",Prezentace!E36)","v":"Jelínek "},null,null,null,null,null,null,null,null,null,null,null,null,null,null,0]
[{"$f":"IF(Prezentace!A37=0,\"\",Prezentace!A37)","v":""},{"$f":"IF(Prezentace!B37=0,\"\",Prezentace!B37)","v":""},{"$f":"Prezentace!D37","v":"R"},{"$f":"IF(Prezentace!F37=0,\"\",Prezentace!F37)","v":"Antonín"},{"$f":"IF(Prezentace!E37=0,\"\",Prezentace!E37)","v":"Jelínek "},null,null,null,null,null,null,null,null,null,null,null,null,null,null,0]
[{"$f":"IF(Prezentace!A38=0,\"\",Prezentace!A38)","v":""},{"$f":"IF(Prezentace!B38=0,\"\",Prezentace!B38)","v":""},{"$f":"Prezentace!D38","v":"P"},{"$f":"IF(Prezentace!F38=0,\"\",Prezentace!F38)","v":"Ladislav"},{"$f":"IF(Prezentace!E38=0,\"\",Prezentace!E38)","v":"Píša "},null,null,null,null,null,null,null,null,null,null,null,null,null,null,0]
[{"$f":"IF(Prezentace!A39=0,\"\",Prezentace!A39)","v":""},{"$f":"IF(Prezentace!B39=0,\"\",Prezentace!B39)","v":""},{"$f":"Prezentace!D39","v":"P"},{"$f":"IF(Prezentace!F39=0,\"\",Prezentace!F39)","v":"Štefan"},{"$f":"IF(Prezentace!E39=0,\"\",Prezentace!E39)","v":"Mesároš"},null,null,null,null,null,null,null,null,null,null,null,null,null,null,0]
[{"$f":"IF(Prezentace!A40=0,\"\",Prezentace!A40)","v":""},{"$f":"IF(Prezentace!B40=0,\"\",Prezentace!B40)","v":""},{"$f":"Prezentace!D40","v":"P"},{"$f":"IF(Prezentace!F40=0,\"\",Prezentace!F40)","v":"Pavel"},{"$f":"IF(Prezentace!E40=0,\"\",Prezentace!E40)","v":"Červenka"},null,null,null,null,null,null,null,null,null,null,null,null,null,null,{"$f":"(SUM(F38*$F$3,G38*$G$3,H38*$H$3,I38*$I$3,J38*$J$3,K38*$K$3,L38*$L$3,M38*$M$3,N38*$N$3,O38*$O$3,P38*$P$3,Q38*$Q$3,R38*$R$3))-S38","v":0}]
[{"$f":"IF(Prezentace!A41=0,\"\",Prezentace!A41)","v":""},{"$f":"IF(Prezentace!B41=0,\"\",Prezentace!B41)","v":""},{"$f":"Prezentace!D41","v":"R"},{"$f":"IF(Prezentace!F41=0,\"\",Prezentace!F41)","v":"Pavel"},{"$f":"IF(Prezentace!E41=0,\"\",Prezentace!E41)","v":"Červenka "},null,null,null,null,null,null,null,null,null,null,null,null,null,null,0]
[{"$f":"IF(Prezentace!A42=0,\"\",Prezentace!A42)","v":""},{"$f":"IF(Prezentace!B42=0,\"\",Prezentace!B42)","v":""},{"$f":"Prezentace!D42","v":"P"},{"$f":"IF(Prezentace!F42=0,\"\",Prezentace!F42)","v":"Jiří"},{"$f":"IF(Prezentace!E42=0,\"\",Prezentace!E42)","v":"Švihálek "},null,null,null,null,null,null,null,null,null,null,null,null,null,null,0]
[{"$f":"IF(Prezentace!A43=0,\"\",Prezentace!A43)","v":""},{"$f":"IF(Prezentace!B43=0,\"\",Prezentace!B43)","v":""},{"$f":"Prezentace!D43","v":"R"},{"$f":"IF(Prezentace!F43=0,\"\",Prezentace!F43)","v":"Jiří"},{"$f":"IF(Prezentace!E43=0,\"\",Prezentace!E43)","v":"Švihálek "},null,null,null,null,null,null,null,null,null,null,null,null,null,null,0]
[{"$f":"IF(Prezentace!A44=0,\"\",Prezentace!A44)","v":""},{"$f":"IF(Prezentace!B44=0,\"\",Prezentace!B44)","v":""},{"$f":"Prezentace!D44","v":"P"},{"$f":"IF(Prezentace!F44=0,\"\",Prezentace!F44)","v":"František"},{"$f":"IF(Prezentace!E44=0,\"\",Prezentace!E44)","v":"Toman "},null,null,null,null,null,null,null,null,null,null,null,null,null,null,0]
[{"$f":"IF(Prezentace!A45=0,\"\",Prezentace!A45)","v":""},{"$f":"IF(Prezentace!B45=0,\"\",Prezentace!B45)","v":""},{"$f":"Prezentace!D45","v":"P"},{"$f":"IF(Prezentace!F45=0,\"\",Prezentace!F45)","v":"Vladimír"},{"$f":"IF(Prezentace!E45=0,\"\",Prezentace!E45)","v":"VejslíK "},null,null,null,null,null,null,null,null,null,null,null,null,null,null,0]
[{"$f":"IF(Prezentace!A46=0,\"\",Prezentace!A46)","v":""},{"$f":"IF(Prezentace!B46=0,\"\",Prezentace!B46)","v":""},{"$f":"Prezentace!D46","v":"P"},{"$f":"IF(Prezentace!F46=0,\"\",Prezentace!F46)","v":"Karel"},{"$f":"IF(Prezentace!E46=0,\"\",Prezentace!E46)","v":"Získal "},null,null,null,null,null,null,null,null,null,null,null,null,null,null,0]
[{"$f":"IF(Prezentace!A47=0,\"\",Prezentace!A47)","v":""},{"$f":"IF(Prezentace!B47=0,\"\",Prezentace!B47)","v":""},{"$f":"Prezentace!D47","v":"R"},{"$f":"IF(Prezentace!F47=0,\"\",Prezentace!F47)","v":"Karel"},{"$f":"IF(Prezentace!E47=0,\"\",Prezentace!E47)","v":"Získal "},null,null,null,null,null,null,null,null,null,null,null,null,null,null,0]
[{"$f":"IF(Prezentace!A48=0,\"\",Prezentace!A48)","v":""},{"$f":"IF(Prezentace!B48=0,\"\",Prezentace!B48)","v":""},{"$f":"Prezentace!D48","v":"P"},{"$f":"IF(Prezentace!F48=0,\"\",Prezentace!F48)","v":"Jaroslav"},{"$f":"IF(Prezentace!E48=0,\"\",Prezentace!E48)","v":"Sokolík "},null,null,null,null,null,null,null,null,null,null,null,null,null,null,0]
[{"$f":"IF(Prezentace!A49=0,\"\",Prezentace!A49)","v":""},{"$f":"IF(Prezentace!B49=0,\"\",Prezentace!B49)","v":""},{"$f":"Prezentace!D49","v":"P"},{"$f":"IF(Prezentace!F49=0,\"\",Prezentace!F49)","v":"Milan"},{"$f":"IF(Prezentace!E49=0,\"\",Prezentace!E49)","v":"Kraus "},null,null,null,null,null,null,null,null,null,null,null,null,null,null,0]
[{"$f":"IF(Prezentace!A50=0,\"\",Prezentace!A50)","v":""},{"$f":"IF(Prezentace!B50=0,\"\",Prezentace!B50)","v":""},{"$f":"Prezentace!D50","v":"P"},{"$f":"IF(Prezentace!F50=0,\"\",Prezentace!F50)","v":""},{"$f":"IF(Prezentace!E50=0,\"\",Prezentace!E50)","v":""},null,null,null,null,null,null,null,null,null,null,null,null,null,null,0]
[{"$f":"IF(Prezentace!A51=0,\"\",Prezentace!A51)","v":""},{"$f":"IF(Prezentace!B51=0,\"\",Prezentace!B51)","v":""},{"$f":"Prezentace!D51","v":"P"},{"$f":"IF(Prezentace!F51=0,\"\",Prezentace!F51)","v":""},{"$f":"IF(Prezentace!E51=0,\"\",Prezentace!E51)","v":""},null,null,null,null,null,null,null,null,null,null,null,null,null,null,0]
[{"$f":"IF(Prezentace!A52=0,\"\",Prezentace!A52)","v":""},{"$f":"IF(Prezentace!B52=0,\"\",Prezentace!B52)","v":""},{"$f":"Prezentace!D52","v":"P"},{"$f":"IF(Prezentace!F52=0,\"\",Prezentace!F52)","v":""},{"$f":"IF(Prezentace!E52=0,\"\",Prezentace!E52)","v":""},null,null,null,null,null,null,null,null,null,null,null,null,null,null,0]
[{"$f":"IF(Prezentace!A53=0,\"\",Prezentace!A53)","v":""},{"$f":"IF(Prezentace!B53=0,\"\",Prezentace!B53)","v":""},{"$f":"Prezentace!D53","v":"P"},{"$f":"IF(Prezentace!F53=0,\"\",Prezentace!F53)","v":""},{"$f":"IF(Prezentace!E53=0,\"\",Prezentace!E53)","v":""},null,null,null,null,null,null,null,null,null,null,null,null,null,null,0]
[{"$f":"IF(Prezentace!A54=0,\"\",Prezentace!A54)","v":""},{"$f":"IF(Prezentace!B54=0,\"\",Prezentace!B54)","v":""},{"$f":"Prezentace!D54","v":"P"},{"$f":"IF(Prezentace!F54=0,\"\",Prezentace!F54)","v":""},{"$f":"IF(Prezentace!E54=0,\"\",Prezentace!E54)","v":""},null,null,null,null,null,null,null,null,null,null,null,null,null,null,0]
[{"$f":"IF(Prezentace!A55=0,\"\",Prezentace!A55)","v":""},{"$f":"IF(Prezentace!B55=0,\"\",Prezentace!B55)","v":""},{"$f":"Prezentace!D55","v":"P"},{"$f":"IF(Prezentace!F55=0,\"\",Prezentace!F55)","v":""},{"$f":"IF(Prezentace!E55=0,\"\",Prezentace!E55)","v":""},null,null,null,null,null,null,null,null,null,null,null,null,null,null,0]
[{"$f":"IF(Prezentace!A56=0,\"\",Prezentace!A56)","v":""},{"$f":"IF(Prezentace!B56=0,\"\",Prezentace!B56)","v":""},{"$f":"Prezentace!D56","v":"P"},{"$f":"IF(Prezentace!F56=0,\"\",Prezentace!F56)","v":""},{"$f":"IF(Prezentace!E56=0,\"\",Prezentace!E56)","v":""},null,null,null,null,null,null,null,null,null,null,null,null,null,null,0]
[{"$f":"IF(Prezentace!A57=0,\"\",Prezentace!A57)","v":""},{"$f":"IF(Prezentace!B57=0,\"\",Prezentace!B57)","v":""},{"$f":"Prezentace!D57","v":"P"},{"$f":"IF(Prezentace!F57=0,\"\",Prezentace!F57)","v":""},{"$f":"IF(Prezentace!E57=0,\"\",Prezentace!E57)","v":""},null,null,null,null,null,null,null,null,null,null,null,null,null,null,0]
[{"$f":"IF(Prezentace!A58=0,\"\",Prezentace!A58)","v":""},{"$f":"IF(Prezentace!B58=0,\"\",Prezentace!B58)","v":""},{"$f":"Prezentace!D58","v":"P"},{"$f":"IF(Prezentace!F58=0,\"\",Prezentace!F58)","v":""},{"$f":"IF(Prezentace!E58=0,\"\",Prezentace!E58)","v":""},null,null,null,null,null,null,null,null,null,null,null,null,null,null,0]
[{"$f":"IF(Prezentace!A59=0,\"\",Prezentace!A59)","v":""},{"$f":"IF(Prezentace!B59=0,\"\",Prezentace!B59)","v":""},{"$f":"Prezentace!D59","v":"P"},{"$f":"IF(Prezentace!F59=0,\"\",Prezentace!F59)","v":""},{"$f":"IF(Prezentace!E59=0,\"\",Prezentace!E59)","v":""},null,null,null,null,null,null,null,null,null,null,null,null,null,null,0]
[{"$f":"IF(Prezentace!A60=0,\"\",Prezentace!A60)","v":""},{"$f":"IF(Prezentace!B60=0,\"\",Prezentace!B60)","v":""},{"$f":"Prezentace!D60","v":"P"},{"$f":"IF(Prezentace!F60=0,\"\",Prezentace!F60)","v":""},{"$f":"IF(Prezentace!E60=0,\"\",Prezentace!E60)","v":""},null,null,null,null,null,null,null,null,null,null,null,null,null,null,0]
[{"$f":"IF(Prezentace!A61=0,\"\",Prezentace!A61)","v":""},{"$f":"IF(Prezentace!B61=0,\"\",Prezentace!B61)","v":""},{"$f":"Prezentace!D61","v":"P"},{"$f":"IF(Prezentace!F61=0,\"\",Prezentace!F61)","v":""},{"$f":"IF(Prezentace!E61=0,\"\",Prezentace!E61)","v":""},null,null,null,null,null,null,null,null,null,null,null,null,null,null,0]
[{"$f":"IF(Prezentace!A62=0,\"\",Prezentace!A62)","v":""},{"$f":"IF(Prezentace!B62=0,\"\",Prezentace!B62)","v":""},{"$f":"Prezentace!D62","v":"P"},{"$f":"IF(Prezentace!F62=0,\"\",Prezentace!F62)","v":""},{"$f":"IF(Prezentace!E62=0,\"\",Prezentace!E62)","v":""},null,null,null,null,null,null,null,null,null,null,null,null,null,null,0]
[{"$f":"IF(Prezentace!A63=0,\"\",Prezentace!A63)","v":""},{"$f":"IF(Prezentace!B63=0,\"\",Prezentace!B63)","v":""},{"$f":"Prezentace!D63","v":"P"},{"$f":"IF(Prezentace!F63=0,\"\",Prezentace!F63)","v":""},{"$f":"IF(Prezentace!E63=0,\"\",Prezentace!E63)","v":""},null,null,null,null,null,null,null,null,null,null,null,null,null,null,0]
[{"$f":"IF(Prezentace!A64=0,\"\",Prezentace!A64)","v":""},{"$f":"IF(Prezentace!B64=0,\"\",Prezentace!B64)","v":""},{"$f":"Prezentace!D64","v":"P"},{"$f":"IF(Prezentace!F64=0,\"\",Prezentace!F64)","v":""},{"$f":"IF(Prezentace!E64=0,\"\",Prezentace!E64)","v":""},null,null,null,null,null,null,null,null,null,null,null,null,null,null,0]
[{"$f":"IF(Prezentace!A65=0,\"\",Prezentace!A65)","v":""},{"$f":"IF(Prezentace!B65=0,\"\",Prezentace!B65)","v":""},{"$f":"Prezentace!D65","v":"P"},{"$f":"IF(Prezentace!F65=0,\"\",Prezentace!F65)","v":""},{"$f":"IF(Prezentace!E65=0,\"\",Prezentace!E65)","v":""},null,null,null,null,null,null,null,null,null,null,null,null,null,null,0]
[{"$f":"IF(Prezentace!A66=0,\"\",Prezentace!A66)","v":""},{"$f":"IF(Prezentace!B66=0,\"\",Prezentace!B66)","v":""},{"$f":"Prezentace!D66","v":"P"},{"$f":"IF(Prezentace!F66=0,\"\",Prezentace!F66)","v":""},{"$f":"IF(Prezentace!E66=0,\"\",Prezentace!E66)","v":""},null,null,null,null,null,null,null,null,null,null,null,null,null,null,0]
[{"$f":"IF(Prezentace!A67=0,\"\",Prezentace!A67)","v":""},{"$f":"IF(Prezentace!B67=0,\"\",Prezentace!B67)","v":""},{"$f":"Prezentace!D67","v":"P"},{"$f":"IF(Prezentace!F67=0,\"\",Prezentace!F67)","v":""},{"$f":"IF(Prezentace!E67=0,\"\",Prezentace!E67)","v":""},null,null,null,null,null,null,null,null,null,null,null,null,null,null,0]
[{"$f":"IF(Prezentace!A68=0,\"\",Prezentace!A68)","v":""},{"$f":"IF(Prezentace!B68=0,\"\",Prezentace!B68)","v":""},{"$f":"Prezentace!D68","v":"P"},{"$f":"IF(Prezentace!F68=0,\"\",Prezentace!F68)","v":""},{"$f":"IF(Prezentace!E68=0,\"\",Prezentace!E68)","v":""},null,null,null,null,null,null,null,null,null,null,null,null,null,null,0]
[{"$f":"IF(Prezentace!A69=0,\"\",Prezentace!A69)","v":""},{"$f":"IF(Prezentace!B69=0,\"\",Prezentace!B69)","v":""},{"$f":"Prezentace!D69","v":"P"},{"$f":"IF(Prezentace!F69=0,\"\",Prezentace!F69)","v":""},{"$f":"IF(Prezentace!E69=0,\"\",Prezentace!E69)","v":""},null,null,null,null,null,null,null,null,null,null,null,null,null,null,0]
[{"$f":"IF(Prezentace!A70=0,\"\",Prezentace!A70)","v":""},{"$f":"IF(Prezentace!B70=0,\"\",Prezentace!B70)","v":""},{"$f":"Prezentace!D70","v":"P"},{"$f":"IF(Prezentace!F70=0,\"\",Prezentace!F70)","v":""},{"$f":"IF(Prezentace!E70=0,\"\",Prezentace!E70)","v":""},null,null,null,null,null,null,null,null,null,null,null,null,null,null,0]
[{"$f":"IF(Prezentace!A71=0,\"\",Prezentace!A71)","v":""},{"$f":"IF(Prezentace!B71=0,\"\",Prezentace!B71)","v":""},{"$f":"Prezentace!D71","v":"P"},{"$f":"IF(Prezentace!F71=0,\"\",Prezentace!F71)","v":""},{"$f":"IF(Prezentace!E71=0,\"\",Prezentace!E71)","v":""},null,null,null,null,null,null,null,null,null,null,null,null,null,null,0]
[{"$f":"IF(Prezentace!A72=0,\"\",Prezentace!A72)","v":""},{"$f":"IF(Prezentace!B72=0,\"\",Prezentace!B72)","v":""},{"$f":"Prezentace!D72","v":"P"},{"$f":"IF(Prezentace!F72=0,\"\",Prezentace!F72)","v":""},{"$f":"IF(Prezentace!E72=0,\"\",Prezentace!E72)","v":""},null,null,null,null,null,null,null,null,null,null,null,null,null,null,0]
[{"$f":"IF(Prezentace!A73=0,\"\",Prezentace!A73)","v":""},{"$f":"IF(Prezentace!B73=0,\"\",Prezentace!B73)","v":""},{"$f":"Prezentace!D73","v":"P"},{"$f":"IF(Prezentace!F73=0,\"\",Prezentace!F73)","v":""},{"$f":"IF(Prezentace!E73=0,\"\",Prezentace!E73)","v":""},null,null,null,null,null,null,null,null,null,null,null,null,null,null,0]
[{"$f":"IF(Prezentace!A74=0,\"\",Prezentace!A74)","v":""},{"$f":"IF(Prezentace!B74=0,\"\",Prezentace!B74)","v":""},{"$f":"Prezentace!D74","v":"P"},{"$f":"IF(Prezentace!F74=0,\"\",Prezentace!F74)","v":""},{"$f":"IF(Prezentace!E74=0,\"\",Prezentace!E74)","v":""},null,null,null,null,null,null,null,null,null,null,null,null,null,null,0]
[{"$f":"IF(Prezentace!A75=0,\"\",Prezentace!A75)","v":""},{"$f":"IF(Prezentace!B75=0,\"\",Prezentace!B75)","v":""},{"$f":"Prezentace!D75","v":"P"},{"$f":"IF(Prezentace!F75=0,\"\",Prezentace!F75)","v":""},{"$f":"IF(Prezentace!E75=0,\"\",Prezentace!E75)","v":""},null,null,null,null,null,null,null,null,null,null,null,null,null,null,0]
[{"$f":"IF(Prezentace!A76=0,\"\",Prezentace!A76)","v":""},{"$f":"IF(Prezentace!B76=0,\"\",Prezentace!B76)","v":""},{"$f":"Prezentace!D76","v":"P"},{"$f":"IF(Prezentace!F76=0,\"\",Prezentace!F76)","v":""},{"$f":"IF(Prezentace!E76=0,\"\",Prezentace!E76)","v":""},null,null,null,null,null,null,null,null,null,null,null,null,null,null,0]
[{"$f":"IF(Prezentace!A77=0,\"\",Prezentace!A77)","v":""},{"$f":"IF(Prezentace!B77=0,\"\",Prezentace!B77)","v":""},{"$f":"Prezentace!D77","v":"P"},{"$f":"IF(Prezentace!F77=0,\"\",Prezentace!F77)","v":""},{"$f":"IF(Prezentace!E77=0,\"\",Prezentace!E77)","v":""},null,null,null,null,null,null,null,null,null,null,null,null,null,null,0]
[{"$f":"IF(Prezentace!A78=0,\"\",Prezentace!A78)","v":""},{"$f":"IF(Prezentace!B78=0,\"\",Prezentace!B78)","v":""},{"$f":"Prezentace!D78","v":"P"},{"$f":"IF(Prezentace!F78=0,\"\",Prezentace!F78)","v":""},{"$f":"IF(Prezentace!E78=0,\"\",Prezentace!E78)","v":""},null,null,null,null,null,null,null,null,null,null,null,null,null,null,0]
[{"$f":"IF(Prezentace!A79=0,\"\",Prezentace!A79)","v":""},{"$f":"IF(Prezentace!B79=0,\"\",Prezentace!B79)","v":""},{"$f":"Prezentace!D79","v":"P"},{"$f":"IF(Prezentace!F79=0,\"\",Prezentace!F79)","v":""},{"$f":"IF(Prezentace!E79=0,\"\",Prezentace!E79)","v":""},null,null,null,null,null,null,null,null,null,null,null,null,null,null,0]
[{"$f":"IF(Prezentace!A80=0,\"\",Prezentace!A80)","v":""},{"$f":"IF(Prezentace!B80=0,\"\",Prezentace!B80)","v":""},{"$f":"Prezentace!D80","v":"P"},{"$f":"IF(Prezentace!F80=0,\"\",Prezentace!F80)","v":""},{"$f":"IF(Prezentace!E80=0,\"\",Prezentace!E80)","v":""},null,null,null,null,null,null,null,null,null,null,null,null,null,null,0]
[{"$f":"IF(Prezentace!A81=0,\"\",Prezentace!A81)","v":""},{"$f":"IF(Prezentace!B81=0,\"\",Prezentace!B81)","v":""},{"$f":"Prezentace!D81","v":"P"},{"$f":"IF(Prezentace!F81=0,\"\",Prezentace!F81)","v":""},{"$f":"IF(Prezentace!E81=0,\"\",Prezentace!E81)","v":""},null,null,null,null,null,null,null,null,null,null,null,null,null,null,0]
[{"$f":"IF(Prezentace!A82=0,\"\",Prezentace!A82)","v":""},{"$f":"IF(Prezentace!B82=0,\"\",Prezentace!B82)","v":""},{"$f":"Prezentace!D82","v":"P"},{"$f":"IF(Prezentace!F82=0,\"\",Prezentace!F82)","v":""},{"$f":"IF(Prezentace!E82=0,\"\",Prezentace!E82)","v":""},null,null,null,null,null,null,null,null,null,null,null,null,null,null,0]
[{"$f":"IF(Prezentace!A83=0,\"\",Prezentace!A83)","v":""},{"$f":"IF(Prezentace!B83=0,\"\",Prezentace!B83)","v":""},{"$f":"Prezentace!D83","v":"P"},{"$f":"IF(Prezentace!F83=0,\"\",Prezentace!F83)","v":""},{"$f":"IF(Prezentace!E83=0,\"\",Prezentace!E83)","v":""},null,null,null,null,null,null,null,null,null,null,null,null,null,null,0]
[{"$f":"IF(Prezentace!A84=0,\"\",Prezentace!A84)","v":""},{"$f":"IF(Prezentace!B84=0,\"\",Prezentace!B84)","v":""},{"$f":"Prezentace!D84","v":"P"},{"$f":"IF(Prezentace!F84=0,\"\",Prezentace!F84)","v":""},{"$f":"IF(Prezentace!E84=0,\"\",Prezentace!E84)","v":""},null,null,null,null,null,null,null,null,null,null,null,null,null,null,0]
[{"$f":"IF(Prezentace!A85=0,\"\",Prezentace!A85)","v":""},{"$f":"IF(Prezentace!B85=0,\"\",Prezentace!B85)","v":""},{"$f":"Prezentace!D85","v":"P"},{"$f":"IF(Prezentace!F85=0,\"\",Prezentace!F85)","v":""},{"$f":"IF(Prezentace!E85=0,\"\",Prezentace!E85)","v":""},null,null,null,null,null,null,null,null,null,null,null,null,null,null,0]
[{"$f":"IF(Prezentace!A86=0,\"\",Prezentace!A86)","v":""},{"$f":"IF(Prezentace!B86=0,\"\",Prezentace!B86)","v":""},{"$f":"Prezentace!D86","v":"P"},{"$f":"IF(Prezentace!F86=0,\"\",Prezentace!F86)","v":""},{"$f":"IF(Prezentace!E86=0,\"\",Prezentace!E86)","v":""},null,null,null,null,null,null,null,null,null,null,null,null,null,null,0]
[{"$f":"IF(Prezentace!A87=0,\"\",Prezentace!A87)","v":""},{"$f":"IF(Prezentace!B87=0,\"\",Prezentace!B87)","v":""},{"$f":"Prezentace!D87","v":"P"},{"$f":"IF(Prezentace!F87=0,\"\",Prezentace!F87)","v":""},{"$f":"IF(Prezentace!E87=0,\"\",Prezentace!E87)","v":""},null,null,null,null,null,null,null,null,null,null,null,null,null,null,0]
[{"$f":"IF(Prezentace!A88=0,\"\",Prezentace!A88)","v":""},{"$f":"IF(Prezentace!B88=0,\"\",Prezentace!B88)","v":""},{"$f":"Prezentace!D88","v":"P"},{"$f":"IF(Prezentace!F88=0,\"\",Prezentace!F88)","v":""},{"$f":"IF(Prezentace!E88=0,\"\",Prezentace!E88)","v":""},null,null,null,null,null,null,null,null,null,null,null,null,null,null,0]
[{"$f":"IF(Prezentace!A89=0,\"\",Prezentace!A89)","v":""},{"$f":"IF(Prezentace!B89=0,\"\",Prezentace!B89)","v":""},{"$f":"Prezentace!D89","v":"P"},{"$f":"IF(Prezentace!F89=0,\"\",Prezentace!F89)","v":""},{"$f":"IF(Prezentace!E89=0,\"\",Prezentace!E89)","v":""},null,null,null,null,null,null,null,null,null,null,null,null,null,null,0]
[{"$f":"IF(Prezentace!A90=0,\"\",Prezentace!A90)","v":""},{"$f":"IF(Prezentace!B90=0,\"\",Prezentace!B90)","v":""},{"$f":"Prezentace!D90","v":"P"},{"$f":"IF(Prezentace!F90=0,\"\",Prezentace!F90)","v":""},{"$f":"IF(Prezentace!E90=0,\"\",Prezentace!E90)","v":""},null,null,null,null,null,null,null,null,null,null,null,null,null,null,0]
[{"$f":"IF(Prezentace!A91=0,\"\",Prezentace!A91)","v":""},{"$f":"IF(Prezentace!B91=0,\"\",Prezentace!B91)","v":""},{"$f":"Prezentace!D91","v":"P"},{"$f":"IF(Prezentace!F91=0,\"\",Prezentace!F91)","v":""},{"$f":"IF(Prezentace!E91=0,\"\",Prezentace!E91)","v":""},null,null,null,null,null,null,null,null,null,null,null,null,null,null,0]
[{"$f":"IF(Prezentace!A92=0,\"\",Prezentace!A92)","v":""},{"$f":"IF(Prezentace!B92=0,\"\",Prezentace!B92)","v":""},{"$f":"Prezentace!D92","v":"P"},{"$f":"IF(Prezentace!F92=0,\"\",Prezentace!F92)","v":""},{"$f":"IF(Prezentace!E92=0,\"\",Prezentace!E92)","v":""},null,null,null,null,null,null,null,null,null,null,null,null,null,null,0]
[{"$f":"IF(Prezentace!A93=0,\"\",Prezentace!A93)","v":""},{"$f":"IF(Prezentace!B93=0,\"\",Prezentace!B93)","v":""},{"$f":"Prezentace!D93","v":"P"},{"$f":"IF(Prezentace!F93=0,\"\",Prezentace!F93)","v":""},{"$f":"IF(Prezentace!E93=0,\"\",Prezentace!E93)","v":""},null,null,null,null,null,null,null,null,null,null,null,null,null,null,0]
[{"$f":"IF(Prezentace!A94=0,\"\",Prezentace!A94)","v":""},{"$f":"IF(Prezentace!B94=0,\"\",Prezentace!B94)","v":""},{"$f":"Prezentace!D94","v":"P"},{"$f":"IF(Prezentace!F94=0,\"\",Prezentace!F94)","v":""},{"$f":"IF(Prezentace!E94=0,\"\",Prezentace!E94)","v":""},null,null,null,null,null,null,null,null,null,null,null,null,null,null,0]
[{"$f":"IF(Prezentace!A95=0,\"\",Prezentace!A95)","v":""},{"$f":"IF(Prezentace!B95=0,\"\",Prezentace!B95)","v":""},{"$f":"Prezentace!D95","v":"P"},{"$f":"IF(Prezentace!F95=0,\"\",Prezentace!F95)","v":""},{"$f":"IF(Prezentace!E95=0,\"\",Prezentace!E95)","v":""},null,null,null,null,null,null,null,null,null,null,null,null,null,null,0]
[{"$f":"IF(Prezentace!A96=0,\"\",Prezentace!A96)","v":""},{"$f":"IF(Prezentace!B96=0,\"\",Prezentace!B96)","v":""},{"$f":"Prezentace!D96","v":"P"},{"$f":"IF(Prezentace!F96=0,\"\",Prezentace!F96)","v":""},{"$f":"IF(Prezentace!E96=0,\"\",Prezentace!E96)","v":""},null,null,null,null,null,null,null,null,null,null,null,null,null,null,0]
[{"$f":"IF(Prezentace!A97=0,\"\",Prezentace!A97)","v":""},{"$f":"IF(Prezentace!B97=0,\"\",Prezentace!B97)","v":""},{"$f":"Prezentace!D97","v":"P"},{"$f":"IF(Prezentace!F97=0,\"\",Prezentace!F97)","v":""},{"$f":"IF(Prezentace!E97=0,\"\",Prezentace!E97)","v":""},null,null,null,null,null,null,null,null,null,null,null,null,null,null,0]
[{"$f":"IF(Prezentace!A98=0,\"\",Prezentace!A98)","v":""},{"$f":"IF(Prezentace!B98=0,\"\",Prezentace!B98)","v":""},{"$f":"Prezentace!D98","v":"P"},{"$f":"IF(Prezentace!F98=0,\"\",Prezentace!F98)","v":""},{"$f":"IF(Prezentace!E98=0,\"\",Prezentace!E98)","v":""},null,null,null,null,null,null,null,null,null,null,null,null,null,null,0]
[{"$f":"IF(Prezentace!A99=0,\"\",Prezentace!A99)","v":""},{"$f":"IF(Prezentace!B99=0,\"\",Prezentace!B99)","v":""},{"$f":"Prezentace!D99","v":"P"},{"$f":"IF(Prezentace!F99=0,\"\",Prezentace!F99)","v":""},{"$f":"IF(Prezentace!E99=0,\"\",Prezentace!E99)","v":""},null,null,null,null,null,null,null,null,null,null,null,null,null,null,0]
[{"$f":"IF(Prezentace!A100=0,\"\",Prezentace!A100)","v":""},{"$f":"IF(Prezentace!B100=0,\"\",Prezentace!B100)","v":""},{"$f":"Prezentace!D100","v":"P"},{"$f":"IF(Prezentace!F100=0,\"\",Prezentace!F100)","v":""},{"$f":"IF(Prezentace!E100=0,\"\",Prezentace!E100)","v":""},null,null,null,null,null,null,null,null,null,null,null,null,null,null,0]
[{"$f":"IF(Prezentace!A101=0,\"\",Prezentace!A101)","v":""},{"$f":"IF(Prezentace!B101=0,\"\",Prezentace!B101)","v":""},{"$f":"Prezentace!D101","v":"P"},{"$f":"IF(Prezentace!F101=0,\"\",Prezentace!F101)","v":""},{"$f":"IF(Prezentace!E101=0,\"\",Prezentace!E101)","v":""},null,null,null,null,null,null,null,null,null,null,null,null,null,null,0]
[{"$f":"IF(Prezentace!A102=0,\"\",Prezentace!A102)","v":""},{"$f":"IF(Prezentace!B102=0,\"\",Prezentace!B102)","v":""},{"$f":"Prezentace!D102","v":"P"},{"$f":"IF(Prezentace!F102=0,\"\",Prezentace!F102)","v":""},{"$f":"IF(Prezentace!E102=0,\"\",Prezentace!E102)","v":""},null,null,null,null,null,null,null,null,null,null,null,null,null,null,0]
[{"$f":"IF(Prezentace!A103=0,\"\",Prezentace!A103)","v":""},{"$f":"IF(Prezentace!B103=0,\"\",Prezentace!B103)","v":""},{"$f":"Prezentace!D103","v":"P"},{"$f":"IF(Prezentace!F103=0,\"\",Prezentace!F103)","v":""},{"$f":"IF(Prezentace!E103=0,\"\",Prezentace!E103)","v":""},null,null,null,null,null,null,null,null,null,null,null,null,null,null,0]
[{"$f":"IF(Prezentace!A104=0,\"\",Prezentace!A104)","v":""},{"$f":"IF(Prezentace!B104=0,\"\",Prezentace!B104)","v":""},{"$f":"Prezentace!D104","v":"P"},{"$f":"IF(Prezentace!F104=0,\"\",Prezentace!F104)","v":""},{"$f":"IF(Prezentace!E104=0,\"\",Prezentace!E104)","v":""},null,null,null,null,null,null,null,null,null,null,null,null,null,null,{"$f":"(SUM(F102*$F$3,G102*$G$3,H102*$H$3,I102*$I$3,J102*$J$3,K102*$K$3,L102*$L$3,M102*$M$3,N102*$N$3,O102*$O$3,P102*$P$3,Q102*$Q$3,R102*$R$3))-S102","v":0}]

{"sheet":"3","index":7,"n_rows":102,"n_cols":22,"rows_kept":102,"cut":false,"hidden":false,"merged":[[0,3,0,20],[0,0,2,0],[0,1,2,1]]}
["Druž.","Kap.",null,"Disciplina 3"]
[]
[null,null,null,null,null,"K","M",1,2,3,4,5,6,7,8,9,10,11,12,"TB","Čas","Součet"]
[{"$f":"IF(Prezentace!A6=0,\"\",Prezentace!A6)","v":""},{"$f":"IF(Prezentace!B6=0,\"\",Prezentace!B6)","v":""},{"$f":"Prezentace!D6","v":"P"},{"$f":"IF(Prezentace!F6=0,\"\",Prezentace!F6)","v":"Martin"},{"$f":"IF(Prezentace!E6=0,\"\",Prezentace!E6)","v":"Adensam "},250,null,9,8,10,9,11,8,9,8,null,null,null,null,null,52.25,{"$f":"(SUM(F4:T4))-U4","v":269.75}]
[{"$f":"IF(Prezentace!A7=0,\"\",Prezentace!A7)","v":""},{"$f":"IF(Prezentace!B7=0,\"\",Prezentace!B7)","v":""},{"$f":"Prezentace!D7","v":"R"},{"$f":"IF(Prezentace!F7=0,\"\",Prezentace!F7)","v":"Martin"},{"$f":"IF(Prezentace!E7=0,\"\",Prezentace!E7)","v":"Adensam"},240,null,10,9,10,9,8,0,9,8,null,null,null,null,null,99.12,{"$f":"(SUM(F5:T5))-U5","v":203.88}]
[{"$f":"IF(Prezentace!A8=0,\"\",Prezentace!A8)","v":""},{"$f":"IF(Prezentace!B8=0,\"\",Prezentace!B8)","v":""},{"$f":"Prezentace!D8","v":"P"},{"$f":"IF(Prezentace!F8=0,\"\",Prezentace!F8)","v":"Jaroslav"},{"$f":"IF(Prezentace!E8=0,\"\",Prezentace!E8)","v":"Kostříž "},240,null,8,0,10,9,10,8,9,8,null,null,null,null,null,90.28,211.72]
[{"$f":"IF(Prezentace!A9=0,\"\",Prezentace!A9)","v":""},{"$f":"IF(Prezentace!B9=0,\"\",Prezentace!B9)","v":""},{"$f":"Prezentace!D9","v":"P"},{"$f":"IF(Prezentace!F9=0,\"\",Prezentace!F9)","v":"Miroslav"},{"$f":"IF(Prezentace!E9=0,\"\",Prezentace!E9)","v":"Koch   ml."},250,null,9,8,9,9,9,9,7,7,null,null,null,null,null,69.12,247.88]
[{"$f":"IF(Prezentace!A10=0,\"\",Prezentace!A10)","v":""},{"$f":"IF(Prezentace!B10=0,\"\",Prezentace!B10)","v":""},{"$f":"Prezentace!D10","v":"P"},{"$f":"IF(Prezentace!F10=0,\"\",Prezentace!F10)","v":"Miroslav"},{"$f":"IF(Prezentace!E10=0,\"\",Prezentace!E10)","v":"Koch  st. "},250,null,8,7,10,10,10,10,10,9,null,null,null,null,null,79.94,244.06]
[{"$f":"IF(Prezentace!A11=0,\"\",Prezentace!A11)","v":""},{"$f":"IF(Prezentace!B11=0,\"\",Prezentace!B11)","v":""},{"$f":"Prezentace!D11","v":"P"},{"$f":"IF(Prezentace!F11=0,\"\",Prezentace!F11)","v":"Bohumil"},{"$f":"IF(Prezentace!E11=0,\"\",Prezentace!E11)","v":"Herceg"},250,null,9,8,9,8,10,0,7,7,null,null,null,null,null,84.69,223.31]
[{"$f":"IF(Prezentace!A12=0,\"\",Prezentace!A12)","v":""},{"$f":"IF(Prezentace!B12=0,\"\",Prezentace!B12)","v":""},{"$f":"Prezentace!D12","v":"P"},{"$f":"IF(Prezentace!F12=0,\"\",Prezentace!F12)","v":"Viktor"},{"$f":"IF(Prezentace!E12=0,\"\",Prezentace!E12)","v":"Fuksa  "},250,null,10,9,10,10,9,9,9,8,null,null,null,null,null,70.06,253.94]
[{"$f":"IF(Prezentace!A13=0,\"\",Prezentace!A13)","v":""},{"$f":"IF(Prezentace!B13=0,\"\",Prezentace!B13)","v":""},{"$f":"Prezentace!D13","v":"P"},{"$f":"IF(Prezentace!F13=0,\"\",Prezentace!F13)","v":"Milan"},{"$f":"IF(Prezentace!E13=0,\"\",Prezentace!E13)","v":"Matějka  ml."},250,null,7,7,8,0,9,9,7,8,null,null,null,null,null,79.13,225.87]
[{"$f":"IF(Prezentace!A14=0,\"\",Prezentace!A14)","v":""},{"$f":"IF(Prezentace!B14=0,\"\",Prezentace!B14)","v":""},{"$f":"Prezentace!D14","v":"P"},{"$f":"IF(Prezentace!F14=0,\"\",Prezentace!F14)","v":"Michal"},{"$f":"IF(Prezentace!E14=0,\"\",Prezentace!E14)","v":"Svoboda"},250,null,9,9,8,8,11,9,10,9,null,null,null,null,null,58.6,264.39999999999998]
[{"$f":"IF(Prezentace!A15=0,\"\",Prezentace!A15)","v":""},{"$f":"IF(Prezentace!B15=0,\"\",Prezentace!B15)","v":""},{"$f":"Prezentace!D15","v":"R"},{"$f":"IF(Prezentace!F15=0,\"\",Prezentace!F15)","v":"Lukáš"},{"$f":"IF(Prezentace!E15=0,\"\",Prezentace!E15)","v":"Bouda "},250,null,7,6,10,9,10,9,9,7,null,null,null,null,null,70.7,246.3]
[{"$f":"IF(Prezentace!A16=0,\"\",Prezentace!A16)","v":""},{"$f":"IF(Prezentace!B16=0,\"\",Prezentace!B16)","v":""},{"$f":"Prezentace!D16","v":"P"},{"$f":"IF(Prezentace!F16=0,\"\",Prezentace!F16)","v":"Lukáš"},{"$f":"IF(Prezentace!E16=0,\"\",Prezentace!E16)","v":"Bouda "},250,null,9,8,11,10,11,10,10,10,null,null,null,null,null,46.22,282.77999999999997]
[{"$f":"IF(Prezentace!A17=0,\"\",Prezentace!A17)","v":""},{"$f":"IF(Prezentace!B17=0,\"\",Prezentace!B17)","v":""},{"$f":"Prezentace!D17","v":"P"},{"$f":"IF(Prezentace!F17=0,\"\",Prezentace!F17)","v":"Pavel"},{"$f":"IF(Prezentace!E17=0,\"\",Prezentace!E17)","v":"Koltai"},250,null,9,0,10,9,11,9,10,9,null,null,null,null,null,50.59,266.40999999999997]
[{"$f":"IF(Prezentace!A18=0,\"\",Prezentace!A18)","v":""},{"$f":"IF(Prezentace!B18=0,\"\",Prezentace!B18)","v":""},{"$f":"Prezentace!D18","v":"P"},{"$f":"IF(Prezentace!F18=0,\"\",Prezentace!F18)","v":"Vladislav"},{"$f":"IF(Prezentace!E18=0,\"\",Prezentace!E18)","v":"Přibyl"},250,null,0,0,8,0,10,0,5,7,null,null,null,null,null,119.5,160.5]
[{"$f":"IF(Prezentace!A19=0,\"\",Prezentace!A19)","v":""},{"$f":"IF(Prezentace!B19=0,\"\",Prezentace!B19)","v":""},{"$f":"Prezentace!D19","v":"P"},{"$f":"IF(Prezentace!F19=0,\"\",Prezentace!F19)","v":"Milan"},{"$f":"IF(Prezentace!E19=0,\"\",Prezentace!E19)","v":"Matějka st."},250,null,6,0,8,0,9,10,9,8,null,null,null,null,null,183.4,116.6]
[{"$f":"IF(Prezentace!A20=0,\"\",Prezentace!A20)","v":""},{"$f":"IF(Prezentace!B20=0,\"\",Prezentace!B20)","v":""},{"$f":"Prezentace!D20","v":"P"},{"$f":"IF(Prezentace!F20=0,\"\",Prezentace!F20)","v":"Miroslav"},{"$f":"IF(Prezentace!E20=0,\"\",Prezentace!E20)","v":"Fiala  "},250,null,9,9,10,10,11,10,9,8,null,null,null,null,null,73.25,252.75]
[{"$f":"IF(Prezentace!A21=0,\"\",Prezentace!A21)","v":""},{"$f":"IF(Prezentace!B21=0,\"\",Prezentace!B21)","v":""},{"$f":"Prezentace!D21","v":"P"},{"$f":"IF(Prezentace!F21=0,\"\",Prezentace!F21)","v":"Karel"},{"$f":"IF(Prezentace!E21=0,\"\",Prezentace!E21)","v":"Gažák "},250,null,9,9,11,10,9,8,9,6,null,null,null,null,null,69.150000000000006,251.85]
[{"$f":"IF(Prezentace!A22=0,\"\",Prezentace!A22)","v":""},{"$f":"IF(Prezentace!B22=0,\"\",Prezentace!B22)","v":""},{"$f":"Prezentace!D22","v":"P"},{"$f":"IF(Prezentace!F22=0,\"\",Prezentace!F22)","v":"Václav"},{"$f":"IF(Prezentace!E22=0,\"\",Prezentace!E22)","v":"Landkammer"},250,null,10,0,9,11,9,0,10,6,null,null,null,null,null,71.959999999999994,233.04000000000002]
[{"$f":"IF(Prezentace!A23=0,\"\",Prezentace!A23)","v":""},{"$f":"IF(Prezentace!B23=0,\"\",Prezentace!B23)","v":""},{"$f":"Prezentace!D23","v":"P"},{"$f":"IF(Prezentace!F23=0,\"\",Prezentace!F23)","v":"Vojtěch"},{"$f":"IF(Prezentace!E23=0,\"\",Prezentace!E23)","v":"Brejžek "},250,null,10,8,11,9,9,9,8,7,null,null,null,null,null,73.37,247.63]
[{"$f":"IF(Prezentace!A24=0,\"\",Prezentace!A24)","v":""},{"$f":"IF(Prezentace!B24=0,\"\",Prezentace!B24)","v":""},{"$f":"Prezentace!D24","v":"P"},{"$f":"IF(Prezentace!F24=0,\"\",Prezentace!F24)","v":"Antonín"},{"$f":"IF(Prezentace!E24=0,\"\",Prezentace!E24)","v":"Urbanec  "},220,null,10,0,0,0,0,0,7,0,null,null,null,null,null,157.69999999999999,79.300000000000011]
[{"$f":"IF(Prezentace!A25=0,\"\",Prezentace!A25)","v":""},{"$f":"IF(Prezentace!B25=0,\"\",Prezentace!B25)","v":""},{"$f":"Prezentace!D25","v":"P"},{"$f":"IF(Prezentace!F25=0,\"\",Prezentace!F25)","v":"Milan"},{"$f":"IF(Prezentace!E25=0,\"\",Prezentace!E25)","v":"Jílek  "},250,null,10,0,10,10,10,10,9,8,null,null,null,null,null,113.7,203.3]
[{"$f":"IF(Prezentace!A26=0,\"\",Prezentace!A26)","v":""},{"$f":"IF(Prezentace!B26=0,\"\",Prezentace!B26)","v":""},{"$f":"Prezentace!D26","v":"P"},{"$f":"IF(Prezentace!F26=0,\"\",Prezentace!F26)","v":"Václav"},{"$f":"IF(Prezentace!E26=0,\"\",Prezentace!E26)","v":"Jírů"},250,null,9,8,10,9,9,9,9,8,null,null,null,null,null,66.86,254.14]
[{"$f":"IF(Prezentace!A27=0,\"\",Prezentace!A27)","v":""},{"$f":"IF(Prezentace!B27=0,\"\",Prezentace!B27)","v":""},{"$f":"Prezentace!D27","v":"P"},{"$f":"IF(Prezentace!F27=0,\"\",Prezentace!F27)","v":"Milan"},{"$f":"IF(Prezentace!E27=0,\"\",Prezentace!E27)","v":"Krupica"},250,null,8,7,11,9,10,8,10,9,null,null,null,null,null,69.069999999999993,252.93]
[{"$f":"IF(Prezentace!A28=0,\"\",Prezentace!A28)","v":""},{"$f":"IF(Prezentace!B28=0,\"\",Prezentace!B28)","v":""},{"$f":"Prezentace!D28","v":"R"},{"$f":"IF(Prezentace!F28=0,\"\",Prezentace!F28)","v":"Milan"},{"$f":"IF(Prezentace!E28=0,\"\",Prezentace!E28)","v":"Krupica "},250,null,7,7,9,10,10,9,10,9,null,null,null,null,null,125.3,195.7]
[{"$f":"IF(Prezentace!A29=0,\"\",Prezentace!A29)","v":""},{"$f":"IF(Prezentace!B29=0,\"\",Prezentace!B29)","v":""},{"$f":"Prezentace!D29","v":"P"},{"$f":"IF(Prezentace!F29=0,\"\",Prezentace!F29)","v":"Miloslav"},{"$f":"IF(Prezentace!E29=0,\"\",Prezentace!E29)","v":"Petržílka"},250,null,9,6,10,10,10,10,8,8,null,null,null,null,null,59.51,261.49]
[{"$f":"IF(Prezentace!A30=0,\"\",Prezentace!A30)","v":""},{"$f":"IF(Prezentace!B30=0,\"\",Prezentace!B30)","v":""},{"$f":"Prezentace!D30","v":"R"},{"$f":"IF(Prezentace!F30=0,\"\",Prezentace!F30)","v":"Aleš"},{"$f":"IF(Prezentace!E30=0,\"\",Prezentace!E30)","v":"Seitl "},250,null,9,6,11,10,10,0,10,9,null,null,null,null,null,79.62,235.38]
[{"$f":"IF(Prezentace!A31=0,\"\",Prezentace!A31)","v":""},{"$f":"IF(Prezentace!B31=0,\"\",Prezentace!B31)","v":""},{"$f":"Prezentace!D31","v":"P"},{"$f":"IF(Prezentace!F31=0,\"\",Prezentace!F31)","v":"Aleš"},{"$f":"IF(Prezentace!E31=0,\"\",Prezentace!E31)","v":"Seitl "},250,null,7,7,10,9,11,9,9,8,null,null,null,null,null,124.7,195.3]
[{"$f":"IF(Prezentace!A32=0,\"\",Prezentace!A32)","v":""},{"$f":"IF(Prezentace!B32=0,\"\",Prezentace!B32)","v":""},{"$f":"Prezentace!D32","v":"P"},{"$f":"IF(Prezentace!F32=0,\"\",Prezentace!F32)","v":"Karel"},{"$f":"IF(Prezentace!E32=0,\"\",Prezentace!E32)","v":"Seitl"},250,null,7,7,10,9,9,8,9,6,null,null,null,null,null,74.849999999999994,240.15]
[{"$f":"IF(Prezentace!A33=0,\"\",Prezentace!A33)","v":""},{"$f":"IF(Prezentace!B33=0,\"\",Prezentace!B33)","v":""},{"$f":"Prezentace!D33","v":"P"},{"$f":"IF(Prezentace!F33=0,\"\",Prezentace!F33)","v":"David"},{"$f":"IF(Prezentace!E33=0,\"\",Prezentace!E33)","v":"Nikodým"},250,null,9,8,10,9,11,9,10,7,null,null,null,null,null,73.680000000000007,249.32]
[{"$f":"IF(Prezentace!A34=0,\"\",Prezentace!A34)","v":""},{"$f":"IF(Prezentace!B34=0,\"\",Prezentace!B34)","v":""},{"$f":"Prezentace!D34","v":"R"},{"$f":"IF(Prezentace!F34=0,\"\",Prezentace!F34)","v":"David"},{"$f":"IF(Prezentace!E34=0,\"\",Prezentace!E34)","v":"Nikodým "},250,null,9,6,11,10,11,9,9,8,null,null,null,null,null,69.510000000000005,253.49]
[{"$f":"IF(Prezentace!A35=0,\"\",Prezentace!A35)","v":""},{"$f":"IF(Prezentace!B35=0,\"\",Prezentace!B35)","v":""},{"$f":"Prezentace!D35","v":"P"},{"$f":"IF(Prezentace!F35=0,\"\",Prezentace!F35)","v":"Lukáš"},{"$f":"IF(Prezentace!E35=0,\"\",Prezentace!E35)","v":"Hobza"},250,null,9,7,10,9,0,0,10,9,null,null,null,null,null,45.66,258.34000000000003]
[{"$f":"IF(Prezentace!A36=0,\"\",Prezentace!A36)","v":""},{"$f":"IF(Prezentace!B36=0,\"\",Prezentace!B36)","v":""},{"$f":"Prezentace!D36","v":"P"},{"$f":"IF(Prezentace!F36=0,\"\",Prezentace!F36)","v":"Antonín"},{"$f":"IF(Prezentace!E36=0,\"\",Prezentace!E36)","v":"Jelínek "},250,null,8,6,11,11,9,0,9,0,null,null,null,null,null,72.260000000000005,231.74]
[{"$f":"IF(Prezentace!A37=0,\"\",Prezentace!A37)","v":""},{"$f":"IF(Prezentace!B37=0,\"\",Prezentace!B37)","v":""},{"$f":"Prezentace!D37","v":"R"},{"$f":"IF(Prezentace!F37=0,\"\",Prezentace!F37)","v":"Antonín"},{"$f":"IF(Prezentace!E37=0,\"\",Prezentace!E37)","v":"Jelínek "},240,null,9,8,9,8,10,10,10,9,null,null,null,null,null,66.44,246.56]
[{"$f":"IF(Prezentace!A38=0,\"\",Prezentace!A38)","v":""},{"$f":"IF(Prezentace!B38=0,\"\",Prezentace!B38)","v":""},{"$f":"Prezentace!D38","v":"P"},{"$f":"IF(Prezentace!F38=0,\"\",Prezentace!F38)","v":"Ladislav"},{"$f":"IF(Prezentace!E38=0,\"\",Prezentace!E38)","v":"Píša "},250,null,7,7,11,10,11,11,10,10,null,null,null,null,null,85.53,241.47]
[{"$f":"IF(Prezentace!A39=0,\"\",Prezentace!A39)","v":""},{"$f":"IF(Prezentace!B39=0,\"\",Prezentace!B39)","v":""},{"$f":"Prezentace!D39","v":"P"},{"$f":"IF(Prezentace!F39=0,\"\",Prezentace!F39)","v":"Štefan"},{"$f":"IF(Prezentace!E39=0,\"\",Prezentace!E39)","v":"Mesároš"},250,null,9,9,9,10,10,9,10,9,null,null,null,null,null,43.3,281.7]
[{"$f":"IF(Prezentace!A40=0,\"\",Prezentace!A40)","v":""},{"$f":"IF(Prezentace!B40=0,\"\",Prezentace!B40)","v":""},{"$f":"Prezentace!D40","v":"P"},{"$f":"IF(Prezentace!F40=0,\"\",Prezentace!F40)","v":"Pavel"},{"$f":"IF(Prezentace!E40=0,\"\",Prezentace!E40)","v":"Červenka"},250,null,10,9,10,9,9,9,9,7,null,null,null,null,null,53.77,{"$f":"(SUM(F38:T38))-U38","v":268.23}]
[{"$f":"IF(Prezentace!A41=0,\"\",Prezentace!A41)","v":""},{"$f":"IF(Prezentace!B41=0,\"\",Prezentace!B41)","v":""},{"$f":"Prezentace!D41","v":"R"},{"$f":"IF(Prezentace!F41=0,\"\",Prezentace!F41)","v":"Pavel"},{"$f":"IF(Prezentace!E41=0,\"\",Prezentace!E41)","v":"Červenka "},250,null,10,10,10,10,10,10,10,9,null,null,null,null,null,65.709999999999994,263.29000000000002]
[{"$f":"IF(Prezentace!A42=0,\"\",Prezentace!A42)","v":""},{"$f":"IF(Prezentace!B42=0,\"\",Prezentace!B42)","v":""},{"$f":"Prezentace!D42","v":"P"},{"$f":"IF(Prezentace!F42=0,\"\",Prezentace!F42)","v":"Jiří"},{"$f":"IF(Prezentace!E42=0,\"\",Prezentace!E42)","v":"Švihálek "},250,null,9,8,10,8,10,10,9,9,null,null,null,null,null,72.39,250.61]
[{"$f":"IF(Prezentace!A43=0,\"\",Prezentace!A43)","v":""},{"$f":"IF(Prezentace!B43=0,\"\",Prezentace!B43)","v":""},{"$f":"Prezentace!D43","v":"R"},{"$f":"IF(Prezentace!F43=0,\"\",Prezentace!F43)","v":"Jiří"},{"$f":"IF(Prezentace!E43=0,\"\",Prezentace!E43)","v":"Švihálek "},250,null,9,8,11,11,10,9,10,9,null,null,null,null,null,77.69,249.31]
[{"$f":"IF(Prezentace!A44=0,\"\",Prezentace!A44)","v":""},{"$f":"IF(Prezentace!B44=0,\"\",Prezentace!B44)","v":""},{"$f":"Prezentace!D44","v":"P"},{"$f":"IF(Prezentace!F44=0,\"\",Prezentace!F44)","v":"František"},{"$f":"IF(Prezentace!E44=0,\"\",Prezentace!E44)","v":"Toman "},250,null,9,7,8,0,10,9,8,8,null,null,null,null,null,68.92,240.07999999999998]
[{"$f":"IF(Prezentace!A45=0,\"\",Prezentace!A45)","v":""},{"$f":"IF(Prezentace!B45=0,\"\",Prezentace!B45)","v":""},{"$f":"Prezentace!D45","v":"P"},{"$f":"IF(Prezentace!F45=0,\"\",Prezentace!F45)","v":"Vladimír"},{"$f":"IF(Prezentace!E45=0,\"\",Prezentace!E45)","v":"VejslíK "},250,null,9,8,10,10,10,9,9,9,null,null,null,null,null,53.04,270.95999999999998]
[{"$f":"IF(Prezentace!A46=0,\"\",Prezentace!A46)","v":""},{"$f":"IF(Prezentace!B46=0,\"\",Prezentace!B46)","v":""},{"$f":"Prezentace!D46","v":"P"},{"$f":"IF(Prezentace!F46=0,\"\",Prezentace!F46)","v":"Karel"},{"$f":"IF(Prezentace!E46=0,\"\",Prezentace!E46)","v":"Získal "},250,null,10,0,10,10,10,9,10,8,null,null,null,null,null,65.61,251.39]
[{"$f":"IF(Prezentace!A47=0,\"\",Prezentace!A47)","v":""},{"$f":"IF(Prezentace!B47=0,\"\",Prezentace!B47)","v":""},{"$f":"Prezentace!D47","v":"R"},{"$f":"IF(Prezentace!F47=0,\"\",Prezentace!F47)","v":"Karel"},{"$f":"IF(Prezentace!E47=0,\"\",Prezentace!E47)","v":"Získal "},250,null,8,8,10,0,10,9,9,0,null,null,null,null,null,148.4,155.6]
[{"$f":"IF(Prezentace!A48=0,\"\",Prezentace!A48)","v":""},{"$f":"IF(Prezentace!B48=0,\"\",Prezentace!B48)","v":""},{"$f":"Prezentace!D48","v":"P"},{"$f":"IF(Prezentace!F48=0,\"\",Prezentace!F48)","v":"Jaroslav"},{"$f":"IF(Prezentace!E48=0,\"\",Prezentace!E48)","v":"Sokolík "},250,null,8,9,10,9,10,9,10,9,null,null,null,null,null,34.380000000000003,289.62]
[{"$f":"IF(Prezentace!A49=0,\"\",Prezentace!A49)","v":""},{"$f":"IF(Prezentace!B49=0,\"\",Prezentace!B49)","v":""},{"$f":"Prezentace!D49","v":"P"},{"$f":"IF(Prezentace!F49=0,\"\",Prezentace!F49)","v":"Milan"},{"$f":"IF(Prezentace!E49=0,\"\",Prezentace!E49)","v":"Kraus "},250,null,9,8,11,9,9,8,10,9,null,null,null,null,null,61.86,261.14]
[{"$f":"IF(Prezentace!A50=0,\"\",Prezentace!A50)","v":""},{"$f":"IF(Prezentace!B50=0,\"\",Prezentace!B50)","v":""},{"$f":"Prezentace!D50","v":"P"},{"$f":"IF(Prezentace!F50=0,\"\",Prezentace!F50)","v":""},{"$f":"IF(Prezentace!E50=0,\"\",Prezentace!E50)","v":""},null,null,null,null,null,null,null,null,null,null,null,null,null,null,null,null,0]
[{"$f":"IF(Prezentace!A51=0,\"\",Prezentace!A51)","v":""},{"$f":"IF(Prezentace!B51=0,\"\",Prezentace!B51)","v":""},{"$f":"Prezentace!D51","v":"P"},{"$f":"IF(Prezentace!F51=0,\"\",Prezentace!F51)","v":""},{"$f":"IF(Prezentace!E51=0,\"\",Prezentace!E51)","v":""},null,null,null,null,null,null,null,null,null,null,null,null,null,null,null,null,0]
[{"$f":"IF(Prezentace!A52=0,\"\",Prezentace!A52)","v":""},{"$f":"IF(Prezentace!B52=0,\"\",Prezentace!B52)","v":""},{"$f":"Prezentace!D52","v":"P"},{"$f":"IF(Prezentace!F52=0,\"\",Prezentace!F52)","v":""},{"$f":"IF(Prezentace!E52=0,\"\",Prezentace!E52)","v":""},null,null,null,null,null,null,null,null,null,null,null,null,null,null,null,null,0]
[{"$f":"IF(Prezentace!A53=0,\"\",Prezentace!A53)","v":""},{"$f":"IF(Prezentace!B53=0,\"\",Prezentace!B53)","v":""},{"$f":"Prezentace!D53","v":"P"},{"$f":"IF(Prezentace!F53=0,\"\",Prezentace!F53)","v":""},{"$f":"IF(Prezentace!E53=0,\"\",Prezentace!E53)","v":""},null,null,null,null,null,null,null,null,null,null,null,null,null,null,null,null,0]
[{"$f":"IF(Prezentace!A54=0,\"\",Prezentace!A54)","v":""},{"$f":"IF(Prezentace!B54=0,\"\",Prezentace!B54)","v":""},{"$f":"Prezentace!D54","v":"P"},{"$f":"IF(Prezentace!F54=0,\"\",Prezentace!F54)","v":""},{"$f":"IF(Prezentace!E54=0,\"\",Prezentace!E54)","v":""},null,null,null,null,null,null,null,null,null,null,null,null,null,null,null,null,0]
[{"$f":"IF(Prezentace!A55=0,\"\",Prezentace!A55)","v":""},{"$f":"IF(Prezentace!B55=0,\"\",Prezentace!B55)","v":""},{"$f":"Prezentace!D55","v":"P"},{"$f":"IF(Prezentace!F55=0,\"\",Prezentace!F55)","v":""},{"$f":"IF(Prezentace!E55=0,\"\",Prezentace!E55)","v":""},null,null,null,null,null,null,null,null,null,null,null,null,null,null,null,null,0]
[{"$f":"IF(Prezentace!A56=0,\"\",Prezentace!A56)","v":""},{"$f":"IF(Prezentace!B56=0,\"\",Prezentace!B56)","v":""},{"$f":"Prezentace!D56","v":"P"},{"$f":"IF(Prezentace!F56=0,\"\",Prezentace!F56)","v":""},{"$f":"IF(Prezentace!E56=0,\"\",Prezentace!E56)","v":""},null,null,null,null,null,null,null,null,null,null,null,null,null,null,null,null,0]
[{"$f":"IF(Prezentace!A57=0,\"\",Prezentace!A57)","v":""},{"$f":"IF(Prezentace!B57=0,\"\",Prezentace!B57)","v":""},{"$f":"Prezentace!D57","v":"P"},{"$f":"IF(Prezentace!F57=0,\"\",Prezentace!F57)","v":""},{"$f":"IF(Prezentace!E57=0,\"\",Prezentace!E57)","v":""},null,null,null,null,null,null,null,null,null,null,null,null,null,null,null,null,0]
[{"$f":"IF(Prezentace!A58=0,\"\",Prezentace!A58)","v":""},{"$f":"IF(Prezentace!B58=0,\"\",Prezentace!B58)","v":""},{"$f":"Prezentace!D58","v":"P"},{"$f":"IF(Prezentace!F58=0,\"\",Prezentace!F58)","v":""},{"$f":"IF(Prezentace!E58=0,\"\",Prezentace!E58)","v":""},null,null,null,null,null,null,null,null,null,null,null,null,null,null,null,null,0]
[{"$f":"IF(Prezentace!A59=0,\"\",Prezentace!A59)","v":""},{"$f":"IF(Prezentace!B59=0,\"\",Prezentace!B59)","v":""},{"$f":"Prezentace!D59","v":"P"},{"$f":"IF(Prezentace!F59=0,\"\",Prezentace!F59)","v":""},{"$f":"IF(Prezentace!E59=0,\"\",Prezentace!E59)","v":""},null,null,null,null,null,null,null,null,null,null,null,null,null,null,null,null,0]
[{"$f":"IF(Prezentace!A60=0,\"\",Prezentace!A60)","v":""},{"$f":"IF(Prezentace!B60=0,\"\",Prezentace!B60)","v":""},{"$f":"Prezentace!D60","v":"P"},{"$f":"IF(Prezentace!F60=0,\"\",Prezentace!F60)","v":""},{"$f":"IF(Prezentace!E60=0,\"\",Prezentace!E60)","v":""},null,null,null,null,null,null,null,null,null,null,null,null,null,null,null,null,0]
[{"$f":"IF(Prezentace!A61=0,\"\",Prezentace!A61)","v":""},{"$f":"IF(Prezentace!B61=0,\"\",Prezentace!B61)","v":""},{"$f":"Prezentace!D61","v":"P"},{"$f":"IF(Prezentace!F61=0,\"\",Prezentace!F61)","v":""},{"$f":"IF(Prezentace!E61=0,\"\",Prezentace!E61)","v":""},null,null,null,null,null,null,null,null,null,null,null,null,null,null,null,null,0]
[{"$f":"IF(Prezentace!A62=0,\"\",Prezentace!A62)","v":""},{"$f":"IF(Prezentace!B62=0,\"\",Prezentace!B62)","v":""},{"$f":"Prezentace!D62","v":"P"},{"$f":"IF(Prezentace!F62=0,\"\",Prezentace!F62)","v":""},{"$f":"IF(Prezentace!E62=0,\"\",Prezentace!E62)","v":""},null,null,null,null,null,null,null,null,null,null,null,null,null,null,null,null,0]
[{"$f":"IF(Prezentace!A63=0,\"\",Prezentace!A63)","v":""},{"$f":"IF(Prezentace!B63=0,\"\",Prezentace!B63)","v":""},{"$f":"Prezentace!D63","v":"P"},{"$f":"IF(Prezentace!F63=0,\"\",Prezentace!F63)","v":""},{"$f":"IF(Prezentace!E63=0,\"\",Prezentace!E63)","v":""},null,null,null,null,null,null,null,null,null,null,null,null,null,null,null,null,0]
[{"$f":"IF(Prezentace!A64=0,\"\",Prezentace!A64)","v":""},{"$f":"IF(Prezentace!B64=0,\"\",Prezentace!B64)","v":""},{"$f":"Prezentace!D64","v":"P"},{"$f":"IF(Prezentace!F64=0,\"\",Prezentace!F64)","v":""},{"$f":"IF(Prezentace!E64=0,\"\",Prezentace!E64)","v":""},null,null,null,null,null,null,null,null,null,null,null,null,null,null,null,null,0]
[{"$f":"IF(Prezentace!A65=0,\"\",Prezentace!A65)","v":""},{"$f":"IF(Prezentace!B65=0,\"\",Prezentace!B65)","v":""},{"$f":"Prezentace!D65","v":"P"},{"$f":"IF(Prezentace!F65=0,\"\",Prezentace!F65)","v":""},{"$f":"IF(Prezentace!E65=0,\"\",Prezentace!E65)","v":""},null,null,null,null,null,null,null,null,null,null,null,null,null,null,null,null,0]
[{"$f":"IF(Prezentace!A66=0,\"\",Prezentace!A66)","v":""},{"$f":"IF(Prezentace!B66=0,\"\",Prezentace!B66)","v":""},{"$f":"Prezentace!D66","v":"P"},{"$f":"IF(Prezentace!F66=0,\"\",Prezentace!F66)","v":""},{"$f":"IF(Prezentace!E66=0,\"\",Prezentace!E66)","v":""},null,null,null,null,null,null,null,null,null,null,null,null,null,null,null,null,0]
[{"$f":"IF(Prezentace!A67=0,\"\",Prezentace!A67)","v":""},{"$f":"IF(Prezentace!B67=0,\"\",Prezentace!B67)","v":""},{"$f":"Prezentace!D67","v":"P"},{"$f":"IF(Prezentace!F67=0,\"\",Prezentace!F67)","v":""},{"$f":"IF(Prezentace!E67=0,\"\",Prezentace!E67)","v":""},null,null,null,null,null,null,null,null,null,null,null,null,null,null,null,null,0]
[{"$f":"IF(Prezentace!A68=0,\"\",Prezentace!A68)","v":""},{"$f":"IF(Prezentace!B68=0,\"\",Prezentace!B68)","v":""},{"$f":"Prezentace!D68","v":"P"},{"$f":"IF(Prezentace!F68=0,\"\",Prezentace!F68)","v":""},{"$f":"IF(Prezentace!E68=0,\"\",Prezentace!E68)","v":""},null,null,null,null,null,null,null,null,null,null,null,null,null,null,null,null,0]
[{"$f":"IF(Prezentace!A69=0,\"\",Prezentace!A69)","v":""},{"$f":"IF(Prezentace!B69=0,\"\",Prezentace!B69)","v":""},{"$f":"Prezentace!D69","v":"P"},{"$f":"IF(Prezentace!F69=0,\"\",Prezentace!F69)","v":""},{"$f":"IF(Prezentace!E69=0,\"\",Prezentace!E69)","v":""},null,null,null,null,null,null,null,null,null,null,null,null,null,null,null,null,0]
[{"$f":"IF(Prezentace!A70=0,\"\",Prezentace!A70)","v":""},{"$f":"IF(Prezentace!B70=0,\"\",Prezentace!B70)","v":""},{"$f":"Prezentace!D70","v":"P"},{"$f":"IF(Prezentace!F70=0,\"\",Prezentace!F70)","v":""},{"$f":"IF(Prezentace!E70=0,\"\",Prezentace!E70)","v":""},null,null,null,null,null,null,null,null,null,null,null,null,null,null,null,null,0]
[{"$f":"IF(Prezentace!A71=0,\"\",Prezentace!A71)","v":""},{"$f":"IF(Prezentace!B71=0,\"\",Prezentace!B71)","v":""},{"$f":"Prezentace!D71","v":"P"},{"$f":"IF(Prezentace!F71=0,\"\",Prezentace!F71)","v":""},{"$f":"IF(Prezentace!E71=0,\"\",Prezentace!E71)","v":""},null,null,null,null,null,null,null,null,null,null,null,null,null,null,null,null,0]
[{"$f":"IF(Prezentace!A72=0,\"\",Prezentace!A72)","v":""},{"$f":"IF(Prezentace!B72=0,\"\",Prezentace!B72)","v":""},{"$f":"Prezentace!D72","v":"P"},{"$f":"IF(Prezentace!F72=0,\"\",Prezentace!F72)","v":""},{"$f":"IF(Prezentace!E72=0,\"\",Prezentace!E72)","v":""},null,null,null,null,null,null,null,null,null,null,null,null,null,null,null,null,0]
[{"$f":"IF(Prezentace!A73=0,\"\",Prezentace!A73)","v":""},{"$f":"IF(Prezentace!B73=0,\"\",Prezentace!B73)","v":""},{"$f":"Prezentace!D73","v":"P"},{"$f":"IF(Prezentace!F73=0,\"\",Prezentace!F73)","v":""},{"$f":"IF(Prezentace!E73=0,\"\",Prezentace!E73)","v":""},null,null,null,null,null,null,null,null,null,null,null,null,null,null,null,null,0]
[{"$f":"IF(Prezentace!A74=0,\"\",Prezentace!A74)","v":""},{"$f":"IF(Prezentace!B74=0,\"\",Prezentace!B74)","v":""},{"$f":"Prezentace!D74","v":"P"},{"$f":"IF(Prezentace!F74=0,\"\",Prezentace!F74)","v":""},{"$f":"IF(Prezentace!E74=0,\"\",Prezentace!E74)","v":""},null,null,null,null,null,null,null,null,null,null,null,null,null,null,null,null,0]
[{"$f":"IF(Prezentace!A75=0,\"\",Prezentace!A75)","v":""},{"$f":"IF(Prezentace!B75=0,\"\",Prezentace!B75)","v":""},{"$f":"Prezentace!D75","v":"P"},{"$f":"IF(Prezentace!F75=0,\"\",Prezentace!F75)","v":""},{"$f":"IF(Prezentace!E75=0,\"\",Prezentace!E75)","v":""},null,null,null,null,null,null,null,null,null,null,null,null,null,null,null,null,0]
[{"$f":"IF(Prezentace!A76=0,\"\",Prezentace!A76)","v":""},{"$f":"IF(Prezentace!B76=0,\"\",Prezentace!B76)","v":""},{"$f":"Prezentace!D76","v":"P"},{"$f":"IF(Prezentace!F76=0,\"\",Prezentace!F76)","v":""},{"$f":"IF(Prezentace!E76=0,\"\",Prezentace!E76)","v":""},null,null,null,null,null,null,null,null,null,null,null,null,null,null,null,null,0]
[{"$f":"IF(Prezentace!A77=0,\"\",Prezentace!A77)","v":""},{"$f":"IF(Prezentace!B77=0,\"\",Prezentace!B77)","v":""},{"$f":"Prezentace!D77","v":"P"},{"$f":"IF(Prezentace!F77=0,\"\",Prezentace!F77)","v":""},{"$f":"IF(Prezentace!E77=0,\"\",Prezentace!E77)","v":""},null,null,null,null,null,null,null,null,null,null,null,null,null,null,null,null,0]
[{"$f":"IF(Prezentace!A78=0,\"\",Prezentace!A78)","v":""},{"$f":"IF(Prezentace!B78=0,\"\",Prezentace!B78)","v":""},{"$f":"Prezentace!D78","v":"P"},{"$f":"IF(Prezentace!F78=0,\"\",Prezentace!F78)","v":""},{"$f":"IF(Prezentace!E78=0,\"\",Prezentace!E78)","v":""},null,null,null,null,null,null,null,null,null,null,null,null,null,null,null,null,0]
[{"$f":"IF(Prezentace!A79=0,\"\",Prezentace!A79)","v":""},{"$f":"IF(Prezentace!B79=0,\"\",Prezentace!B79)","v":""},{"$f":"Prezentace!D79","v":"P"},{"$f":"IF(Prezentace!F79=0,\"\",Prezentace!F79)","v":""},{"$f":"IF(Prezentace!E79=0,\"\",Prezentace!E79)","v":""},null,null,null,null,null,null,null,null,null,null,null,null,null,null,null,null,0]
[{"$f":"IF(Prezentace!A80=0,\"\",Prezentace!A80)","v":""},{"$f":"IF(Prezentace!B80=0,\"\",Prezentace!B80)","v":""},{"$f":"Prezentace!D80","v":"P"},{"$f":"IF(Prezentace!F80=0,\"\",Prezentace!F80)","v":""},{"$f":"IF(Prezentace!E80=0,\"\",Prezentace!E80)","v":""},null,null,null,null,null,null,null,null,null,null,null,null,null,null,null,null,0]
[{"$f":"IF(Prezentace!A81=0,\"\",Prezentace!A81)","v":""},{"$f":"IF(Prezentace!B81=0,\"\",Prezentace!B81)","v":""},{"$f":"Prezentace!D81","v":"P"},{"$f":"IF(Prezentace!F81=0,\"\",Prezentace!F81)","v":""},{"$f":"IF(Prezentace!E81=0,\"\",Prezentace!E81)","v":""},null,null,null,null,null,null,null,null,null,null,null,null,null,null,null,null,0]
[{"$f":"IF(Prezentace!A82=0,\"\",Prezentace!A82)","v":""},{"$f":"IF(Prezentace!B82=0,\"\",Prezentace!B82)","v":""},{"$f":"Prezentace!D82","v":"P"},{"$f":"IF(Prezentace!F82=0,\"\",Prezentace!F82)","v":""},{"$f":"IF(Prezentace!E82=0,\"\",Prezentace!E82)","v":""},null,null,null,null,null,null,null,null,null,null,null,null,null,null,null,null,0]
[{"$f":"IF(Prezentace!A83=0,\"\",Prezentace!A83)","v":""},{"$f":"IF(Prezentace!B83=0,\"\",Prezentace!B83)","v":""},{"$f":"Prezentace!D83","v":"P"},{"$f":"IF(Prezentace!F83=0,\"\",Prezentace!F83)","v":""},{"$f":"IF(Prezentace!E83=0,\"\",Prezentace!E83)","v":""},null,null,null,null,null,null,null,null,null,null,null,null,null,null,null,null,0]
[{"$f":"IF(Prezentace!A84=0,\"\",Prezentace!A84)","v":""},{"$f":"IF(Prezentace!B84=0,\"\",Prezentace!B84)","v":""},{"$f":"Prezentace!D84","v":"P"},{"$f":"IF(Prezentace!F84=0,\"\",Prezentace!F84)","v":""},{"$f":"IF(Prezentace!E84=0,\"\",Prezentace!E84)","v":""},null,null,null,null,null,null,null,null,null,null,null,null,null,null,null,null,0]
[{"$f":"IF(Prezentace!A85=0,\"\",Prezentace!A85)","v":""},{"$f":"IF(Prezentace!B85=0,\"\",Prezentace!B85)","v":""},{"$f":"Prezentace!D85","v":"P"},{"$f":"IF(Prezentace!F85=0,\"\",Prezentace!F85)","v":""},{"$f":"IF(Prezentace!E85=0,\"\",Prezentace!E85)","v":""},null,null,null,null,null,null,null,null,null,null,null,null,null,null,null,null,0]
[{"$f":"IF(Prezentace!A86=0,\"\",Prezentace!A86)","v":""},{"$f":"IF(Prezentace!B86=0,\"\",Prezentace!B86)","v":""},{"$f":"Prezentace!D86","v":"P"},{"$f":"IF(Prezentace!F86=0,\"\",Prezentace!F86)","v":""},{"$f":"IF(Prezentace!E86=0,\"\",Prezentace!E86)","v":""},null,null,null,null,null,null,null,null,null,null,null,null,null,null,null,null,0]
[{"$f":"IF(Prezentace!A87=0,\"\",Prezentace!A87)","v":""},{"$f":"IF(Prezentace!B87=0,\"\",Prezentace!B87)","v":""},{"$f":"Prezentace!D87","v":"P"},{"$f":"IF(Prezentace!F87=0,\"\",Prezentace!F87)","v":""},{"$f":"IF(Prezentace!E87=0,\"\",Prezentace!E87)","v":""},null,null,null,null,null,null,null,null,null,null,null,null,null,null,null,null,0]
[{"$f":"IF(Prezentace!A88=0,\"\",Prezentace!A88)","v":""},{"$f":"IF(Prezentace!B88=0,\"\",Prezentace!B88)","v":""},{"$f":"Prezentace!D88","v":"P"},{"$f":"IF(Prezentace!F88=0,\"\",Prezentace!F88)","v":""},{"$f":"IF(Prezentace!E88=0,\"\",Prezentace!E88)","v":""},null,null,null,null,null,null,null,null,null,null,null,null,null,null,null,null,0]
[{"$f":"IF(Prezentace!A89=0,\"\",Prezentace!A89)","v":""},{"$f":"IF(Prezentace!B89=0,\"\",Prezentace!B89)","v":""},{"$f":"Prezentace!D89","v":"P"},{"$f":"IF(Prezentace!F89=0,\"\",Prezentace!F89)","v":""},{"$f":"IF(Prezentace!E89=0,\"\",Prezentace!E89)","v":""},null,null,null,null,null,null,null,null,null,null,null,null,null,null,null,null,0]
[{"$f":"IF(Prezentace!A90=0,\"\",Prezentace!A90)","v":""},{"$f":"IF(Prezentace!B90=0,\"\",Prezentace!B90)","v":""},{"$f":"Prezentace!D90","v":"P"},{"$f":"IF(Prezentace!F90=0,\"\",Prezentace!F90)","v":""},{"$f":"IF(Prezentace!E90=0,\"\",Prezentace!E90)","v":""},null,null,null,null,null,null,null,null,null,null,null,null,null,null,null,null,0]
[{"$f":"IF(Prezentace!A91=0,\"\",Prezentace!A91)","v":""},{"$f":"IF(Prezentace!B91=0,\"\",Prezentace!B91)","v":""},{"$f":"Prezentace!D91","v":"P"},{"$f":"IF(Prezentace!F91=0,\"\",Prezentace!F91)","v":""},{"$f":"IF(Prezentace!E91=0,\"\",Prezentace!E91)","v":""},null,null,null,null,null,null,null,null,null,null,null,null,null,null,null,null,0]
[{"$f":"IF(Prezentace!A92=0,\"\",Prezentace!A92)","v":""},{"$f":"IF(Prezentace!B92=0,\"\",Prezentace!B92)","v":""},{"$f":"Prezentace!D92","v":"P"},{"$f":"IF(Prezentace!F92=0,\"\",Prezentace!F92)","v":""},{"$f":"IF(Prezentace!E92=0,\"\",Prezentace!E92)","v":""},null,null,null,null,null,null,null,null,null,null,null,null,null,null,null,null,0]
[{"$f":"IF(Prezentace!A93=0,\"\",Prezentace!A93)","v":""},{"$f":"IF(Prezentace!B93=0,\"\",Prezentace!B93)","v":""},{"$f":"Prezentace!D93","v":"P"},{"$f":"IF(Prezentace!F93=0,\"\",Prezentace!F93)","v":""},{"$f":"IF(Prezentace!E93=0,\"\",Prezentace!E93)","v":""},null,null,null,null,null,null,null,null,null,null,null,null,null,null,null,null,0]
[{"$f":"IF(Prezentace!A94=0,\"\",Prezentace!A94)","v":""},{"$f":"IF(Prezentace!B94=0,\"\",Prezentace!B94)","v":""},{"$f":"Prezentace!D94","v":"P"},{"$f":"IF(Prezentace!F94=0,\"\",Prezentace!F94)","v":""},{"$f":"IF(Prezentace!E94=0,\"\",Prezentace!E94)","v":""},null,null,null,null,null,null,null,null,null,null,null,null,null,null,null,null,0]
[{"$f":"IF(Prezentace!A95=0,\"\",Prezentace!A95)","v":""},{"$f":"IF(Prezentace!B95=0,\"\",Prezentace!B95)","v":""},{"$f":"Prezentace!D95","v":"P"},{"$f":"IF(Prezentace!F95=0,\"\",Prezentace!F95)","v":""},{"$f":"IF(Prezentace!E95=0,\"\",Prezentace!E95)","v":""},null,null,null,null,null,null,null,null,null,null,null,null,null,null,null,null,0]
[{"$f":"IF(Prezentace!A96=0,\"\",Prezentace!A96)","v":""},{"$f":"IF(Prezentace!B96=0,\"\",Prezentace!B96)","v":""},{"$f":"Prezentace!D96","v":"P"},{"$f":"IF(Prezentace!F96=0,\"\",Prezentace!F96)","v":""},{"$f":"IF(Prezentace!E96=0,\"\",Prezentace!E96)","v":""},null,null,null,null,null,null,null,null,null,null,null,null,null,null,null,null,0]
[{"$f":"IF(Prezentace!A97=0,\"\",Prezentace!A97)","v":""},{"$f":"IF(Prezentace!B97=0,\"\",Prezentace!B97)","v":""},{"$f":"Prezentace!D97","v":"P"},{"$f":"IF(Prezentace!F97=0,\"\",Prezentace!F97)","v":""},{"$f":"IF(Prezentace!E97=0,\"\",Prezentace!E97)","v":""},null,null,null,null,null,null,null,null,null,null,null,null,null,null,null,null,0]
[{"$f":"IF(Prezentace!A98=0,\"\",Prezentace!A98)","v":""},{"$f":"IF(Prezentace!B98=0,\"\",Prezentace!B98)","v":""},{"$f":"Prezentace!D98","v":"P"},{"$f":"IF(Prezentace!F98=0,\"\",Prezentace!F98)","v":""},{"$f":"IF(Prezentace!E98=0,\"\",Prezentace!E98)","v":""},null,null,null,null,null,null,null,null,null,null,null,null,null,null,null,null,0]
[{"$f":"IF(Prezentace!A99=0,\"\",Prezentace!A99)","v":""},{"$f":"IF(Prezentace!B99=0,\"\",Prezentace!B99)","v":""},{"$f":"Prezentace!D99","v":"P"},{"$f":"IF(Prezentace!F99=0,\"\",Prezentace!F99)","v":""},{"$f":"IF(Prezentace!E99=0,\"\",Prezentace!E99)","v":""},null,null,null,null,null,null,null,null,null,null,null,null,null,null,null,null,0]
[{"$f":"IF(Prezentace!A100=0,\"\",Prezentace!A100)","v":""},{"$f":"IF(Prezentace!B100=0,\"\",Prezentace!B100)","v":""},{"$f":"Prezentace!D100","v":"P"},{"$f":"IF(Prezentace!F100=0,\"\",Prezentace!F100)","v":""},{"$f":"IF(Prezentace!E100=0,\"\",Prezentace!E100)","v":""},null,null,null,null,null,null,null,null,null,null,null,null,null,null,null,null,0]
[{"$f":"IF(Prezentace!A101=0,\"\",Prezentace!A101)","v":""},{"$f":"IF(Prezentace!B101=0,\"\",Prezentace!B101)","v":""},{"$f":"Prezentace!D101","v":"P"},{"$f":"IF(Prezentace!F101=0,\"\",Prezentace!F101)","v":""},{"$f":"IF(Prezentace!E101=0,\"\",Prezentace!E101)","v":""},null,null,null,null,null,null,null,null,null,null,null,null,null,null,null,null,0]
[{"$f":"IF(Prezentace!A102=0,\"\",Prezentace!A102)","v":""},{"$f":"IF(Prezentace!B102=0,\"\",Prezentace!B102)","v":""},{"$f":"Prezentace!D102","v":"P"},{"$f":"IF(Prezentace!F102=0,\"\",Prezentace!F102)","v":""},{"$f":"IF(Prezentace!E102=0,\"\",Prezentace!E102)","v":""},null,null,null,null,null,null,null,null,null,null,null,null,null,null,null,null,0]
[{"$f":"IF(Prezentace!A103=0,\"\",Prezentace!A103)","v":""},{"$f":"IF(Prezentace!B103=0,\"\",Prezentace!B103)","v":""},{"$f":"Prezentace!D103","v":"P"},{"$f":"IF(Prezentace!F103=0,\"\",Prezentace!F103)","v":""},{"$f":"IF(Prezentace!E103=0,\"\",Prezentace!E103)","v":""},null,null,null,null,null,null,null,null,null,null,null,null,null,null,null,null,0]
[{"$f":"IF(Prezentace!A104=0,\"\",Prezentace!A104)","v":""},{"$f":"IF(Prezentace!B104=0,\"\",Prezentace!B104)","v":""},{"$f":"Prezentace!D104","v":"P"},{"$f":"IF(Prezentace!F104=0,\"\",Prezentace!F104)","v":""},{"$f":"IF(Prezentace!E104=0,\"\",Prezentace!E104)","v":""},null,null,null,null,null,null,null,null,null,null,null,null,null,null,null,null,{"$f":"(SUM(F102:T102))-U102","v":0}]

{"sheet":"4","index":8,"n_rows":102,"n_cols":22,"rows_kept":102,"cut":false,"hidden":true,"merged":[[0,3,0,20],[0,0,2,0],[0,1,2,1]]}
["Druž.","Kap.",null,"Disciplina 4"]
[]
[null,null,null,null,null,"K","M",1,2,3,4,5,6,7,8,9,10,11,12,"TB","Čas","Součet"]
[{"$f":"IF(Prezentace!A6=0,\"\",Prezentace!A6)","v":""},{"$f":"IF(Prezentace!B6=0,\"\",Prezentace!B6)","v":""},{"$f":"Prezentace!D6","v":"P"},{"$f":"IF(Prezentace!F6=0,\"\",Prezentace!F6)","v":"Martin"},{"$f":"IF(Prezentace!E6=0,\"\",Prezentace!E6)","v":"Adensam "},null,null,null,null,null,null,null,null,null,null,null,null,null,null,null,null,{"$f":"(SUM(F4:T4))-U4","v":0}]
[{"$f":"IF(Prezentace!A7=0,\"\",Prezentace!A7)","v":""},{"$f":"IF(Prezentace!B7=0,\"\",Prezentace!B7)","v":""},{"$f":"Prezentace!D7","v":"R"},{"$f":"IF(Prezentace!F7=0,\"\",Prezentace!F7)","v":"Martin"},{"$f":"IF(Prezentace!E7=0,\"\",Prezentace!E7)","v":"Adensam"},null,null,null,null,null,null,null,null,null,null,null,null,null,null,null,null,{"$f":"(SUM(F5:T5))-U5","v":0}]
[{"$f":"IF(Prezentace!A8=0,\"\",Prezentace!A8)","v":""},{"$f":"IF(Prezentace!B8=0,\"\",Prezentace!B8)","v":""},{"$f":"Prezentace!D8","v":"P"},{"$f":"IF(Prezentace!F8=0,\"\",Prezentace!F8)","v":"Jaroslav"},{"$f":"IF(Prezentace!E8=0,\"\",Prezentace!E8)","v":"Kostříž "},null,null,null,null,null,null,null,null,null,null,null,null,null,null,null,null,0]
[{"$f":"IF(Prezentace!A9=0,\"\",Prezentace!A9)","v":""},{"$f":"IF(Prezentace!B9=0,\"\",Prezentace!B9)","v":""},{"$f":"Prezentace!D9","v":"P"},{"$f":"IF(Prezentace!F9=0,\"\",Prezentace!F9)","v":"Miroslav"},{"$f":"IF(Prezentace!E9=0,\"\",Prezentace!E9)","v":"Koch   ml."},null,null,null,null,null,null,null,null,null,null,null,null,null,null,null,null,0]
[{"$f":"IF(Prezentace!A10=0,\"\",Prezentace!A10)","v":""},{"$f":"IF(Prezentace!B10=0,\"\",Prezentace!B10)","v":""},{"$f":"Prezentace!D10","v":"P"},{"$f":"IF(Prezentace!F10=0,\"\",Prezentace!F10)","v":"Miroslav"},{"$f":"IF(Prezentace!E10=0,\"\",Prezentace!E10)","v":"Koch  st. "},null,null,null,null,null,null,null,null,null,null,null,null,null,null,null,null,0]
[{"$f":"IF(Prezentace!A11=0,\"\",Prezentace!A11)","v":""},{"$f":"IF(Prezentace!B11=0,\"\",Prezentace!B11)","v":""},{"$f":"Prezentace!D11","v":"P"},{"$f":"IF(Prezentace!F11=0,\"\",Prezentace!F11)","v":"Bohumil"},{"$f":"IF(Prezentace!E11=0,\"\",Prezentace!E11)","v":"Herceg"},null,null,null,null,null,null,null,null,null,null,null,null,null,null,null,null,0]
[{"$f":"IF(Prezentace!A12=0,\"\",Prezentace!A12)","v":""},{"$f":"IF(Prezentace!B12=0,\"\",Prezentace!B12)","v":""},{"$f":"Prezentace!D12","v":"P"},{"$f":"IF(Prezentace!F12=0,\"\",Prezentace!F12)","v":"Viktor"},{"$f":"IF(Prezentace!E12=0,\"\",Prezentace!E12)","v":"Fuksa  "},null,null,null,null,null,null,null,null,null,null,null,null,null,null,null,null,0]
[{"$f":"IF(Prezentace!A13=0,\"\",Prezentace!A13)","v":""},{"$f":"IF(Prezentace!B13=0,\"\",Prezentace!B13)","v":""},{"$f":"Prezentace!D13","v":"P"},{"$f":"IF(Prezentace!F13=0,\"\",Prezentace!F13)","v":"Milan"},{"$f":"IF(Prezentace!E13=0,\"\",Prezentace!E13)","v":"Matějka  ml."},null,null,null,null,null,null,null,null,null,null,null,null,null,null,null,null,0]
[{"$f":"IF(Prezentace!A14=0,\"\",Prezentace!A14)","v":""},{"$f":"IF(Prezentace!B14=0,\"\",Prezentace!B14)","v":""},{"$f":"Prezentace!D14","v":"P"},{"$f":"IF(Prezentace!F14=0,\"\",Prezentace!F14)","v":"Michal"},{"$f":"IF(Prezentace!E14=0,\"\",Prezentace!E14)","v":"Svoboda"},null,null,null,null,null,null,null,null,null,null,null,null,null,null,null,null,0]
[{"$f":"IF(Prezentace!A15=0,\"\",Prezentace!A15)","v":""},{"$f":"IF(Prezentace!B15=0,\"\",Prezentace!B15)","v":""},{"$f":"Prezentace!D15","v":"R"},{"$f":"IF(Prezentace!F15=0,\"\",Prezentace!F15)","v":"Lukáš"},{"$f":"IF(Prezentace!E15=0,\"\",Prezentace!E15)","v":"Bouda "},null,null,null,null,null,null,null,null,null,null,null,null,null,null,null,null,0]
[{"$f":"IF(Prezentace!A16=0,\"\",Prezentace!A16)","v":""},{"$f":"IF(Prezentace!B16=0,\"\",Prezentace!B16)","v":""},{"$f":"Prezentace!D16","v":"P"},{"$f":"IF(Prezentace!F16=0,\"\",Prezentace!F16)","v":"Lukáš"},{"$f":"IF(Prezentace!E16=0,\"\",Prezentace!E16)","v":"Bouda "},null,null,null,null,null,null,null,null,null,null,null,null,null,null,null,null,0]
[{"$f":"IF(Prezentace!A17=0,\"\",Prezentace!A17)","v":""},{"$f":"IF(Prezentace!B17=0,\"\",Prezentace!B17)","v":""},{"$f":"Prezentace!D17","v":"P"},{"$f":"IF(Prezentace!F17=0,\"\",Prezentace!F17)","v":"Pavel"},{"$f":"IF(Prezentace!E17=0,\"\",Prezentace!E17)","v":"Koltai"},null,null,null,null,null,null,null,null,null,null,null,null,null,null,null,null,0]
[{"$f":"IF(Prezentace!A18=0,\"\",Prezentace!A18)","v":""},{"$f":"IF(Prezentace!B18=0,\"\",Prezentace!B18)","v":""},{"$f":"Prezentace!D18","v":"P"},{"$f":"IF(Prezentace!F18=0,\"\",Prezentace!F18)","v":"Vladislav"},{"$f":"IF(Prezentace!E18=0,\"\",Prezentace!E18)","v":"Přibyl"},null,null,null,null,null,null,null,null,null,null,null,null,null,null,null,null,0]
[{"$f":"IF(Prezentace!A19=0,\"\",Prezentace!A19)","v":""},{"$f":"IF(Prezentace!B19=0,\"\",Prezentace!B19)","v":""},{"$f":"Prezentace!D19","v":"P"},{"$f":"IF(Prezentace!F19=0,\"\",Prezentace!F19)","v":"Milan"},{"$f":"IF(Prezentace!E19=0,\"\",Prezentace!E19)","v":"Matějka st."},null,null,null,null,null,null,null,null,null,null,null,null,null,null,null,null,0]
[{"$f":"IF(Prezentace!A20=0,\"\",Prezentace!A20)","v":""},{"$f":"IF(Prezentace!B20=0,\"\",Prezentace!B20)","v":""},{"$f":"Prezentace!D20","v":"P"},{"$f":"IF(Prezentace!F20=0,\"\",Prezentace!F20)","v":"Miroslav"},{"$f":"IF(Prezentace!E20=0,\"\",Prezentace!E20)","v":"Fiala  "},null,null,null,null,null,null,null,null,null,null,null,null,null,null,null,null,0]
[{"$f":"IF(Prezentace!A21=0,\"\",Prezentace!A21)","v":""},{"$f":"IF(Prezentace!B21=0,\"\",Prezentace!B21)","v":""},{"$f":"Prezentace!D21","v":"P"},{"$f":"IF(Prezentace!F21=0,\"\",Prezentace!F21)","v":"Karel"},{"$f":"IF(Prezentace!E21=0,\"\",Prezentace!E21)","v":"Gažák "},null,null,null,null,null,null,null,null,null,null,null,null,null,null,null,null,0]
[{"$f":"IF(Prezentace!A22=0,\"\",Prezentace!A22)","v":""},{"$f":"IF(Prezentace!B22=0,\"\",Prezentace!B22)","v":""},{"$f":"Prezentace!D22","v":"P"},{"$f":"IF(Prezentace!F22=0,\"\",Prezentace!F22)","v":"Václav"},{"$f":"IF(Prezentace!E22=0,\"\",Prezentace!E22)","v":"Landkammer"},null,null,null,null,null,null,null,null,null,null,null,null,null,null,null,null,0]
[{"$f":"IF(Prezentace!A23=0,\"\",Prezentace!A23)","v":""},{"$f":"IF(Prezentace!B23=0,\"\",Prezentace!B23)","v":""},{"$f":"Prezentace!D23","v":"P"},{"$f":"IF(Prezentace!F23=0,\"\",Prezentace!F23)","v":"Vojtěch"},{"$f":"IF(Prezentace!E23=0,\"\",Prezentace!E23)","v":"Brejžek "},null,null,null,null,null,null,null,null,null,null,null,null,null,null,null,null,0]
[{"$f":"IF(Prezentace!A24=0,\"\",Prezentace!A24)","v":""},{"$f":"IF(Prezentace!B24=0,\"\",Prezentace!B24)","v":""},{"$f":"Prezentace!D24","v":"P"},{"$f":"IF(Prezentace!F24=0,\"\",Prezentace!F24)","v":"Antonín"},{"$f":"IF(Prezentace!E24=0,\"\",Prezentace!E24)","v":"Urbanec  "},null,null,null,null,null,null,null,null,null,null,null,null,null,null,null,null,0]
[{"$f":"IF(Prezentace!A25=0,\"\",Prezentace!A25)","v":""},{"$f":"IF(Prezentace!B25=0,\"\",Prezentace!B25)","v":""},{"$f":"Prezentace!D25","v":"P"},{"$f":"IF(Prezentace!F25=0,\"\",Prezentace!F25)","v":"Milan"},{"$f":"IF(Prezentace!E25=0,\"\",Prezentace!E25)","v":"Jílek  "},null,null,null,null,null,null,null,null,null,null,null,null,null,null,null,null,0]
[{"$f":"IF(Prezentace!A26=0,\"\",Prezentace!A26)","v":""},{"$f":"IF(Prezentace!B26=0,\"\",Prezentace!B26)","v":""},{"$f":"Prezentace!D26","v":"P"},{"$f":"IF(Prezentace!F26=0,\"\",Prezentace!F26)","v":"Václav"},{"$f":"IF(Prezentace!E26=0,\"\",Prezentace!E26)","v":"Jírů"},null,null,null,null,null,null,null,null,null,null,null,null,null,null,null,null,0]
[{"$f":"IF(Prezentace!A27=0,\"\",Prezentace!A27)","v":""},{"$f":"IF(Prezentace!B27=0,\"\",Prezentace!B27)","v":""},{"$f":"Prezentace!D27","v":"P"},{"$f":"IF(Prezentace!F27=0,\"\",Prezentace!F27)","v":"Milan"},{"$f":"IF(Prezentace!E27=0,\"\",Prezentace!E27)","v":"Krupica"},null,null,null,null,null,null,null,null,null,null,null,null,null,null,null,null,0]
[{"$f":"IF(Prezentace!A28=0,\"\",Prezentace!A28)","v":""},{"$f":"IF(Prezentace!B28=0,\"\",Prezentace!B28)","v":""},{"$f":"Prezentace!D28","v":"R"},{"$f":"IF(Prezentace!F28=0,\"\",Prezentace!F28)","v":"Milan"},{"$f":"IF(Prezentace!E28=0,\"\",Prezentace!E28)","v":"Krupica "},null,null,null,null,null,null,null,null,null,null,null,null,null,null,null,null,0]
[{"$f":"IF(Prezentace!A29=0,\"\",Prezentace!A29)","v":""},{"$f":"IF(Prezentace!B29=0,\"\",Prezentace!B29)","v":""},{"$f":"Prezentace!D29","v":"P"},{"$f":"IF(Prezentace!F29=0,\"\",Prezentace!F29)","v":"Miloslav"},{"$f":"IF(Prezentace!E29=0,\"\",Prezentace!E29)","v":"Petržílka"},null,null,null,null,null,null,null,null,null,null,null,null,null,null,null,null,0]
[{"$f":"IF(Prezentace!A30=0,\"\",Prezentace!A30)","v":""},{"$f":"IF(Prezentace!B30=0,\"\",Prezentace!B30)","v":""},{"$f":"Prezentace!D30","v":"R"},{"$f":"IF(Prezentace!F30=0,\"\",Prezentace!F30)","v":"Aleš"},{"$f":"IF(Prezentace!E30=0,\"\",Prezentace!E30)","v":"Seitl "},null,null,null,null,null,null,null,null,null,null,null,null,null,null,null,null,0]
[{"$f":"IF(Prezentace!A31=0,\"\",Prezentace!A31)","v":""},{"$f":"IF(Prezentace!B31=0,\"\",Prezentace!B31)","v":""},{"$f":"Prezentace!D31","v":"P"},{"$f":"IF(Prezentace!F31=0,\"\",Prezentace!F31)","v":"Aleš"},{"$f":"IF(Prezentace!E31=0,\"\",Prezentace!E31)","v":"Seitl "},null,null,null,null,null,null,null,null,null,null,null,null,null,null,null,null,0]
[{"$f":"IF(Prezentace!A32=0,\"\",Prezentace!A32)","v":""},{"$f":"IF(Prezentace!B32=0,\"\",Prezentace!B32)","v":""},{"$f":"Prezentace!D32","v":"P"},{"$f":"IF(Prezentace!F32=0,\"\",Prezentace!F32)","v":"Karel"},{"$f":"IF(Prezentace!E32=0,\"\",Prezentace!E32)","v":"Seitl"},null,null,null,null,null,null,null,null,null,null,null,null,null,null,null,null,0]
[{"$f":"IF(Prezentace!A33=0,\"\",Prezentace!A33)","v":""},{"$f":"IF(Prezentace!B33=0,\"\",Prezentace!B33)","v":""},{"$f":"Prezentace!D33","v":"P"},{"$f":"IF(Prezentace!F33=0,\"\",Prezentace!F33)","v":"David"},{"$f":"IF(Prezentace!E33=0,\"\",Prezentace!E33)","v":"Nikodým"},null,null,null,null,null,null,null,null,null,null,null,null,null,null,null,null,0]
[{"$f":"IF(Prezentace!A34=0,\"\",Prezentace!A34)","v":""},{"$f":"IF(Prezentace!B34=0,\"\",Prezentace!B34)","v":""},{"$f":"Prezentace!D34","v":"R"},{"$f":"IF(Prezentace!F34=0,\"\",Prezentace!F34)","v":"David"},{"$f":"IF(Prezentace!E34=0,\"\",Prezentace!E34)","v":"Nikodým "},null,null,null,null,null,null,null,null,null,null,null,null,null,null,null,null,0]
[{"$f":"IF(Prezentace!A35=0,\"\",Prezentace!A35)","v":""},{"$f":"IF(Prezentace!B35=0,\"\",Prezentace!B35)","v":""},{"$f":"Prezentace!D35","v":"P"},{"$f":"IF(Prezentace!F35=0,\"\",Prezentace!F35)","v":"Lukáš"},{"$f":"IF(Prezentace!E35=0,\"\",Prezentace!E35)","v":"Hobza"},null,null,null,null,null,null,null,null,null,null,null,null,null,null,null,null,0]
[{"$f":"IF(Prezentace!A36=0,\"\",Prezentace!A36)","v":""},{"$f":"IF(Prezentace!B36=0,\"\",Prezentace!B36)","v":""},{"$f":"Prezentace!D36","v":"P"},{"$f":"IF(Prezentace!F36=0,\"\",Prezentace!F36)","v":"Antonín"},{"$f":"IF(Prezentace!E36=0,\"\",Prezentace!E36)","v":"Jelínek "},null,null,null,null,null,null,null,null,null,null,null,null,null,null,null,null,0]
[{"$f":"IF(Prezentace!A37=0,\"\",Prezentace!A37)","v":""},{"$f":"IF(Prezentace!B37=0,\"\",Prezentace!B37)","v":""},{"$f":"Prezentace!D37","v":"R"},{"$f":"IF(Prezentace!F37=0,\"\",Prezentace!F37)","v":"Antonín"},{"$f":"IF(Prezentace!E37=0,\"\",Prezentace!E37)","v":"Jelínek "},null,null,null,null,null,null,null,null,null,null,null,null,null,null,null,null,0]
[{"$f":"IF(Prezentace!A38=0,\"\",Prezentace!A38)","v":""},{"$f":"IF(Prezentace!B38=0,\"\",Prezentace!B38)","v":""},{"$f":"Prezentace!D38","v":"P"},{"$f":"IF(Prezentace!F38=0,\"\",Prezentace!F38)","v":"Ladislav"},{"$f":"IF(Prezentace!E38=0,\"\",Prezentace!E38)","v":"Píša "},null,null,null,null,null,null,null,null,null,null,null,null,null,null,null,null,0]
[{"$f":"IF(Prezentace!A39=0,\"\",Prezentace!A39)","v":""},{"$f":"IF(Prezentace!B39=0,\"\",Prezentace!B39)","v":""},{"$f":"Prezentace!D39","v":"P"},{"$f":"IF(Prezentace!F39=0,\"\",Prezentace!F39)","v":"Štefan"},{"$f":"IF(Prezentace!E39=0,\"\",Prezentace!E39)","v":"Mesároš"},null,null,null,null,null,null,null,null,null,null,null,null,null,null,null,null,0]
[{"$f":"IF(Prezentace!A40=0,\"\",Prezentace!A40)","v":""},{"$f":"IF(Prezentace!B40=0,\"\",Prezentace!B40)","v":""},{"$f":"Prezentace!D40","v":"P"},{"$f":"IF(Prezentace!F40=0,\"\",Prezentace!F40)","v":"Pavel"},{"$f":"IF(Prezentace!E40=0,\"\",Prezentace!E40)","v":"Červenka"},null,null,null,null,null,null,null,null,null,null,null,null,null,null,null,null,{"$f":"(SUM(F38:T38))-U38","v":0}]
[{"$f":"IF(Prezentace!A41=0,\"\",Prezentace!A41)","v":""},{"$f":"IF(Prezentace!B41=0,\"\",Prezentace!B41)","v":""},{"$f":"Prezentace!D41","v":"R"},{"$f":"IF(Prezentace!F41=0,\"\",Prezentace!F41)","v":"Pavel"},{"$f":"IF(Prezentace!E41=0,\"\",Prezentace!E41)","v":"Červenka "},null,null,null,null,null,null,null,null,null,null,null,null,null,null,null,null,0]
[{"$f":"IF(Prezentace!A42=0,\"\",Prezentace!A42)","v":""},{"$f":"IF(Prezentace!B42=0,\"\",Prezentace!B42)","v":""},{"$f":"Prezentace!D42","v":"P"},{"$f":"IF(Prezentace!F42=0,\"\",Prezentace!F42)","v":"Jiří"},{"$f":"IF(Prezentace!E42=0,\"\",Prezentace!E42)","v":"Švihálek "},null,null,null,null,null,null,null,null,null,null,null,null,null,null,null,null,0]
[{"$f":"IF(Prezentace!A43=0,\"\",Prezentace!A43)","v":""},{"$f":"IF(Prezentace!B43=0,\"\",Prezentace!B43)","v":""},{"$f":"Prezentace!D43","v":"R"},{"$f":"IF(Prezentace!F43=0,\"\",Prezentace!F43)","v":"Jiří"},{"$f":"IF(Prezentace!E43=0,\"\",Prezentace!E43)","v":"Švihálek "},null,null,null,null,null,null,null,null,null,null,null,null,null,null,null,null,0]
[{"$f":"IF(Prezentace!A44=0,\"\",Prezentace!A44)","v":""},{"$f":"IF(Prezentace!B44=0,\"\",Prezentace!B44)","v":""},{"$f":"Prezentace!D44","v":"P"},{"$f":"IF(Prezentace!F44=0,\"\",Prezentace!F44)","v":"František"},{"$f":"IF(Prezentace!E44=0,\"\",Prezentace!E44)","v":"Toman "},null,null,null,null,null,null,null,null,null,null,null,null,null,null,null,null,0]
[{"$f":"IF(Prezentace!A45=0,\"\",Prezentace!A45)","v":""},{"$f":"IF(Prezentace!B45=0,\"\",Prezentace!B45)","v":""},{"$f":"Prezentace!D45","v":"P"},{"$f":"IF(Prezentace!F45=0,\"\",Prezentace!F45)","v":"Vladimír"},{"$f":"IF(Prezentace!E45=0,\"\",Prezentace!E45)","v":"VejslíK "},null,null,null,null,null,null,null,null,null,null,null,null,null,null,null,null,0]
[{"$f":"IF(Prezentace!A46=0,\"\",Prezentace!A46)","v":""},{"$f":"IF(Prezentace!B46=0,\"\",Prezentace!B46)","v":""},{"$f":"Prezentace!D46","v":"P"},{"$f":"IF(Prezentace!F46=0,\"\",Prezentace!F46)","v":"Karel"},{"$f":"IF(Prezentace!E46=0,\"\",Prezentace!E46)","v":"Získal "},null,null,null,null,null,null,null,null,null,null,null,null,null,null,null,null,0]
[{"$f":"IF(Prezentace!A47=0,\"\",Prezentace!A47)","v":""},{"$f":"IF(Prezentace!B47=0,\"\",Prezentace!B47)","v":""},{"$f":"Prezentace!D47","v":"R"},{"$f":"IF(Prezentace!F47=0,\"\",Prezentace!F47)","v":"Karel"},{"$f":"IF(Prezentace!E47=0,\"\",Prezentace!E47)","v":"Získal "},null,null,null,null,null,null,null,null,null,null,null,null,null,null,null,null,0]
[{"$f":"IF(Prezentace!A48=0,\"\",Prezentace!A48)","v":""},{"$f":"IF(Prezentace!B48=0,\"\",Prezentace!B48)","v":""},{"$f":"Prezentace!D48","v":"P"},{"$f":"IF(Prezentace!F48=0,\"\",Prezentace!F48)","v":"Jaroslav"},{"$f":"IF(Prezentace!E48=0,\"\",Prezentace!E48)","v":"Sokolík "},null,null,null,null,null,null,null,null,null,null,null,null,null,null,null,null,0]
[{"$f":"IF(Prezentace!A49=0,\"\",Prezentace!A49)","v":""},{"$f":"IF(Prezentace!B49=0,\"\",Prezentace!B49)","v":""},{"$f":"Prezentace!D49","v":"P"},{"$f":"IF(Prezentace!F49=0,\"\",Prezentace!F49)","v":"Milan"},{"$f":"IF(Prezentace!E49=0,\"\",Prezentace!E49)","v":"Kraus "},null,null,null,null,null,null,null,null,null,null,null,null,null,null,null,null,0]
[{"$f":"IF(Prezentace!A50=0,\"\",Prezentace!A50)","v":""},{"$f":"IF(Prezentace!B50=0,\"\",Prezentace!B50)","v":""},{"$f":"Prezentace!D50","v":"P"},{"$f":"IF(Prezentace!F50=0,\"\",Prezentace!F50)","v":""},{"$f":"IF(Prezentace!E50=0,\"\",Prezentace!E50)","v":""},null,null,null,null,null,null,null,null,null,null,null,null,null,null,null,null,0]
[{"$f":"IF(Prezentace!A51=0,\"\",Prezentace!A51)","v":""},{"$f":"IF(Prezentace!B51=0,\"\",Prezentace!B51)","v":""},{"$f":"Prezentace!D51","v":"P"},{"$f":"IF(Prezentace!F51=0,\"\",Prezentace!F51)","v":""},{"$f":"IF(Prezentace!E51=0,\"\",Prezentace!E51)","v":""},null,null,null,null,null,null,null,null,null,null,null,null,null,null,null,null,0]
[{"$f":"IF(Prezentace!A52=0,\"\",Prezentace!A52)","v":""},{"$f":"IF(Prezentace!B52=0,\"\",Prezentace!B52)","v":""},{"$f":"Prezentace!D52","v":"P"},{"$f":"IF(Prezentace!F52=0,\"\",Prezentace!F52)","v":""},{"$f":"IF(Prezentace!E52=0,\"\",Prezentace!E52)","v":""},null,null,null,null,null,null,null,null,null,null,null,null,null,null,null,null,0]
[{"$f":"IF(Prezentace!A53=0,\"\",Prezentace!A53)","v":""},{"$f":"IF(Prezentace!B53=0,\"\",Prezentace!B53)","v":""},{"$f":"Prezentace!D53","v":"P"},{"$f":"IF(Prezentace!F53=0,\"\",Prezentace!F53)","v":""},{"$f":"IF(Prezentace!E53=0,\"\",Prezentace!E53)","v":""},null,null,null,null,null,null,null,null,null,null,null,null,null,null,null,null,0]
[{"$f":"IF(Prezentace!A54=0,\"\",Prezentace!A54)","v":""},{"$f":"IF(Prezentace!B54=0,\"\",Prezentace!B54)","v":""},{"$f":"Prezentace!D54","v":"P"},{"$f":"IF(Prezentace!F54=0,\"\",Prezentace!F54)","v":""},{"$f":"IF(Prezentace!E54=0,\"\",Prezentace!E54)","v":""},null,null,null,null,null,null,null,null,null,null,null,null,null,null,null,null,0]
[{"$f":"IF(Prezentace!A55=0,\"\",Prezentace!A55)","v":""},{"$f":"IF(Prezentace!B55=0,\"\",Prezentace!B55)","v":""},{"$f":"Prezentace!D55","v":"P"},{"$f":"IF(Prezentace!F55=0,\"\",Prezentace!F55)","v":""},{"$f":"IF(Prezentace!E55=0,\"\",Prezentace!E55)","v":""},null,null,null,null,null,null,null,null,null,null,null,null,null,null,null,null,0]
[{"$f":"IF(Prezentace!A56=0,\"\",Prezentace!A56)","v":""},{"$f":"IF(Prezentace!B56=0,\"\",Prezentace!B56)","v":""},{"$f":"Prezentace!D56","v":"P"},{"$f":"IF(Prezentace!F56=0,\"\",Prezentace!F56)","v":""},{"$f":"IF(Prezentace!E56=0,\"\",Prezentace!E56)","v":""},null,null,null,null,null,null,null,null,null,null,null,null,null,null,null,null,0]
[{"$f":"IF(Prezentace!A57=0,\"\",Prezentace!A57)","v":""},{"$f":"IF(Prezentace!B57=0,\"\",Prezentace!B57)","v":""},{"$f":"Prezentace!D57","v":"P"},{"$f":"IF(Prezentace!F57=0,\"\",Prezentace!F57)","v":""},{"$f":"IF(Prezentace!E57=0,\"\",Prezentace!E57)","v":""},null,null,null,null,null,null,null,null,null,null,null,null,null,null,null,null,0]
[{"$f":"IF(Prezentace!A58=0,\"\",Prezentace!A58)","v":""},{"$f":"IF(Prezentace!B58=0,\"\",Prezentace!B58)","v":""},{"$f":"Prezentace!D58","v":"P"},{"$f":"IF(Prezentace!F58=0,\"\",Prezentace!F58)","v":""},{"$f":"IF(Prezentace!E58=0,\"\",Prezentace!E58)","v":""},null,null,null,null,null,null,null,null,null,null,null,null,null,null,null,null,0]
[{"$f":"IF(Prezentace!A59=0,\"\",Prezentace!A59)","v":""},{"$f":"IF(Prezentace!B59=0,\"\",Prezentace!B59)","v":""},{"$f":"Prezentace!D59","v":"P"},{"$f":"IF(Prezentace!F59=0,\"\",Prezentace!F59)","v":""},{"$f":"IF(Prezentace!E59=0,\"\",Prezentace!E59)","v":""},null,null,null,null,null,null,null,null,null,null,null,null,null,null,null,null,0]
[{"$f":"IF(Prezentace!A60=0,\"\",Prezentace!A60)","v":""},{"$f":"IF(Prezentace!B60=0,\"\",Prezentace!B60)","v":""},{"$f":"Prezentace!D60","v":"P"},{"$f":"IF(Prezentace!F60=0,\"\",Prezentace!F60)","v":""},{"$f":"IF(Prezentace!E60=0,\"\",Prezentace!E60)","v":""},null,null,null,null,null,null,null,null,null,null,null,null,null,null,null,null,0]
[{"$f":"IF(Prezentace!A61=0,\"\",Prezentace!A61)","v":""},{"$f":"IF(Prezentace!B61=0,\"\",Prezentace!B61)","v":""},{"$f":"Prezentace!D61","v":"P"},{"$f":"IF(Prezentace!F61=0,\"\",Prezentace!F61)","v":""},{"$f":"IF(Prezentace!E61=0,\"\",Prezentace!E61)","v":""},null,null,null,null,null,null,null,null,null,null,null,null,null,null,null,null,0]
[{"$f":"IF(Prezentace!A62=0,\"\",Prezentace!A62)","v":""},{"$f":"IF(Prezentace!B62=0,\"\",Prezentace!B62)","v":""},{"$f":"Prezentace!D62","v":"P"},{"$f":"IF(Prezentace!F62=0,\"\",Prezentace!F62)","v":""},{"$f":"IF(Prezentace!E62=0,\"\",Prezentace!E62)","v":""},null,null,null,null,null,null,null,null,null,null,null,null,null,null,null,null,0]
[{"$f":"IF(Prezentace!A63=0,\"\",Prezentace!A63)","v":""},{"$f":"IF(Prezentace!B63=0,\"\",Prezentace!B63)","v":""},{"$f":"Prezentace!D63","v":"P"},{"$f":"IF(Prezentace!F63=0,\"\",Prezentace!F63)","v":""},{"$f":"IF(Prezentace!E63=0,\"\",Prezentace!E63)","v":""},null,null,null,null,null,null,null,null,null,null,null,null,null,null,null,null,0]
[{"$f":"IF(Prezentace!A64=0,\"\",Prezentace!A64)","v":""},{"$f":"IF(Prezentace!B64=0,\"\",Prezentace!B64)","v":""},{"$f":"Prezentace!D64","v":"P"},{"$f":"IF(Prezentace!F64=0,\"\",Prezentace!F64)","v":""},{"$f":"IF(Prezentace!E64=0,\"\",Prezentace!E64)","v":""},null,null,null,null,null,null,null,null,null,null,null,null,null,null,null,null,0]
[{"$f":"IF(Prezentace!A65=0,\"\",Prezentace!A65)","v":""},{"$f":"IF(Prezentace!B65=0,\"\",Prezentace!B65)","v":""},{"$f":"Prezentace!D65","v":"P"},{"$f":"IF(Prezentace!F65=0,\"\",Prezentace!F65)","v":""},{"$f":"IF(Prezentace!E65=0,\"\",Prezentace!E65)","v":""},null,null,null,null,null,null,null,null,null,null,null,null,null,null,null,null,0]
[{"$f":"IF(Prezentace!A66=0,\"\",Prezentace!A66)","v":""},{"$f":"IF(Prezentace!B66=0,\"\",Prezentace!B66)","v":""},{"$f":"Prezentace!D66","v":"P"},{"$f":"IF(Prezentace!F66=0,\"\",Prezentace!F66)","v":""},{"$f":"IF(Prezentace!E66=0,\"\",Prezentace!E66)","v":""},null,null,null,null,null,null,null,null,null,null,null,null,null,null,null,null,0]
[{"$f":"IF(Prezentace!A67=0,\"\",Prezentace!A67)","v":""},{"$f":"IF(Prezentace!B67=0,\"\",Prezentace!B67)","v":""},{"$f":"Prezentace!D67","v":"P"},{"$f":"IF(Prezentace!F67=0,\"\",Prezentace!F67)","v":""},{"$f":"IF(Prezentace!E67=0,\"\",Prezentace!E67)","v":""},null,null,null,null,null,null,null,null,null,null,null,null,null,null,null,null,0]
[{"$f":"IF(Prezentace!A68=0,\"\",Prezentace!A68)","v":""},{"$f":"IF(Prezentace!B68=0,\"\",Prezentace!B68)","v":""},{"$f":"Prezentace!D68","v":"P"},{"$f":"IF(Prezentace!F68=0,\"\",Prezentace!F68)","v":""},{"$f":"IF(Prezentace!E68=0,\"\",Prezentace!E68)","v":""},null,null,null,null,null,null,null,null,null,null,null,null,null,null,null,null,0]
[{"$f":"IF(Prezentace!A69=0,\"\",Prezentace!A69)","v":""},{"$f":"IF(Prezentace!B69=0,\"\",Prezentace!B69)","v":""},{"$f":"Prezentace!D69","v":"P"},{"$f":"IF(Prezentace!F69=0,\"\",Prezentace!F69)","v":""},{"$f":"IF(Prezentace!E69=0,\"\",Prezentace!E69)","v":""},null,null,null,null,null,null,null,null,null,null,null,null,null,null,null,null,0]
[{"$f":"IF(Prezentace!A70=0,\"\",Prezentace!A70)","v":""},{"$f":"IF(Prezentace!B70=0,\"\",Prezentace!B70)","v":""},{"$f":"Prezentace!D70","v":"P"},{"$f":"IF(Prezentace!F70=0,\"\",Prezentace!F70)","v":""},{"$f":"IF(Prezentace!E70=0,\"\",Prezentace!E70)","v":""},null,null,null,null,null,null,null,null,null,null,null,null,null,null,null,null,0]
[{"$f":"IF(Prezentace!A71=0,\"\",Prezentace!A71)","v":""},{"$f":"IF(Prezentace!B71=0,\"\",Prezentace!B71)","v":""},{"$f":"Prezentace!D71","v":"P"},{"$f":"IF(Prezentace!F71=0,\"\",Prezentace!F71)","v":""},{"$f":"IF(Prezentace!E71=0,\"\",Prezentace!E71)","v":""},null,null,null,null,null,null,null,null,null,null,null,null,null,null,null,null,0]
[{"$f":"IF(Prezentace!A72=0,\"\",Prezentace!A72)","v":""},{"$f":"IF(Prezentace!B72=0,\"\",Prezentace!B72)","v":""},{"$f":"Prezentace!D72","v":"P"},{"$f":"IF(Prezentace!F72=0,\"\",Prezentace!F72)","v":""},{"$f":"IF(Prezentace!E72=0,\"\",Prezentace!E72)","v":""},null,null,null,null,null,null,null,null,null,null,null,null,null,null,null,null,0]
[{"$f":"IF(Prezentace!A73=0,\"\",Prezentace!A73)","v":""},{"$f":"IF(Prezentace!B73=0,\"\",Prezentace!B73)","v":""},{"$f":"Prezentace!D73","v":"P"},{"$f":"IF(Prezentace!F73=0,\"\",Prezentace!F73)","v":""},{"$f":"IF(Prezentace!E73=0,\"\",Prezentace!E73)","v":""},null,null,null,null,null,null,null,null,null,null,null,null,null,null,null,null,0]
[{"$f":"IF(Prezentace!A74=0,\"\",Prezentace!A74)","v":""},{"$f":"IF(Prezentace!B74=0,\"\",Prezentace!B74)","v":""},{"$f":"Prezentace!D74","v":"P"},{"$f":"IF(Prezentace!F74=0,\"\",Prezentace!F74)","v":""},{"$f":"IF(Prezentace!E74=0,\"\",Prezentace!E74)","v":""},null,null,null,null,null,null,null,null,null,null,null,null,null,null,null,null,0]
[{"$f":"IF(Prezentace!A75=0,\"\",Prezentace!A75)","v":""},{"$f":"IF(Prezentace!B75=0,\"\",Prezentace!B75)","v":""},{"$f":"Prezentace!D75","v":"P"},{"$f":"IF(Prezentace!F75=0,\"\",Prezentace!F75)","v":""},{"$f":"IF(Prezentace!E75=0,\"\",Prezentace!E75)","v":""},null,null,null,null,null,null,null,null,null,null,null,null,null,null,null,null,0]
[{"$f":"IF(Prezentace!A76=0,\"\",Prezentace!A76)","v":""},{"$f":"IF(Prezentace!B76=0,\"\",Prezentace!B76)","v":""},{"$f":"Prezentace!D76","v":"P"},{"$f":"IF(Prezentace!F76=0,\"\",Prezentace!F76)","v":""},{"$f":"IF(Prezentace!E76=0,\"\",Prezentace!E76)","v":""},null,null,null,null,null,null,null,null,null,null,null,null,null,null,null,null,0]
[{"$f":"IF(Prezentace!A77=0,\"\",Prezentace!A77)","v":""},{"$f":"IF(Prezentace!B77=0,\"\",Prezentace!B77)","v":""},{"$f":"Prezentace!D77","v":"P"},{"$f":"IF(Prezentace!F77=0,\"\",Prezentace!F77)","v":""},{"$f":"IF(Prezentace!E77=0,\"\",Prezentace!E77)","v":""},null,null,null,null,null,null,null,null,null,null,null,null,null,null,null,null,0]
[{"$f":"IF(Prezentace!A78=0,\"\",Prezentace!A78)","v":""},{"$f":"IF(Prezentace!B78=0,\"\",Prezentace!B78)","v":""},{"$f":"Prezentace!D78","v":"P"},{"$f":"IF(Prezentace!F78=0,\"\",Prezentace!F78)","v":""},{"$f":"IF(Prezentace!E78=0,\"\",Prezentace!E78)","v":""},null,null,null,null,null,null,null,null,null,null,null,null,null,null,null,null,0]
[{"$f":"IF(Prezentace!A79=0,\"\",Prezentace!A79)","v":""},{"$f":"IF(Prezentace!B79=0,\"\",Prezentace!B79)","v":""},{"$f":"Prezentace!D79","v":"P"},{"$f":"IF(Prezentace!F79=0,\"\",Prezentace!F79)","v":""},{"$f":"IF(Prezentace!E79=0,\"\",Prezentace!E79)","v":""},null,null,null,null,null,null,null,null,null,null,null,null,null,null,null,null,0]
[{"$f":"IF(Prezentace!A80=0,\"\",Prezentace!A80)","v":""},{"$f":"IF(Prezentace!B80=0,\"\",Prezentace!B80)","v":""},{"$f":"Prezentace!D80","v":"P"},{"$f":"IF(Prezentace!F80=0,\"\",Prezentace!F80)","v":""},{"$f":"IF(Prezentace!E80=0,\"\",Prezentace!E80)","v":""},null,null,null,null,null,null,null,null,null,null,null,null,null,null,null,null,0]
[{"$f":"IF(Prezentace!A81=0,\"\",Prezentace!A81)","v":""},{"$f":"IF(Prezentace!B81=0,\"\",Prezentace!B81)","v":""},{"$f":"Prezentace!D81","v":"P"},{"$f":"IF(Prezentace!F81=0,\"\",Prezentace!F81)","v":""},{"$f":"IF(Prezentace!E81=0,\"\",Prezentace!E81)","v":""},null,null,null,null,null,null,null,null,null,null,null,null,null,null,null,null,0]
[{"$f":"IF(Prezentace!A82=0,\"\",Prezentace!A82)","v":""},{"$f":"IF(Prezentace!B82=0,\"\",Prezentace!B82)","v":""},{"$f":"Prezentace!D82","v":"P"},{"$f":"IF(Prezentace!F82=0,\"\",Prezentace!F82)","v":""},{"$f":"IF(Prezentace!E82=0,\"\",Prezentace!E82)","v":""},null,null,null,null,null,null,null,null,null,null,null,null,null,null,null,null,0]
[{"$f":"IF(Prezentace!A83=0,\"\",Prezentace!A83)","v":""},{"$f":"IF(Prezentace!B83=0,\"\",Prezentace!B83)","v":""},{"$f":"Prezentace!D83","v":"P"},{"$f":"IF(Prezentace!F83=0,\"\",Prezentace!F83)","v":""},{"$f":"IF(Prezentace!E83=0,\"\",Prezentace!E83)","v":""},null,null,null,null,null,null,null,null,null,null,null,null,null,null,null,null,0]
[{"$f":"IF(Prezentace!A84=0,\"\",Prezentace!A84)","v":""},{"$f":"IF(Prezentace!B84=0,\"\",Prezentace!B84)","v":""},{"$f":"Prezentace!D84","v":"P"},{"$f":"IF(Prezentace!F84=0,\"\",Prezentace!F84)","v":""},{"$f":"IF(Prezentace!E84=0,\"\",Prezentace!E84)","v":""},null,null,null,null,null,null,null,null,null,null,null,null,null,null,null,null,0]
[{"$f":"IF(Prezentace!A85=0,\"\",Prezentace!A85)","v":""},{"$f":"IF(Prezentace!B85=0,\"\",Prezentace!B85)","v":""},{"$f":"Prezentace!D85","v":"P"},{"$f":"IF(Prezentace!F85=0,\"\",Prezentace!F85)","v":""},{"$f":"IF(Prezentace!E85=0,\"\",Prezentace!E85)","v":""},null,null,null,null,null,null,null,null,null,null,null,null,null,null,null,null,0]
[{"$f":"IF(Prezentace!A86=0,\"\",Prezentace!A86)","v":""},{"$f":"IF(Prezentace!B86=0,\"\",Prezentace!B86)","v":""},{"$f":"Prezentace!D86","v":"P"},{"$f":"IF(Prezentace!F86=0,\"\",Prezentace!F86)","v":""},{"$f":"IF(Prezentace!E86=0,\"\",Prezentace!E86)","v":""},null,null,null,null,null,null,null,null,null,null,null,null,null,null,null,null,0]
[{"$f":"IF(Prezentace!A87=0,\"\",Prezentace!A87)","v":""},{"$f":"IF(Prezentace!B87=0,\"\",Prezentace!B87)","v":""},{"$f":"Prezentace!D87","v":"P"},{"$f":"IF(Prezentace!F87=0,\"\",Prezentace!F87)","v":""},{"$f":"IF(Prezentace!E87=0,\"\",Prezentace!E87)","v":""},null,null,null,null,null,null,null,null,null,null,null,null,null,null,null,null,0]
[{"$f":"IF(Prezentace!A88=0,\"\",Prezentace!A88)","v":""},{"$f":"IF(Prezentace!B88=0,\"\",Prezentace!B88)","v":""},{"$f":"Prezentace!D88","v":"P"},{"$f":"IF(Prezentace!F88=0,\"\",Prezentace!F88)","v":""},{"$f":"IF(Prezentace!E88=0,\"\",Prezentace!E88)","v":""},null,null,null,null,null,null,null,null,null,null,null,null,null,null,null,null,0]
[{"$f":"IF(Prezentace!A89=0,\"\",Prezentace!A89)","v":""},{"$f":"IF(Prezentace!B89=0,\"\",Prezentace!B89)","v":""},{"$f":"Prezentace!D89","v":"P"},{"$f":"IF(Prezentace!F89=0,\"\",Prezentace!F89)","v":""},{"$f":"IF(Prezentace!E89=0,\"\",Prezentace!E89)","v":""},null,null,null,null,null,null,null,null,null,null,null,null,null,null,null,null,0]
[{"$f":"IF(Prezentace!A90=0,\"\",Prezentace!A90)","v":""},{"$f":"IF(Prezentace!B90=0,\"\",Prezentace!B90)","v":""},{"$f":"Prezentace!D90","v":"P"},{"$f":"IF(Prezentace!F90=0,\"\",Prezentace!F90)","v":""},{"$f":"IF(Prezentace!E90=0,\"\",Prezentace!E90)","v":""},null,null,null,null,null,null,null,null,null,null,null,null,null,null,null,null,0]
[{"$f":"IF(Prezentace!A91=0,\"\",Prezentace!A91)","v":""},{"$f":"IF(Prezentace!B91=0,\"\",Prezentace!B91)","v":""},{"$f":"Prezentace!D91","v":"P"},{"$f":"IF(Prezentace!F91=0,\"\",Prezentace!F91)","v":""},{"$f":"IF(Prezentace!E91=0,\"\",Prezentace!E91)","v":""},null,null,null,null,null,null,null,null,null,null,null,null,null,null,null,null,0]
[{"$f":"IF(Prezentace!A92=0,\"\",Prezentace!A92)","v":""},{"$f":"IF(Prezentace!B92=0,\"\",Prezentace!B92)","v":""},{"$f":"Prezentace!D92","v":"P"},{"$f":"IF(Prezentace!F92=0,\"\",Prezentace!F92)","v":""},{"$f":"IF(Prezentace!E92=0,\"\",Prezentace!E92)","v":""},null,null,null,null,null,null,null,null,null,null,null,null,null,null,null,null,0]
[{"$f":"IF(Prezentace!A93=0,\"\",Prezentace!A93)","v":""},{"$f":"IF(Prezentace!B93=0,\"\",Prezentace!B93)","v":""},{"$f":"Prezentace!D93","v":"P"},{"$f":"IF(Prezentace!F93=0,\"\",Prezentace!F93)","v":""},{"$f":"IF(Prezentace!E93=0,\"\",Prezentace!E93)","v":""},null,null,null,null,null,null,null,null,null,null,null,null,null,null,null,null,0]
[{"$f":"IF(Prezentace!A94=0,\"\",Prezentace!A94)","v":""},{"$f":"IF(Prezentace!B94=0,\"\",Prezentace!B94)","v":""},{"$f":"Prezentace!D94","v":"P"},{"$f":"IF(Prezentace!F94=0,\"\",Prezentace!F94)","v":""},{"$f":"IF(Prezentace!E94=0,\"\",Prezentace!E94)","v":""},null,null,null,null,null,null,null,null,null,null,null,null,null,null,null,null,0]
[{"$f":"IF(Prezentace!A95=0,\"\",Prezentace!A95)","v":""},{"$f":"IF(Prezentace!B95=0,\"\",Prezentace!B95)","v":""},{"$f":"Prezentace!D95","v":"P"},{"$f":"IF(Prezentace!F95=0,\"\",Prezentace!F95)","v":""},{"$f":"IF(Prezentace!E95=0,\"\",Prezentace!E95)","v":""},null,null,null,null,null,null,null,null,null,null,null,null,null,null,null,null,0]
[{"$f":"IF(Prezentace!A96=0,\"\",Prezentace!A96)","v":""},{"$f":"IF(Prezentace!B96=0,\"\",Prezentace!B96)","v":""},{"$f":"Prezentace!D96","v":"P"},{"$f":"IF(Prezentace!F96=0,\"\",Prezentace!F96)","v":""},{"$f":"IF(Prezentace!E96=0,\"\",Prezentace!E96)","v":""},null,null,null,null,null,null,null,null,null,null,null,null,null,null,null,null,0]
[{"$f":"IF(Prezentace!A97=0,\"\",Prezentace!A97)","v":""},{"$f":"IF(Prezentace!B97=0,\"\",Prezentace!B97)","v":""},{"$f":"Prezentace!D97","v":"P"},{"$f":"IF(Prezentace!F97=0,\"\",Prezentace!F97)","v":""},{"$f":"IF(Prezentace!E97=0,\"\",Prezentace!E97)","v":""},null,null,null,null,null,null,null,null,null,null,null,null,null,null,null,null,0]
[{"$f":"IF(Prezentace!A98=0,\"\",Prezentace!A98)","v":""},{"$f":"IF(Prezentace!B98=0,\"\",Prezentace!B98)","v":""},{"$f":"Prezentace!D98","v":"P"},{"$f":"IF(Prezentace!F98=0,\"\",Prezentace!F98)","v":""},{"$f":"IF(Prezentace!E98=0,\"\",Prezentace!E98)","v":""},null,null,null,null,null,null,null,null,null,null,null,null,null,null,null,null,0]
[{"$f":"IF(Prezentace!A99=0,\"\",Prezentace!A99)","v":""},{"$f":"IF(Prezentace!B99=0,\"\",Prezentace!B99)","v":""},{"$f":"Prezentace!D99","v":"P"},{"$f":"IF(Prezentace!F99=0,\"\",Prezentace!F99)","v":""},{"$f":"IF(Prezentace!E99=0,\"\",Prezentace!E99)","v":""},null,null,null,null,null,null,null,null,null,null,null,null,null,null,null,null,0]
[{"$f":"IF(Prezentace!A100=0,\"\",Prezentace!A100)","v":""},{"$f":"IF(Prezentace!B100=0,\"\",Prezentace!B100)","v":""},{"$f":"Prezentace!D100","v":"P"},{"$f":"IF(Prezentace!F100=0,\"\",Prezentace!F100)","v":""},{"$f":"IF(Prezentace!E100=0,\"\",Prezentace!E100)","v":""},null,null,null,null,null,null,null,null,null,null,null,null,null,null,null,null,0]
[{"$f":"IF(Prezentace!A101=0,\"\",Prezentace!A101)","v":""},{"$f":"IF(Prezentace!B101=0,\"\",Prezentace!B101)","v":""},{"$f":"Prezentace!D101","v":"P"},{"$f":"IF(Prezentace!F101=0,\"\",Prezentace!F101)","v":""},{"$f":"IF(Prezentace!E101=0,\"\",Prezentace!E101)","v":""},null,null,null,null,null,null,null,null,null,null,null,null,null,null,null,null,0]
[{"$f":"IF(Prezentace!A102=0,\"\",Prezentace!A102)","v":""},{"$f":"IF(Prezentace!B102=0,\"\",Prezentace!B102)","v":""},{"$f":"Prezentace!D102","v":"P"},{"$f":"IF(Prezentace!F102=0,\"\",Prezentace!F102)","v":""},{"$f":"IF(Prezentace!E102=0,\"\",Prezentace!E102)","v":""},null,null,null,null,null,null,null,null,null,null,null,null,null,null,null,null,0]
[{"$f":"IF(Prezentace!A103=0,\"\",Prezentace!A103)","v":""},{"$f":"IF(Prezentace!B103=0,\"\",Prezentace!B103)","v":""},{"$f":"Prezentace!D103","v":"P"},{"$f":"IF(Prezentace!F103=0,\"\",Prezentace!F103)","v":""},{"$f":"IF(Prezentace!E103=0,\"\",Prezentace!E103)","v":""},null,null,null,null,null,null,null,null,null,null,null,null,null,null,null,null,0]
[{"$f":"IF(Prezentace!A104=0,\"\",Prezentace!A104)","v":""},{"$f":"IF(Prezentace!B104=0,\"\",Prezentace!B104)","v":""},{"$f":"Prezentace!D104","v":"P"},{"$f":"IF(Prezentace!F104=0,\"\",Prezentace!F104)","v":""},{"$f":"IF(Prezentace!E104=0,\"\",Prezentace!E104)","v":""},null,null,null,null,null,null,null,null,null,null,null,null,null,null,null,null,{"$f":"(SUM(F102:T102))-U102","v":0}]

{"sheet":"4(M)","index":9,"n_rows":102,"n_cols":20,"rows_kept":102,"cut":false,"hidden":true,"merged":[[0,3,0,18],[0,0,2,0],[0,1,2,1]]}
["Druž.","Kap.",null,"Disciplina 4"]
[]
[null,null,null,null,null,0,1,2,3,4,5,6,7,8,9,10,12,15,"Čas","Součet"]
[{"$f":"IF(Prezentace!A6=0,\"\",Prezentace!A6)","v":""},{"$f":"IF(Prezentace!B6=0,\"\",Prezentace!B6)","v":""},{"$f":"Prezentace!D6","v":"P"},{"$f":"IF(Prezentace!F6=0,\"\",Prezentace!F6)","v":"Martin"},{"$f":"IF(Prezentace!E6=0,\"\",Prezentace!E6)","v":"Adensam "},null,null,null,null,null,null,null,null,null,null,null,null,null,null,{"$f":"(SUM(F4*$F$3,G4*$G$3,H4*$H$3,I4*$I$3,J4*$J$3,K4*$K$3,L4*$L$3,M4*$M$3,N4*$N$3,O4*$O$3,P4*$P$3,Q4*$Q$3,R4*$R$3))-S4","v":0}]
[{"$f":"IF(Prezentace!A7=0,\"\",Prezentace!A7)","v":""},{"$f":"IF(Prezentace!B7=0,\"\",Prezentace!B7)","v":""},{"$f":"Prezentace!D7","v":"R"},{"$f":"IF(Prezentace!F7=0,\"\",Prezentace!F7)","v":"Martin"},{"$f":"IF(Prezentace!E7=0,\"\",Prezentace!E7)","v":"Adensam"},null,null,null,null,null,null,null,null,null,null,null,null,null,null,{"$f":"(SUM(F5*$F$3,G5*$G$3,H5*$H$3,I5*$I$3,J5*$J$3,K5*$K$3,L5*$L$3,M5*$M$3,N5*$N$3,O5*$O$3,P5*$P$3,Q5*$Q$3,R5*$R$3))-S5","v":0}]
[{"$f":"IF(Prezentace!A8=0,\"\",Prezentace!A8)","v":""},{"$f":"IF(Prezentace!B8=0,\"\",Prezentace!B8)","v":""},{"$f":"Prezentace!D8","v":"P"},{"$f":"IF(Prezentace!F8=0,\"\",Prezentace!F8)","v":"Jaroslav"},{"$f":"IF(Prezentace!E8=0,\"\",Prezentace!E8)","v":"Kostříž "},null,null,null,null,null,null,null,null,null,null,null,null,null,null,0]
[{"$f":"IF(Prezentace!A9=0,\"\",Prezentace!A9)","v":""},{"$f":"IF(Prezentace!B9=0,\"\",Prezentace!B9)","v":""},{"$f":"Prezentace!D9","v":"P"},{"$f":"IF(Prezentace!F9=0,\"\",Prezentace!F9)","v":"Miroslav"},{"$f":"IF(Prezentace!E9=0,\"\",Prezentace!E9)","v":"Koch   ml."},null,null,null,null,null,null,null,null,null,null,null,null,null,null,0]
[{"$f":"IF(Prezentace!A10=0,\"\",Prezentace!A10)","v":""},{"$f":"IF(Prezentace!B10=0,\"\",Prezentace!B10)","v":""},{"$f":"Prezentace!D10","v":"P"},{"$f":"IF(Prezentace!F10=0,\"\",Prezentace!F10)","v":"Miroslav"},{"$f":"IF(Prezentace!E10=0,\"\",Prezentace!E10)","v":"Koch  st. "},null,null,null,null,null,null,null,null,null,null,null,null,null,null,0]
[{"$f":"IF(Prezentace!A11=0,\"\",Prezentace!A11)","v":""},{"$f":"IF(Prezentace!B11=0,\"\",Prezentace!B11)","v":""},{"$f":"Prezentace!D11","v":"P"},{"$f":"IF(Prezentace!F11=0,\"\",Prezentace!F11)","v":"Bohumil"},{"$f":"IF(Prezentace!E11=0,\"\",Prezentace!E11)","v":"Herceg"},null,null,null,null,null,null,null,null,null,null,null,null,null,null,0]
[{"$f":"IF(Prezentace!A12=0,\"\",Prezentace!A12)","v":""},{"$f":"IF(Prezentace!B12=0,\"\",Prezentace!B12)","v":""},{"$f":"Prezentace!D12","v":"P"},{"$f":"IF(Prezentace!F12=0,\"\",Prezentace!F12)","v":"Viktor"},{"$f":"IF(Prezentace!E12=0,\"\",Prezentace!E12)","v":"Fuksa  "},null,null,null,null,null,null,null,null,null,null,null,null,null,null,0]
[{"$f":"IF(Prezentace!A13=0,\"\",Prezentace!A13)","v":""},{"$f":"IF(Prezentace!B13=0,\"\",Prezentace!B13)","v":""},{"$f":"Prezentace!D13","v":"P"},{"$f":"IF(Prezentace!F13=0,\"\",Prezentace!F13)","v":"Milan"},{"$f":"IF(Prezentace!E13=0,\"\",Prezentace!E13)","v":"Matějka  ml."},null,null,null,null,null,null,null,null,null,null,null,null,null,null,0]
[{"$f":"IF(Prezentace!A14=0,\"\",Prezentace!A14)","v":""},{"$f":"IF(Prezentace!B14=0,\"\",Prezentace!B14)","v":""},{"$f":"Prezentace!D14","v":"P"},{"$f":"IF(Prezentace!F14=0,\"\",Prezentace!F14)","v":"Michal"},{"$f":"IF(Prezentace!E14=0,\"\",Prezentace!E14)","v":"Svoboda"},null,null,null,null,null,null,null,null,null,null,null,null,null,null,0]
[{"$f":"IF(Prezentace!A15=0,\"\",Prezentace!A15)","v":""},{"$f":"IF(Prezentace!B15=0,\"\",Prezentace!B15)","v":""},{"$f":"Prezentace!D15","v":"R"},{"$f":"IF(Prezentace!F15=0,\"\",Prezentace!F15)","v":"Lukáš"},{"$f":"IF(Prezentace!E15=0,\"\",Prezentace!E15)","v":"Bouda "},null,null,null,null,null,null,null,null,null,null,null,null,null,null,0]
[{"$f":"IF(Prezentace!A16=0,\"\",Prezentace!A16)","v":""},{"$f":"IF(Prezentace!B16=0,\"\",Prezentace!B16)","v":""},{"$f":"Prezentace!D16","v":"P"},{"$f":"IF(Prezentace!F16=0,\"\",Prezentace!F16)","v":"Lukáš"},{"$f":"IF(Prezentace!E16=0,\"\",Prezentace!E16)","v":"Bouda "},null,null,null,null,null,null,null,null,null,null,null,null,null,null,0]
[{"$f":"IF(Prezentace!A17=0,\"\",Prezentace!A17)","v":""},{"$f":"IF(Prezentace!B17=0,\"\",Prezentace!B17)","v":""},{"$f":"Prezentace!D17","v":"P"},{"$f":"IF(Prezentace!F17=0,\"\",Prezentace!F17)","v":"Pavel"},{"$f":"IF(Prezentace!E17=0,\"\",Prezentace!E17)","v":"Koltai"},null,null,null,null,null,null,null,null,null,null,null,null,null,null,0]
[{"$f":"IF(Prezentace!A18=0,\"\",Prezentace!A18)","v":""},{"$f":"IF(Prezentace!B18=0,\"\",Prezentace!B18)","v":""},{"$f":"Prezentace!D18","v":"P"},{"$f":"IF(Prezentace!F18=0,\"\",Prezentace!F18)","v":"Vladislav"},{"$f":"IF(Prezentace!E18=0,\"\",Prezentace!E18)","v":"Přibyl"},null,null,null,null,null,null,null,null,null,null,null,null,null,null,0]
[{"$f":"IF(Prezentace!A19=0,\"\",Prezentace!A19)","v":""},{"$f":"IF(Prezentace!B19=0,\"\",Prezentace!B19)","v":""},{"$f":"Prezentace!D19","v":"P"},{"$f":"IF(Prezentace!F19=0,\"\",Prezentace!F19)","v":"Milan"},{"$f":"IF(Prezentace!E19=0,\"\",Prezentace!E19)","v":"Matějka st."},null,null,null,null,null,null,null,null,null,null,null,null,null,null,0]
[{"$f":"IF(Prezentace!A20=0,\"\",Prezentace!A20)","v":""},{"$f":"IF(Prezentace!B20=0,\"\",Prezentace!B20)","v":""},{"$f":"Prezentace!D20","v":"P"},{"$f":"IF(Prezentace!F20=0,\"\",Prezentace!F20)","v":"Miroslav"},{"$f":"IF(Prezentace!E20=0,\"\",Prezentace!E20)","v":"Fiala  "},null,null,null,null,null,null,null,null,null,null,null,null,null,null,0]
[{"$f":"IF(Prezentace!A21=0,\"\",Prezentace!A21)","v":""},{"$f":"IF(Prezentace!B21=0,\"\",Prezentace!B21)","v":""},{"$f":"Prezentace!D21","v":"P"},{"$f":"IF(Prezentace!F21=0,\"\",Prezentace!F21)","v":"Karel"},{"$f":"IF(Prezentace!E21=0,\"\",Prezentace!E21)","v":"Gažák "},null,null,null,null,null,null,null,null,null,null,null,null,null,null,0]
[{"$f":"IF(Prezentace!A22=0,\"\",Prezentace!A22)","v":""},{"$f":"IF(Prezentace!B22=0,\"\",Prezentace!B22)","v":""},{"$f":"Prezentace!D22","v":"P"},{"$f":"IF(Prezentace!F22=0,\"\",Prezentace!F22)","v":"Václav"},{"$f":"IF(Prezentace!E22=0,\"\",Prezentace!E22)","v":"Landkammer"},null,null,null,null,null,null,null,null,null,null,null,null,null,null,0]
[{"$f":"IF(Prezentace!A23=0,\"\",Prezentace!A23)","v":""},{"$f":"IF(Prezentace!B23=0,\"\",Prezentace!B23)","v":""},{"$f":"Prezentace!D23","v":"P"},{"$f":"IF(Prezentace!F23=0,\"\",Prezentace!F23)","v":"Vojtěch"},{"$f":"IF(Prezentace!E23=0,\"\",Prezentace!E23)","v":"Brejžek "},null,null,null,null,null,null,null,null,null,null,null,null,null,null,0]
[{"$f":"IF(Prezentace!A24=0,\"\",Prezentace!A24)","v":""},{"$f":"IF(Prezentace!B24=0,\"\",Prezentace!B24)","v":""},{"$f":"Prezentace!D24","v":"P"},{"$f":"IF(Prezentace!F24=0,\"\",Prezentace!F24)","v":"Antonín"},{"$f":"IF(Prezentace!E24=0,\"\",Prezentace!E24)","v":"Urbanec  "},null,null,null,null,null,null,null,null,null,null,null,null,null,null,0]
[{"$f":"IF(Prezentace!A25=0,\"\",Prezentace!A25)","v":""},{"$f":"IF(Prezentace!B25=0,\"\",Prezentace!B25)","v":""},{"$f":"Prezentace!D25","v":"P"},{"$f":"IF(Prezentace!F25=0,\"\",Prezentace!F25)","v":"Milan"},{"$f":"IF(Prezentace!E25=0,\"\",Prezentace!E25)","v":"Jílek  "},null,null,null,null,null,null,null,null,null,null,null,null,null,null,0]
[{"$f":"IF(Prezentace!A26=0,\"\",Prezentace!A26)","v":""},{"$f":"IF(Prezentace!B26=0,\"\",Prezentace!B26)","v":""},{"$f":"Prezentace!D26","v":"P"},{"$f":"IF(Prezentace!F26=0,\"\",Prezentace!F26)","v":"Václav"},{"$f":"IF(Prezentace!E26=0,\"\",Prezentace!E26)","v":"Jírů"},null,null,null,null,null,null,null,null,null,null,null,null,null,null,0]
[{"$f":"IF(Prezentace!A27=0,\"\",Prezentace!A27)","v":""},{"$f":"IF(Prezentace!B27=0,\"\",Prezentace!B27)","v":""},{"$f":"Prezentace!D27","v":"P"},{"$f":"IF(Prezentace!F27=0,\"\",Prezentace!F27)","v":"Milan"},{"$f":"IF(Prezentace!E27=0,\"\",Prezentace!E27)","v":"Krupica"},null,null,null,null,null,null,null,null,null,null,null,null,null,null,0]
[{"$f":"IF(Prezentace!A28=0,\"\",Prezentace!A28)","v":""},{"$f":"IF(Prezentace!B28=0,\"\",Prezentace!B28)","v":""},{"$f":"Prezentace!D28","v":"R"},{"$f":"IF(Prezentace!F28=0,\"\",Prezentace!F28)","v":"Milan"},{"$f":"IF(Prezentace!E28=0,\"\",Prezentace!E28)","v":"Krupica "},null,null,null,null,null,null,null,null,null,null,null,null,null,null,0]
[{"$f":"IF(Prezentace!A29=0,\"\",Prezentace!A29)","v":""},{"$f":"IF(Prezentace!B29=0,\"\",Prezentace!B29)","v":""},{"$f":"Prezentace!D29","v":"P"},{"$f":"IF(Prezentace!F29=0,\"\",Prezentace!F29)","v":"Miloslav"},{"$f":"IF(Prezentace!E29=0,\"\",Prezentace!E29)","v":"Petržílka"},null,null,null,null,null,null,null,null,null,null,null,null,null,null,0]
[{"$f":"IF(Prezentace!A30=0,\"\",Prezentace!A30)","v":""},{"$f":"IF(Prezentace!B30=0,\"\",Prezentace!B30)","v":""},{"$f":"Prezentace!D30","v":"R"},{"$f":"IF(Prezentace!F30=0,\"\",Prezentace!F30)","v":"Aleš"},{"$f":"IF(Prezentace!E30=0,\"\",Prezentace!E30)","v":"Seitl "},null,null,null,null,null,null,null,null,null,null,null,null,null,null,0]
[{"$f":"IF(Prezentace!A31=0,\"\",Prezentace!A31)","v":""},{"$f":"IF(Prezentace!B31=0,\"\",Prezentace!B31)","v":""},{"$f":"Prezentace!D31","v":"P"},{"$f":"IF(Prezentace!F31=0,\"\",Prezentace!F31)","v":"Aleš"},{"$f":"IF(Prezentace!E31=0,\"\",Prezentace!E31)","v":"Seitl "},null,null,null,null,null,null,null,null,null,null,null,null,null,null,0]
[{"$f":"IF(Prezentace!A32=0,\"\",Prezentace!A32)","v":""},{"$f":"IF(Prezentace!B32=0,\"\",Prezentace!B32)","v":""},{"$f":"Prezentace!D32","v":"P"},{"$f":"IF(Prezentace!F32=0,\"\",Prezentace!F32)","v":"Karel"},{"$f":"IF(Prezentace!E32=0,\"\",Prezentace!E32)","v":"Seitl"},null,null,null,null,null,null,null,null,null,null,null,null,null,null,0]
[{"$f":"IF(Prezentace!A33=0,\"\",Prezentace!A33)","v":""},{"$f":"IF(Prezentace!B33=0,\"\",Prezentace!B33)","v":""},{"$f":"Prezentace!D33","v":"P"},{"$f":"IF(Prezentace!F33=0,\"\",Prezentace!F33)","v":"David"},{"$f":"IF(Prezentace!E33=0,\"\",Prezentace!E33)","v":"Nikodým"},null,null,null,null,null,null,null,null,null,null,null,null,null,null,0]
[{"$f":"IF(Prezentace!A34=0,\"\",Prezentace!A34)","v":""},{"$f":"IF(Prezentace!B34=0,\"\",Prezentace!B34)","v":""},{"$f":"Prezentace!D34","v":"R"},{"$f":"IF(Prezentace!F34=0,\"\",Prezentace!F34)","v":"David"},{"$f":"IF(Prezentace!E34=0,\"\",Prezentace!E34)","v":"Nikodým "},null,null,null,null,null,null,null,null,null,null,null,null,null,null,0]
[{"$f":"IF(Prezentace!A35=0,\"\",Prezentace!A35)","v":""},{"$f":"IF(Prezentace!B35=0,\"\",Prezentace!B35)","v":""},{"$f":"Prezentace!D35","v":"P"},{"$f":"IF(Prezentace!F35=0,\"\",Prezentace!F35)","v":"Lukáš"},{"$f":"IF(Prezentace!E35=0,\"\",Prezentace!E35)","v":"Hobza"},null,null,null,null,null,null,null,null,null,null,null,null,null,null,0]
[{"$f":"IF(Prezentace!A36=0,\"\",Prezentace!A36)","v":""},{"$f":"IF(Prezentace!B36=0,\"\",Prezentace!B36)","v":""},{"$f":"Prezentace!D36","v":"P"},{"$f":"IF(Prezentace!F36=0,\"\",Prezentace!F36)","v":"Antonín"},{"$f":"IF(Prezentace!E36=0,\"\",Prezentace!E36)","v":"Jelínek "},null,null,null,null,null,null,null,null,null,null,null,null,null,null,0]
[{"$f":"IF(Prezentace!A37=0,\"\",Prezentace!A37)","v":""},{"$f":"IF(Prezentace!B37=0,\"\",Prezentace!B37)","v":""},{"$f":"Prezentace!D37","v":"R"},{"$f":"IF(Prezentace!F37=0,\"\",Prezentace!F37)","v":"Antonín"},{"$f":"IF(Prezentace!E37=0,\"\",Prezentace!E37)","v":"Jelínek "},null,null,null,null,null,null,null,null,null,null,null,null,null,null,0]
[{"$f":"IF(Prezentace!A38=0,\"\",Prezentace!A38)","v":""},{"$f":"IF(Prezentace!B38=0,\"\",Prezentace!B38)","v":""},{"$f":"Prezentace!D38","v":"P"},{"$f":"IF(Prezentace!F38=0,\"\",Prezentace!F38)","v":"Ladislav"},{"$f":"IF(Prezentace!E38=0,\"\",Prezentace!E38)","v":"Píša "},null,null,null,null,null,null,null,null,null,null,null,null,null,null,0]
[{"$f":"IF(Prezentace!A39=0,\"\",Prezentace!A39)","v":""},{"$f":"IF(Prezentace!B39=0,\"\",Prezentace!B39)","v":""},{"$f":"Prezentace!D39","v":"P"},{"$f":"IF(Prezentace!F39=0,\"\",Prezentace!F39)","v":"Štefan"},{"$f":"IF(Prezentace!E39=0,\"\",Prezentace!E39)","v":"Mesároš"},null,null,null,null,null,null,null,null,null,null,null,null,null,null,0]
[{"$f":"IF(Prezentace!A40=0,\"\",Prezentace!A40)","v":""},{"$f":"IF(Prezentace!B40=0,\"\",Prezentace!B40)","v":""},{"$f":"Prezentace!D40","v":"P"},{"$f":"IF(Prezentace!F40=0,\"\",Prezentace!F40)","v":"Pavel"},{"$f":"IF(Prezentace!E40=0,\"\",Prezentace!E40)","v":"Červenka"},null,null,null,null,null,null,null,null,null,null,null,null,null,null,{"$f":"(SUM(F38*$F$3,G38*$G$3,H38*$H$3,I38*$I$3,J38*$J$3,K38*$K$3,L38*$L$3,M38*$M$3,N38*$N$3,O38*$O$3,P38*$P$3,Q38*$Q$3,R38*$R$3))-S38","v":0}]
[{"$f":"IF(Prezentace!A41=0,\"\",Prezentace!A41)","v":""},{"$f":"IF(Prezentace!B41=0,\"\",Prezentace!B41)","v":""},{"$f":"Prezentace!D41","v":"R"},{"$f":"IF(Prezentace!F41=0,\"\",Prezentace!F41)","v":"Pavel"},{"$f":"IF(Prezentace!E41=0,\"\",Prezentace!E41)","v":"Červenka "},null,null,null,null,null,null,null,null,null,null,null,null,null,null,0]
[{"$f":"IF(Prezentace!A42=0,\"\",Prezentace!A42)","v":""},{"$f":"IF(Prezentace!B42=0,\"\",Prezentace!B42)","v":""},{"$f":"Prezentace!D42","v":"P"},{"$f":"IF(Prezentace!F42=0,\"\",Prezentace!F42)","v":"Jiří"},{"$f":"IF(Prezentace!E42=0,\"\",Prezentace!E42)","v":"Švihálek "},null,null,null,null,null,null,null,null,null,null,null,null,null,null,0]
[{"$f":"IF(Prezentace!A43=0,\"\",Prezentace!A43)","v":""},{"$f":"IF(Prezentace!B43=0,\"\",Prezentace!B43)","v":""},{"$f":"Prezentace!D43","v":"R"},{"$f":"IF(Prezentace!F43=0,\"\",Prezentace!F43)","v":"Jiří"},{"$f":"IF(Prezentace!E43=0,\"\",Prezentace!E43)","v":"Švihálek "},null,null,null,null,null,null,null,null,null,null,null,null,null,null,0]
[{"$f":"IF(Prezentace!A44=0,\"\",Prezentace!A44)","v":""},{"$f":"IF(Prezentace!B44=0,\"\",Prezentace!B44)","v":""},{"$f":"Prezentace!D44","v":"P"},{"$f":"IF(Prezentace!F44=0,\"\",Prezentace!F44)","v":"František"},{"$f":"IF(Prezentace!E44=0,\"\",Prezentace!E44)","v":"Toman "},null,null,null,null,null,null,null,null,null,null,null,null,null,null,0]
[{"$f":"IF(Prezentace!A45=0,\"\",Prezentace!A45)","v":""},{"$f":"IF(Prezentace!B45=0,\"\",Prezentace!B45)","v":""},{"$f":"Prezentace!D45","v":"P"},{"$f":"IF(Prezentace!F45=0,\"\",Prezentace!F45)","v":"Vladimír"},{"$f":"IF(Prezentace!E45=0,\"\",Prezentace!E45)","v":"VejslíK "},null,null,null,null,null,null,null,null,null,null,null,null,null,null,0]
[{"$f":"IF(Prezentace!A46=0,\"\",Prezentace!A46)","v":""},{"$f":"IF(Prezentace!B46=0,\"\",Prezentace!B46)","v":""},{"$f":"Prezentace!D46","v":"P"},{"$f":"IF(Prezentace!F46=0,\"\",Prezentace!F46)","v":"Karel"},{"$f":"IF(Prezentace!E46=0,\"\",Prezentace!E46)","v":"Získal "},null,null,null,null,null,null,null,null,null,null,null,null,null,null,0]
[{"$f":"IF(Prezentace!A47=0,\"\",Prezentace!A47)","v":""},{"$f":"IF(Prezentace!B47=0,\"\",Prezentace!B47)","v":""},{"$f":"Prezentace!D47","v":"R"},{"$f":"IF(Prezentace!F47=0,\"\",Prezentace!F47)","v":"Karel"},{"$f":"IF(Prezentace!E47=0,\"\",Prezentace!E47)","v":"Získal "},null,null,null,null,null,null,null,null,null,null,null,null,null,null,0]
[{"$f":"IF(Prezentace!A48=0,\"\",Prezentace!A48)","v":""},{"$f":"IF(Prezentace!B48=0,\"\",Prezentace!B48)","v":""},{"$f":"Prezentace!D48","v":"P"},{"$f":"IF(Prezentace!F48=0,\"\",Prezentace!F48)","v":"Jaroslav"},{"$f":"IF(Prezentace!E48=0,\"\",Prezentace!E48)","v":"Sokolík "},null,null,null,null,null,null,null,null,null,null,null,null,null,null,0]
[{"$f":"IF(Prezentace!A49=0,\"\",Prezentace!A49)","v":""},{"$f":"IF(Prezentace!B49=0,\"\",Prezentace!B49)","v":""},{"$f":"Prezentace!D49","v":"P"},{"$f":"IF(Prezentace!F49=0,\"\",Prezentace!F49)","v":"Milan"},{"$f":"IF(Prezentace!E49=0,\"\",Prezentace!E49)","v":"Kraus "},null,null,null,null,null,null,null,null,null,null,null,null,null,null,0]
[{"$f":"IF(Prezentace!A50=0,\"\",Prezentace!A50)","v":""},{"$f":"IF(Prezentace!B50=0,\"\",Prezentace!B50)","v":""},{"$f":"Prezentace!D50","v":"P"},{"$f":"IF(Prezentace!F50=0,\"\",Prezentace!F50)","v":""},{"$f":"IF(Prezentace!E50=0,\"\",Prezentace!E50)","v":""},null,null,null,null,null,null,null,null,null,null,null,null,null,null,0]
[{"$f":"IF(Prezentace!A51=0,\"\",Prezentace!A51)","v":""},{"$f":"IF(Prezentace!B51=0,\"\",Prezentace!B51)","v":""},{"$f":"Prezentace!D51","v":"P"},{"$f":"IF(Prezentace!F51=0,\"\",Prezentace!F51)","v":""},{"$f":"IF(Prezentace!E51=0,\"\",Prezentace!E51)","v":""},null,null,null,null,null,null,null,null,null,null,null,null,null,null,0]
[{"$f":"IF(Prezentace!A52=0,\"\",Prezentace!A52)","v":""},{"$f":"IF(Prezentace!B52=0,\"\",Prezentace!B52)","v":""},{"$f":"Prezentace!D52","v":"P"},{"$f":"IF(Prezentace!F52=0,\"\",Prezentace!F52)","v":""},{"$f":"IF(Prezentace!E52=0,\"\",Prezentace!E52)","v":""},null,null,null,null,null,null,null,null,null,null,null,null,null,null,0]
[{"$f":"IF(Prezentace!A53=0,\"\",Prezentace!A53)","v":""},{"$f":"IF(Prezentace!B53=0,\"\",Prezentace!B53)","v":""},{"$f":"Prezentace!D53","v":"P"},{"$f":"IF(Prezentace!F53=0,\"\",Prezentace!F53)","v":""},{"$f":"IF(Prezentace!E53=0,\"\",Prezentace!E53)","v":""},null,null,null,null,null,null,null,null,null,null,null,null,null,null,0]
[{"$f":"IF(Prezentace!A54=0,\"\",Prezentace!A54)","v":""},{"$f":"IF(Prezentace!B54=0,\"\",Prezentace!B54)","v":""},{"$f":"Prezentace!D54","v":"P"},{"$f":"IF(Prezentace!F54=0,\"\",Prezentace!F54)","v":""},{"$f":"IF(Prezentace!E54=0,\"\",Prezentace!E54)","v":""},null,null,null,null,null,null,null,null,null,null,null,null,null,null,0]
[{"$f":"IF(Prezentace!A55=0,\"\",Prezentace!A55)","v":""},{"$f":"IF(Prezentace!B55=0,\"\",Prezentace!B55)","v":""},{"$f":"Prezentace!D55","v":"P"},{"$f":"IF(Prezentace!F55=0,\"\",Prezentace!F55)","v":""},{"$f":"IF(Prezentace!E55=0,\"\",Prezentace!E55)","v":""},null,null,null,null,null,null,null,null,null,null,null,null,null,null,0]
[{"$f":"IF(Prezentace!A56=0,\"\",Prezentace!A56)","v":""},{"$f":"IF(Prezentace!B56=0,\"\",Prezentace!B56)","v":""},{"$f":"Prezentace!D56","v":"P"},{"$f":"IF(Prezentace!F56=0,\"\",Prezentace!F56)","v":""},{"$f":"IF(Prezentace!E56=0,\"\",Prezentace!E56)","v":""},null,null,null,null,null,null,null,null,null,null,null,null,null,null,0]
[{"$f":"IF(Prezentace!A57=0,\"\",Prezentace!A57)","v":""},{"$f":"IF(Prezentace!B57=0,\"\",Prezentace!B57)","v":""},{"$f":"Prezentace!D57","v":"P"},{"$f":"IF(Prezentace!F57=0,\"\",Prezentace!F57)","v":""},{"$f":"IF(Prezentace!E57=0,\"\",Prezentace!E57)","v":""},null,null,null,null,null,null,null,null,null,null,null,null,null,null,0]
[{"$f":"IF(Prezentace!A58=0,\"\",Prezentace!A58)","v":""},{"$f":"IF(Prezentace!B58=0,\"\",Prezentace!B58)","v":""},{"$f":"Prezentace!D58","v":"P"},{"$f":"IF(Prezentace!F58=0,\"\",Prezentace!F58)","v":""},{"$f":"IF(Prezentace!E58=0,\"\",Prezentace!E58)","v":""},null,null,null,null,null,null,null,null,null,null,null,null,null,null,0]
[{"$f":"IF(Prezentace!A59=0,\"\",Prezentace!A59)","v":""},{"$f":"IF(Prezentace!B59=0,\"\",Prezentace!B59)","v":""},{"$f":"Prezentace!D59","v":"P"},{"$f":"IF(Prezentace!F59=0,\"\",Prezentace!F59)","v":""},{"$f":"IF(Prezentace!E59=0,\"\",Prezentace!E59)","v":""},null,null,null,null,null,null,null,null,null,null,null,null,null,null,0]
[{"$f":"IF(Prezentace!A60=0,\"\",Prezentace!A60)","v":""},{"$f":"IF(Prezentace!B60=0,\"\",Prezentace!B60)","v":""},{"$f":"Prezentace!D60","v":"P"},{"$f":"IF(Prezentace!F60=0,\"\",Prezentace!F60)","v":""},{"$f":"IF(Prezentace!E60=0,\"\",Prezentace!E60)","v":""},null,null,null,null,null,null,null,null,null,null,null,null,null,null,0]
[{"$f":"IF(Prezentace!A61=0,\"\",Prezentace!A61)","v":""},{"$f":"IF(Prezentace!B61=0,\"\",Prezentace!B61)","v":""},{"$f":"Prezentace!D61","v":"P"},{"$f":"IF(Prezentace!F61=0,\"\",Prezentace!F61)","v":""},{"$f":"IF(Prezentace!E61=0,\"\",Prezentace!E61)","v":""},null,null,null,null,null,null,null,null,null,null,null,null,null,null,0]
[{"$f":"IF(Prezentace!A62=0,\"\",Prezentace!A62)","v":""},{"$f":"IF(Prezentace!B62=0,\"\",Prezentace!B62)","v":""},{"$f":"Prezentace!D62","v":"P"},{"$f":"IF(Prezentace!F62=0,\"\",Prezentace!F62)","v":""},{"$f":"IF(Prezentace!E62=0,\"\",Prezentace!E62)","v":""},null,null,null,null,null,null,null,null,null,null,null,null,null,null,0]
[{"$f":"IF(Prezentace!A63=0,\"\",Prezentace!A63)","v":""},{"$f":"IF(Prezentace!B63=0,\"\",Prezentace!B63)","v":""},{"$f":"Prezentace!D63","v":"P"},{"$f":"IF(Prezentace!F63=0,\"\",Prezentace!F63)","v":""},{"$f":"IF(Prezentace!E63=0,\"\",Prezentace!E63)","v":""},null,null,null,null,null,null,null,null,null,null,null,null,null,null,0]
[{"$f":"IF(Prezentace!A64=0,\"\",Prezentace!A64)","v":""},{"$f":"IF(Prezentace!B64=0,\"\",Prezentace!B64)","v":""},{"$f":"Prezentace!D64","v":"P"},{"$f":"IF(Prezentace!F64=0,\"\",Prezentace!F64)","v":""},{"$f":"IF(Prezentace!E64=0,\"\",Prezentace!E64)","v":""},null,null,null,null,null,null,null,null,null,null,null,null,null,null,0]
[{"$f":"IF(Prezentace!A65=0,\"\",Prezentace!A65)","v":""},{"$f":"IF(Prezentace!B65=0,\"\",Prezentace!B65)","v":""},{"$f":"Prezentace!D65","v":"P"},{"$f":"IF(Prezentace!F65=0,\"\",Prezentace!F65)","v":""},{"$f":"IF(Prezentace!E65=0,\"\",Prezentace!E65)","v":""},null,null,null,null,null,null,null,null,null,null,null,null,null,null,0]
[{"$f":"IF(Prezentace!A66=0,\"\",Prezentace!A66)","v":""},{"$f":"IF(Prezentace!B66=0,\"\",Prezentace!B66)","v":""},{"$f":"Prezentace!D66","v":"P"},{"$f":"IF(Prezentace!F66=0,\"\",Prezentace!F66)","v":""},{"$f":"IF(Prezentace!E66=0,\"\",Prezentace!E66)","v":""},null,null,null,null,null,null,null,null,null,null,null,null,null,null,0]
[{"$f":"IF(Prezentace!A67=0,\"\",Prezentace!A67)","v":""},{"$f":"IF(Prezentace!B67=0,\"\",Prezentace!B67)","v":""},{"$f":"Prezentace!D67","v":"P"},{"$f":"IF(Prezentace!F67=0,\"\",Prezentace!F67)","v":""},{"$f":"IF(Prezentace!E67=0,\"\",Prezentace!E67)","v":""},null,null,null,null,null,null,null,null,null,null,null,null,null,null,0]
[{"$f":"IF(Prezentace!A68=0,\"\",Prezentace!A68)","v":""},{"$f":"IF(Prezentace!B68=0,\"\",Prezentace!B68)","v":""},{"$f":"Prezentace!D68","v":"P"},{"$f":"IF(Prezentace!F68=0,\"\",Prezentace!F68)","v":""},{"$f":"IF(Prezentace!E68=0,\"\",Prezentace!E68)","v":""},null,null,null,null,null,null,null,null,null,null,null,null,null,null,0]
[{"$f":"IF(Prezentace!A69=0,\"\",Prezentace!A69)","v":""},{"$f":"IF(Prezentace!B69=0,\"\",Prezentace!B69)","v":""},{"$f":"Prezentace!D69","v":"P"},{"$f":"IF(Prezentace!F69=0,\"\",Prezentace!F69)","v":""},{"$f":"IF(Prezentace!E69=0,\"\",Prezentace!E69)","v":""},null,null,null,null,null,null,null,null,null,null,null,null,null,null,0]
[{"$f":"IF(Prezentace!A70=0,\"\",Prezentace!A70)","v":""},{"$f":"IF(Prezentace!B70=0,\"\",Prezentace!B70)","v":""},{"$f":"Prezentace!D70","v":"P"},{"$f":"IF(Prezentace!F70=0,\"\",Prezentace!F70)","v":""},{"$f":"IF(Prezentace!E70=0,\"\",Prezentace!E70)","v":""},null,null,null,null,null,null,null,null,null,null,null,null,null,null,0]
[{"$f":"IF(Prezentace!A71=0,\"\",Prezentace!A71)","v":""},{"$f":"IF(Prezentace!B71=0,\"\",Prezentace!B71)","v":""},{"$f":"Prezentace!D71","v":"P"},{"$f":"IF(Prezentace!F71=0,\"\",Prezentace!F71)","v":""},{"$f":"IF(Prezentace!E71=0,\"\",Prezentace!E71)","v":""},null,null,null,null,null,null,null,null,null,null,null,null,null,null,0]
[{"$f":"IF(Prezentace!A72=0,\"\",Prezentace!A72)","v":""},{"$f":"IF(Prezentace!B72=0,\"\",Prezentace!B72)","v":""},{"$f":"Prezentace!D72","v":"P"},{"$f":"IF(Prezentace!F72=0,\"\",Prezentace!F72)","v":""},{"$f":"IF(Prezentace!E72=0,\"\",Prezentace!E72)","v":""},null,null,null,null,null,null,null,null,null,null,null,null,null,null,0]
[{"$f":"IF(Prezentace!A73=0,\"\",Prezentace!A73)","v":""},{"$f":"IF(Prezentace!B73=0,\"\",Prezentace!B73)","v":""},{"$f":"Prezentace!D73","v":"P"},{"$f":"IF(Prezentace!F73=0,\"\",Prezentace!F73)","v":""},{"$f":"IF(Prezentace!E73=0,\"\",Prezentace!E73)","v":""},null,null,null,null,null,null,null,null,null,null,null,null,null,null,0]
[{"$f":"IF(Prezentace!A74=0,\"\",Prezentace!A74)","v":""},{"$f":"IF(Prezentace!B74=0,\"\",Prezentace!B74)","v":""},{"$f":"Prezentace!D74","v":"P"},{"$f":"IF(Prezentace!F74=0,\"\",Prezentace!F74)","v":""},{"$f":"IF(Prezentace!E74=0,\"\",Prezentace!E74)","v":""},null,null,null,null,null,null,null,null,null,null,null,null,null,null,0]
[{"$f":"IF(Prezentace!A75=0,\"\",Prezentace!A75)","v":""},{"$f":"IF(Prezentace!B75=0,\"\",Prezentace!B75)","v":""},{"$f":"Prezentace!D75","v":"P"},{"$f":"IF(Prezentace!F75=0,\"\",Prezentace!F75)","v":""},{"$f":"IF(Prezentace!E75=0,\"\",Prezentace!E75)","v":""},null,null,null,null,null,null,null,null,null,null,null,null,null,null,0]
[{"$f":"IF(Prezentace!A76=0,\"\",Prezentace!A76)","v":""},{"$f":"IF(Prezentace!B76=0,\"\",Prezentace!B76)","v":""},{"$f":"Prezentace!D76","v":"P"},{"$f":"IF(Prezentace!F76=0,\"\",Prezentace!F76)","v":""},{"$f":"IF(Prezentace!E76=0,\"\",Prezentace!E76)","v":""},null,null,null,null,null,null,null,null,null,null,null,null,null,null,0]
[{"$f":"IF(Prezentace!A77=0,\"\",Prezentace!A77)","v":""},{"$f":"IF(Prezentace!B77=0,\"\",Prezentace!B77)","v":""},{"$f":"Prezentace!D77","v":"P"},{"$f":"IF(Prezentace!F77=0,\"\",Prezentace!F77)","v":""},{"$f":"IF(Prezentace!E77=0,\"\",Prezentace!E77)","v":""},null,null,null,null,null,null,null,null,null,null,null,null,null,null,0]
[{"$f":"IF(Prezentace!A78=0,\"\",Prezentace!A78)","v":""},{"$f":"IF(Prezentace!B78=0,\"\",Prezentace!B78)","v":""},{"$f":"Prezentace!D78","v":"P"},{"$f":"IF(Prezentace!F78=0,\"\",Prezentace!F78)","v":""},{"$f":"IF(Prezentace!E78=0,\"\",Prezentace!E78)","v":""},null,null,null,null,null,null,null,null,null,null,null,null,null,null,0]
[{"$f":"IF(Prezentace!A79=0,\"\",Prezentace!A79)","v":""},{"$f":"IF(Prezentace!B79=0,\"\",Prezentace!B79)","v":""},{"$f":"Prezentace!D79","v":"P"},{"$f":"IF(Prezentace!F79=0,\"\",Prezentace!F79)","v":""},{"$f":"IF(Prezentace!E79=0,\"\",Prezentace!E79)","v":""},null,null,null,null,null,null,null,null,null,null,null,null,null,null,0]
[{"$f":"IF(Prezentace!A80=0,\"\",Prezentace!A80)","v":""},{"$f":"IF(Prezentace!B80=0,\"\",Prezentace!B80)","v":""},{"$f":"Prezentace!D80","v":"P"},{"$f":"IF(Prezentace!F80=0,\"\",Prezentace!F80)","v":""},{"$f":"IF(Prezentace!E80=0,\"\",Prezentace!E80)","v":""},null,null,null,null,null,null,null,null,null,null,null,null,null,null,0]
[{"$f":"IF(Prezentace!A81=0,\"\",Prezentace!A81)","v":""},{"$f":"IF(Prezentace!B81=0,\"\",Prezentace!B81)","v":""},{"$f":"Prezentace!D81","v":"P"},{"$f":"IF(Prezentace!F81=0,\"\",Prezentace!F81)","v":""},{"$f":"IF(Prezentace!E81=0,\"\",Prezentace!E81)","v":""},null,null,null,null,null,null,null,null,null,null,null,null,null,null,0]
[{"$f":"IF(Prezentace!A82=0,\"\",Prezentace!A82)","v":""},{"$f":"IF(Prezentace!B82=0,\"\",Prezentace!B82)","v":""},{"$f":"Prezentace!D82","v":"P"},{"$f":"IF(Prezentace!F82=0,\"\",Prezentace!F82)","v":""},{"$f":"IF(Prezentace!E82=0,\"\",Prezentace!E82)","v":""},null,null,null,null,null,null,null,null,null,null,null,null,null,null,0]
[{"$f":"IF(Prezentace!A83=0,\"\",Prezentace!A83)","v":""},{"$f":"IF(Prezentace!B83=0,\"\",Prezentace!B83)","v":""},{"$f":"Prezentace!D83","v":"P"},{"$f":"IF(Prezentace!F83=0,\"\",Prezentace!F83)","v":""},{"$f":"IF(Prezentace!E83=0,\"\",Prezentace!E83)","v":""},null,null,null,null,null,null,null,null,null,null,null,null,null,null,0]
[{"$f":"IF(Prezentace!A84=0,\"\",Prezentace!A84)","v":""},{"$f":"IF(Prezentace!B84=0,\"\",Prezentace!B84)","v":""},{"$f":"Prezentace!D84","v":"P"},{"$f":"IF(Prezentace!F84=0,\"\",Prezentace!F84)","v":""},{"$f":"IF(Prezentace!E84=0,\"\",Prezentace!E84)","v":""},null,null,null,null,null,null,null,null,null,null,null,null,null,null,0]
[{"$f":"IF(Prezentace!A85=0,\"\",Prezentace!A85)","v":""},{"$f":"IF(Prezentace!B85=0,\"\",Prezentace!B85)","v":""},{"$f":"Prezentace!D85","v":"P"},{"$f":"IF(Prezentace!F85=0,\"\",Prezentace!F85)","v":""},{"$f":"IF(Prezentace!E85=0,\"\",Prezentace!E85)","v":""},null,null,null,null,null,null,null,null,null,null,null,null,null,null,0]
[{"$f":"IF(Prezentace!A86=0,\"\",Prezentace!A86)","v":""},{"$f":"IF(Prezentace!B86=0,\"\",Prezentace!B86)","v":""},{"$f":"Prezentace!D86","v":"P"},{"$f":"IF(Prezentace!F86=0,\"\",Prezentace!F86)","v":""},{"$f":"IF(Prezentace!E86=0,\"\",Prezentace!E86)","v":""},null,null,null,null,null,null,null,null,null,null,null,null,null,null,0]
[{"$f":"IF(Prezentace!A87=0,\"\",Prezentace!A87)","v":""},{"$f":"IF(Prezentace!B87=0,\"\",Prezentace!B87)","v":""},{"$f":"Prezentace!D87","v":"P"},{"$f":"IF(Prezentace!F87=0,\"\",Prezentace!F87)","v":""},{"$f":"IF(Prezentace!E87=0,\"\",Prezentace!E87)","v":""},null,null,null,null,null,null,null,null,null,null,null,null,null,null,0]
[{"$f":"IF(Prezentace!A88=0,\"\",Prezentace!A88)","v":""},{"$f":"IF(Prezentace!B88=0,\"\",Prezentace!B88)","v":""},{"$f":"Prezentace!D88","v":"P"},{"$f":"IF(Prezentace!F88=0,\"\",Prezentace!F88)","v":""},{"$f":"IF(Prezentace!E88=0,\"\",Prezentace!E88)","v":""},null,null,null,null,null,null,null,null,null,null,null,null,null,null,0]
[{"$f":"IF(Prezentace!A89=0,\"\",Prezentace!A89)","v":""},{"$f":"IF(Prezentace!B89=0,\"\",Prezentace!B89)","v":""},{"$f":"Prezentace!D89","v":"P"},{"$f":"IF(Prezentace!F89=0,\"\",Prezentace!F89)","v":""},{"$f":"IF(Prezentace!E89=0,\"\",Prezentace!E89)","v":""},null,null,null,null,null,null,null,null,null,null,null,null,null,null,0]
[{"$f":"IF(Prezentace!A90=0,\"\",Prezentace!A90)","v":""},{"$f":"IF(Prezentace!B90=0,\"\",Prezentace!B90)","v":""},{"$f":"Prezentace!D90","v":"P"},{"$f":"IF(Prezentace!F90=0,\"\",Prezentace!F90)","v":""},{"$f":"IF(Prezentace!E90=0,\"\",Prezentace!E90)","v":""},null,null,null,null,null,null,null,null,null,null,null,null,null,null,0]
[{"$f":"IF(Prezentace!A91=0,\"\",Prezentace!A91)","v":""},{"$f":"IF(Prezentace!B91=0,\"\",Prezentace!B91)","v":""},{"$f":"Prezentace!D91","v":"P"},{"$f":"IF(Prezentace!F91=0,\"\",Prezentace!F91)","v":""},{"$f":"IF(Prezentace!E91=0,\"\",Prezentace!E91)","v":""},null,null,null,null,null,null,null,null,null,null,null,null,null,null,0]
[{"$f":"IF(Prezentace!A92=0,\"\",Prezentace!A92)","v":""},{"$f":"IF(Prezentace!B92=0,\"\",Prezentace!B92)","v":""},{"$f":"Prezentace!D92","v":"P"},{"$f":"IF(Prezentace!F92=0,\"\",Prezentace!F92)","v":""},{"$f":"IF(Prezentace!E92=0,\"\",Prezentace!E92)","v":""},null,null,null,null,null,null,null,null,null,null,null,null,null,null,0]
[{"$f":"IF(Prezentace!A93=0,\"\",Prezentace!A93)","v":""},{"$f":"IF(Prezentace!B93=0,\"\",Prezentace!B93)","v":""},{"$f":"Prezentace!D93","v":"P"},{"$f":"IF(Prezentace!F93=0,\"\",Prezentace!F93)","v":""},{"$f":"IF(Prezentace!E93=0,\"\",Prezentace!E93)","v":""},null,null,null,null,null,null,null,null,null,null,null,null,null,null,0]
[{"$f":"IF(Prezentace!A94=0,\"\",Prezentace!A94)","v":""},{"$f":"IF(Prezentace!B94=0,\"\",Prezentace!B94)","v":""},{"$f":"Prezentace!D94","v":"P"},{"$f":"IF(Prezentace!F94=0,\"\",Prezentace!F94)","v":""},{"$f":"IF(Prezentace!E94=0,\"\",Prezentace!E94)","v":""},null,null,null,null,null,null,null,null,null,null,null,null,null,null,0]
[{"$f":"IF(Prezentace!A95=0,\"\",Prezentace!A95)","v":""},{"$f":"IF(Prezentace!B95=0,\"\",Prezentace!B95)","v":""},{"$f":"Prezentace!D95","v":"P"},{"$f":"IF(Prezentace!F95=0,\"\",Prezentace!F95)","v":""},{"$f":"IF(Prezentace!E95=0,\"\",Prezentace!E95)","v":""},null,null,null,null,null,null,null,null,null,null,null,null,null,null,0]
[{"$f":"IF(Prezentace!A96=0,\"\",Prezentace!A96)","v":""},{"$f":"IF(Prezentace!B96=0,\"\",Prezentace!B96)","v":""},{"$f":"Prezentace!D96","v":"P"},{"$f":"IF(Prezentace!F96=0,\"\",Prezentace!F96)","v":""},{"$f":"IF(Prezentace!E96=0,\"\",Prezentace!E96)","v":""},null,null,null,null,null,null,null,null,null,null,null,null,null,null,0]
[{"$f":"IF(Prezentace!A97=0,\"\",Prezentace!A97)","v":""},{"$f":"IF(Prezentace!B97=0,\"\",Prezentace!B97)","v":""},{"$f":"Prezentace!D97","v":"P"},{"$f":"IF(Prezentace!F97=0,\"\",Prezentace!F97)","v":""},{"$f":"IF(Prezentace!E97=0,\"\",Prezentace!E97)","v":""},null,null,null,null,null,null,null,null,null,null,null,null,null,null,0]
[{"$f":"IF(Prezentace!A98=0,\"\",Prezentace!A98)","v":""},{"$f":"IF(Prezentace!B98=0,\"\",Prezentace!B98)","v":""},{"$f":"Prezentace!D98","v":"P"},{"$f":"IF(Prezentace!F98=0,\"\",Prezentace!F98)","v":""},{"$f":"IF(Prezentace!E98=0,\"\",Prezentace!E98)","v":""},null,null,null,null,null,null,null,null,null,null,null,null,null,null,0]
[{"$f":"IF(Prezentace!A99=0,\"\",Prezentace!A99)","v":""},{"$f":"IF(Prezentace!B99=0,\"\",Prezentace!B99)","v":""},{"$f":"Prezentace!D99","v":"P"},{"$f":"IF(Prezentace!F99=0,\"\",Prezentace!F99)","v":""},{"$f":"IF(Prezentace!E99=0,\"\",Prezentace!E99)","v":""},null,null,null,null,null,null,null,null,null,null,null,null,null,null,0]
[{"$f":"IF(Prezentace!A100=0,\"\",Prezentace!A100)","v":""},{"$f":"IF(Prezentace!B100=0,\"\",Prezentace!B100)","v":""},{"$f":"Prezentace!D100","v":"P"},{"$f":"IF(Prezentace!F100=0,\"\",Prezentace!F100)","v":""},{"$f":"IF(Prezentace!E100=0,\"\",Prezentace!E100)","v":""},null,null,null,null,null,null,null,null,null,null,null,null,null,null,0]
[{"$f":"IF(Prezentace!A101=0,\"\",Prezentace!A101)","v":""},{"$f":"IF(Prezentace!B101=0,\"\",Prezentace!B101)","v":""},{"$f":"Prezentace!D101","v":"P"},{"$f":"IF(Prezentace!F101=0,\"\",Prezentace!F101)","v":""},{"$f":"IF(Prezentace!E101=0,\"\",Prezentace!E101)","v":""},null,null,null,null,null,null,null,null,null,null,null,null,null,null,0]
[{"$f":"IF(Prezentace!A102=0,\"\",Prezentace!A102)","v":""},{"$f":"IF(Prezentace!B102=0,\"\",Prezentace!B102)","v":""},{"$f":"Prezentace!D102","v":"P"},{"$f":"IF(Prezentace!F102=0,\"\",Prezentace!F102)","v":""},{"$f":"IF(Prezentace!E102=0,\"\",Prezentace!E102)","v":""},null,null,null,null,null,null,null,null,null,null,null,null,null,null,0]
[{"$f":"IF(Prezentace!A103=0,\"\",Prezentace!A103)","v":""},{"$f":"IF(Prezentace!B103=0,\"\",Prezentace!B103)","v":""},{"$f":"Prezentace!D103","v":"P"},{"$f":"IF(Prezentace!F103=0,\"\",Prezentace!F103)","v":""},{"$f":"IF(Prezentace!E103=0,\"\",Prezentace!E103)","v":""},null,null,null,null,null,null,null,null,null,null,null,null,null,null,0]
[{"$f":"IF(Prezentace!A104=0,\"\",Prezentace!A104)","v":""},{"$f":"IF(Prezentace!B104=0,\"\",Prezentace!B104)","v":""},{"$f":"Prezentace!D104","v":"P"},{"$f":"IF(Prezentace!F104=0,\"\",Prezentace!F104)","v":""},{"$f":"IF(Prezentace!E104=0,\"\",Prezentace!E104)","v":""},null,null,null,null,null,null,null,null,null,null,null,null,null,null,{"$f":"(SUM(F102*$F$3,G102*$G$3,H102*$H$3,I102*$I$3,J102*$J$3,K102*$K$3,L102*$L$3,M102*$M$3,N102*$N$3,O102*$O$3,P102*$P$3,Q102*$Q$3,R102*$R$3))-S102","v":0}]

{"sheet":"5","index":10,"n_rows":102,"n_cols":22,"rows_kept":102,"cut":false,"hidden":true,"merged":[[0,3,0,20],[0,0,2,0],[0,1,2,1]]}
["Druž.","Kap.",null,"Disciplina 5"]
[]
[null,null,null,null,null,"K","M",1,2,3,4,5,6,7,8,9,10,11,12,"TB","Čas","Součet"]
[{"$f":"IF(Prezentace!A6=0,\"\",Prezentace!A6)","v":""},{"$f":"IF(Prezentace!B6=0,\"\",Prezentace!B6)","v":""},{"$f":"Prezentace!D6","v":"P"},{"$f":"IF(Prezentace!F6=0,\"\",Prezentace!F6)","v":"Martin"},{"$f":"IF(Prezentace!E6=0,\"\",Prezentace!E6)","v":"Adensam "},null,null,null,null,null,null,null,null,null,null,null,null,null,null,null,null,{"$f":"(SUM(F4:T4))-U4","v":0}]
[{"$f":"IF(Prezentace!A7=0,\"\",Prezentace!A7)","v":""},{"$f":"IF(Prezentace!B7=0,\"\",Prezentace!B7)","v":""},{"$f":"Prezentace!D7","v":"R"},{"$f":"IF(Prezentace!F7=0,\"\",Prezentace!F7)","v":"Martin"},{"$f":"IF(Prezentace!E7=0,\"\",Prezentace!E7)","v":"Adensam"},null,null,null,null,null,null,null,null,null,null,null,null,null,null,null,null,{"$f":"(SUM(F5:T5))-U5","v":0}]
[{"$f":"IF(Prezentace!A8=0,\"\",Prezentace!A8)","v":""},{"$f":"IF(Prezentace!B8=0,\"\",Prezentace!B8)","v":""},{"$f":"Prezentace!D8","v":"P"},{"$f":"IF(Prezentace!F8=0,\"\",Prezentace!F8)","v":"Jaroslav"},{"$f":"IF(Prezentace!E8=0,\"\",Prezentace!E8)","v":"Kostříž "},null,null,null,null,null,null,null,null,null,null,null,null,null,null,null,null,0]
[{"$f":"IF(Prezentace!A9=0,\"\",Prezentace!A9)","v":""},{"$f":"IF(Prezentace!B9=0,\"\",Prezentace!B9)","v":""},{"$f":"Prezentace!D9","v":"P"},{"$f":"IF(Prezentace!F9=0,\"\",Prezentace!F9)","v":"Miroslav"},{"$f":"IF(Prezentace!E9=0,\"\",Prezentace!E9)","v":"Koch   ml."},null,null,null,null,null,null,null,null,null,null,null,null,null,null,null,null,0]
[{"$f":"IF(Prezentace!A10=0,\"\",Prezentace!A10)","v":""},{"$f":"IF(Prezentace!B10=0,\"\",Prezentace!B10)","v":""},{"$f":"Prezentace!D10","v":"P"},{"$f":"IF(Prezentace!F10=0,\"\",Prezentace!F10)","v":"Miroslav"},{"$f":"IF(Prezentace!E10=0,\"\",Prezentace!E10)","v":"Koch  st. "},null,null,null,null,null,null,null,null,null,null,null,null,null,null,null,null,0]
[{"$f":"IF(Prezentace!A11=0,\"\",Prezentace!A11)","v":""},{"$f":"IF(Prezentace!B11=0,\"\",Prezentace!B11)","v":""},{"$f":"Prezentace!D11","v":"P"},{"$f":"IF(Prezentace!F11=0,\"\",Prezentace!F11)","v":"Bohumil"},{"$f":"IF(Prezentace!E11=0,\"\",Prezentace!E11)","v":"Herceg"},null,null,null,null,null,null,null,null,null,null,null,null,null,null,null,null,0]
[{"$f":"IF(Prezentace!A12=0,\"\",Prezentace!A12)","v":""},{"$f":"IF(Prezentace!B12=0,\"\",Prezentace!B12)","v":""},{"$f":"Prezentace!D12","v":"P"},{"$f":"IF(Prezentace!F12=0,\"\",Prezentace!F12)","v":"Viktor"},{"$f":"IF(Prezentace!E12=0,\"\",Prezentace!E12)","v":"Fuksa  "},null,null,null,null,null,null,null,null,null,null,null,null,null,null,null,null,0]
[{"$f":"IF(Prezentace!A13=0,\"\",Prezentace!A13)","v":""},{"$f":"IF(Prezentace!B13=0,\"\",Prezentace!B13)","v":""},{"$f":"Prezentace!D13","v":"P"},{"$f":"IF(Prezentace!F13=0,\"\",Prezentace!F13)","v":"Milan"},{"$f":"IF(Prezentace!E13=0,\"\",Prezentace!E13)","v":"Matějka  ml."},null,null,null,null,null,null,null,null,null,null,null,null,null,null,null,null,0]
[{"$f":"IF(Prezentace!A14=0,\"\",Prezentace!A14)","v":""},{"$f":"IF(Prezentace!B14=0,\"\",Prezentace!B14)","v":""},{"$f":"Prezentace!D14","v":"P"},{"$f":"IF(Prezentace!F14=0,\"\",Prezentace!F14)","v":"Michal"},{"$f":"IF(Prezentace!E14=0,\"\",Prezentace!E14)","v":"Svoboda"},null,null,null,null,null,null,null,null,null,null,null,null,null,null,null,null,0]
[{"$f":"IF(Prezentace!A15=0,\"\",Prezentace!A15)","v":""},{"$f":"IF(Prezentace!B15=0,\"\",Prezentace!B15)","v":""},{"$f":"Prezentace!D15","v":"R"},{"$f":"IF(Prezentace!F15=0,\"\",Prezentace!F15)","v":"Lukáš"},{"$f":"IF(Prezentace!E15=0,\"\",Prezentace!E15)","v":"Bouda "},null,null,null,null,null,null,null,null,null,null,null,null,null,null,null,null,0]
[{"$f":"IF(Prezentace!A16=0,\"\",Prezentace!A16)","v":""},{"$f":"IF(Prezentace!B16=0,\"\",Prezentace!B16)","v":""},{"$f":"Prezentace!D16","v":"P"},{"$f":"IF(Prezentace!F16=0,\"\",Prezentace!F16)","v":"Lukáš"},{"$f":"IF(Prezentace!E16=0,\"\",Prezentace!E16)","v":"Bouda "},null,null,null,null,null,null,null,null,null,null,null,null,null,null,null,null,0]
[{"$f":"IF(Prezentace!A17=0,\"\",Prezentace!A17)","v":""},{"$f":"IF(Prezentace!B17=0,\"\",Prezentace!B17)","v":""},{"$f":"Prezentace!D17","v":"P"},{"$f":"IF(Prezentace!F17=0,\"\",Prezentace!F17)","v":"Pavel"},{"$f":"IF(Prezentace!E17=0,\"\",Prezentace!E17)","v":"Koltai"},null,null,null,null,null,null,null,null,null,null,null,null,null,null,null,null,0]
[{"$f":"IF(Prezentace!A18=0,\"\",Prezentace!A18)","v":""},{"$f":"IF(Prezentace!B18=0,\"\",Prezentace!B18)","v":""},{"$f":"Prezentace!D18","v":"P"},{"$f":"IF(Prezentace!F18=0,\"\",Prezentace!F18)","v":"Vladislav"},{"$f":"IF(Prezentace!E18=0,\"\",Prezentace!E18)","v":"Přibyl"},null,null,null,null,null,null,null,null,null,null,null,null,null,null,null,null,0]
[{"$f":"IF(Prezentace!A19=0,\"\",Prezentace!A19)","v":""},{"$f":"IF(Prezentace!B19=0,\"\",Prezentace!B19)","v":""},{"$f":"Prezentace!D19","v":"P"},{"$f":"IF(Prezentace!F19=0,\"\",Prezentace!F19)","v":"Milan"},{"$f":"IF(Prezentace!E19=0,\"\",Prezentace!E19)","v":"Matějka st."},null,null,null,null,null,null,null,null,null,null,null,null,null,null,null,null,0]
[{"$f":"IF(Prezentace!A20=0,\"\",Prezentace!A20)","v":""},{"$f":"IF(Prezentace!B20=0,\"\",Prezentace!B20)","v":""},{"$f":"Prezentace!D20","v":"P"},{"$f":"IF(Prezentace!F20=0,\"\",Prezentace!F20)","v":"Miroslav"},{"$f":"IF(Prezentace!E20=0,\"\",Prezentace!E20)","v":"Fiala  "},null,null,null,null,null,null,null,null,null,null,null,null,null,null,null,null,0]
[{"$f":"IF(Prezentace!A21=0,\"\",Prezentace!A21)","v":""},{"$f":"IF(Prezentace!B21=0,\"\",Prezentace!B21)","v":""},{"$f":"Prezentace!D21","v":"P"},{"$f":"IF(Prezentace!F21=0,\"\",Prezentace!F21)","v":"Karel"},{"$f":"IF(Prezentace!E21=0,\"\",Prezentace!E21)","v":"Gažák "},null,null,null,null,null,null,null,null,null,null,null,null,null,null,null,null,0]
[{"$f":"IF(Prezentace!A22=0,\"\",Prezentace!A22)","v":""},{"$f":"IF(Prezentace!B22=0,\"\",Prezentace!B22)","v":""},{"$f":"Prezentace!D22","v":"P"},{"$f":"IF(Prezentace!F22=0,\"\",Prezentace!F22)","v":"Václav"},{"$f":"IF(Prezentace!E22=0,\"\",Prezentace!E22)","v":"Landkammer"},null,null,null,null,null,null,null,null,null,null,null,null,null,null,null,null,0]
[{"$f":"IF(Prezentace!A23=0,\"\",Prezentace!A23)","v":""},{"$f":"IF(Prezentace!B23=0,\"\",Prezentace!B23)","v":""},{"$f":"Prezentace!D23","v":"P"},{"$f":"IF(Prezentace!F23=0,\"\",Prezentace!F23)","v":"Vojtěch"},{"$f":"IF(Prezentace!E23=0,\"\",Prezentace!E23)","v":"Brejžek "},null,null,null,null,null,null,null,null,null,null,null,null,null,null,null,null,0]
[{"$f":"IF(Prezentace!A24=0,\"\",Prezentace!A24)","v":""},{"$f":"IF(Prezentace!B24=0,\"\",Prezentace!B24)","v":""},{"$f":"Prezentace!D24","v":"P"},{"$f":"IF(Prezentace!F24=0,\"\",Prezentace!F24)","v":"Antonín"},{"$f":"IF(Prezentace!E24=0,\"\",Prezentace!E24)","v":"Urbanec  "},null,null,null,null,null,null,null,null,null,null,null,null,null,null,null,null,0]
[{"$f":"IF(Prezentace!A25=0,\"\",Prezentace!A25)","v":""},{"$f":"IF(Prezentace!B25=0,\"\",Prezentace!B25)","v":""},{"$f":"Prezentace!D25","v":"P"},{"$f":"IF(Prezentace!F25=0,\"\",Prezentace!F25)","v":"Milan"},{"$f":"IF(Prezentace!E25=0,\"\",Prezentace!E25)","v":"Jílek  "},null,null,null,null,null,null,null,null,null,null,null,null,null,null,null,null,0]
[{"$f":"IF(Prezentace!A26=0,\"\",Prezentace!A26)","v":""},{"$f":"IF(Prezentace!B26=0,\"\",Prezentace!B26)","v":""},{"$f":"Prezentace!D26","v":"P"},{"$f":"IF(Prezentace!F26=0,\"\",Prezentace!F26)","v":"Václav"},{"$f":"IF(Prezentace!E26=0,\"\",Prezentace!E26)","v":"Jírů"},null,null,null,null,null,null,null,null,null,null,null,null,null,null,null,null,0]
[{"$f":"IF(Prezentace!A27=0,\"\",Prezentace!A27)","v":""},{"$f":"IF(Prezentace!B27=0,\"\",Prezentace!B27)","v":""},{"$f":"Prezentace!D27","v":"P"},{"$f":"IF(Prezentace!F27=0,\"\",Prezentace!F27)","v":"Milan"},{"$f":"IF(Prezentace!E27=0,\"\",Prezentace!E27)","v":"Krupica"},null,null,null,null,null,null,null,null,null,null,null,null,null,null,null,null,0]
[{"$f":"IF(Prezentace!A28=0,\"\",Prezentace!A28)","v":""},{"$f":"IF(Prezentace!B28=0,\"\",Prezentace!B28)","v":""},{"$f":"Prezentace!D28","v":"R"},{"$f":"IF(Prezentace!F28=0,\"\",Prezentace!F28)","v":"Milan"},{"$f":"IF(Prezentace!E28=0,\"\",Prezentace!E28)","v":"Krupica "},null,null,null,null,null,null,null,null,null,null,null,null,null,null,null,null,0]
[{"$f":"IF(Prezentace!A29=0,\"\",Prezentace!A29)","v":""},{"$f":"IF(Prezentace!B29=0,\"\",Prezentace!B29)","v":""},{"$f":"Prezentace!D29","v":"P"},{"$f":"IF(Prezentace!F29=0,\"\",Prezentace!F29)","v":"Miloslav"},{"$f":"IF(Prezentace!E29=0,\"\",Prezentace!E29)","v":"Petržílka"},null,null,null,null,null,null,null,null,null,null,null,null,null,null,null,null,0]
[{"$f":"IF(Prezentace!A30=0,\"\",Prezentace!A30)","v":""},{"$f":"IF(Prezentace!B30=0,\"\",Prezentace!B30)","v":""},{"$f":"Prezentace!D30","v":"R"},{"$f":"IF(Prezentace!F30=0,\"\",Prezentace!F30)","v":"Aleš"},{"$f":"IF(Prezentace!E30=0,\"\",Prezentace!E30)","v":"Seitl "},null,null,null,null,null,null,null,null,null,null,null,null,null,null,null,null,0]
[{"$f":"IF(Prezentace!A31=0,\"\",Prezentace!A31)","v":""},{"$f":"IF(Prezentace!B31=0,\"\",Prezentace!B31)","v":""},{"$f":"Prezentace!D31","v":"P"},{"$f":"IF(Prezentace!F31=0,\"\",Prezentace!F31)","v":"Aleš"},{"$f":"IF(Prezentace!E31=0,\"\",Prezentace!E31)","v":"Seitl "},null,null,null,null,null,null,null,null,null,null,null,null,null,null,null,null,0]
[{"$f":"IF(Prezentace!A32=0,\"\",Prezentace!A32)","v":""},{"$f":"IF(Prezentace!B32=0,\"\",Prezentace!B32)","v":""},{"$f":"Prezentace!D32","v":"P"},{"$f":"IF(Prezentace!F32=0,\"\",Prezentace!F32)","v":"Karel"},{"$f":"IF(Prezentace!E32=0,\"\",Prezentace!E32)","v":"Seitl"},null,null,null,null,null,null,null,null,null,null,null,null,null,null,null,null,0]
[{"$f":"IF(Prezentace!A33=0,\"\",Prezentace!A33)","v":""},{"$f":"IF(Prezentace!B33=0,\"\",Prezentace!B33)","v":""},{"$f":"Prezentace!D33","v":"P"},{"$f":"IF(Prezentace!F33=0,\"\",Prezentace!F33)","v":"David"},{"$f":"IF(Prezentace!E33=0,\"\",Prezentace!E33)","v":"Nikodým"},null,null,null,null,null,null,null,null,null,null,null,null,null,null,null,null,0]
[{"$f":"IF(Prezentace!A34=0,\"\",Prezentace!A34)","v":""},{"$f":"IF(Prezentace!B34=0,\"\",Prezentace!B34)","v":""},{"$f":"Prezentace!D34","v":"R"},{"$f":"IF(Prezentace!F34=0,\"\",Prezentace!F34)","v":"David"},{"$f":"IF(Prezentace!E34=0,\"\",Prezentace!E34)","v":"Nikodým "},null,null,null,null,null,null,null,null,null,null,null,null,null,null,null,null,0]
[{"$f":"IF(Prezentace!A35=0,\"\",Prezentace!A35)","v":""},{"$f":"IF(Prezentace!B35=0,\"\",Prezentace!B35)","v":""},{"$f":"Prezentace!D35","v":"P"},{"$f":"IF(Prezentace!F35=0,\"\",Prezentace!F35)","v":"Lukáš"},{"$f":"IF(Prezentace!E35=0,\"\",Prezentace!E35)","v":"Hobza"},null,null,null,null,null,null,null,null,null,null,null,null,null,null,null,null,0]
[{"$f":"IF(Prezentace!A36=0,\"\",Prezentace!A36)","v":""},{"$f":"IF(Prezentace!B36=0,\"\",Prezentace!B36)","v":""},{"$f":"Prezentace!D36","v":"P"},{"$f":"IF(Prezentace!F36=0,\"\",Prezentace!F36)","v":"Antonín"},{"$f":"IF(Prezentace!E36=0,\"\",Prezentace!E36)","v":"Jelínek "},null,null,null,null,null,null,null,null,null,null,null,null,null,null,null,null,0]
[{"$f":"IF(Prezentace!A37=0,\"\",Prezentace!A37)","v":""},{"$f":"IF(Prezentace!B37=0,\"\",Prezentace!B37)","v":""},{"$f":"Prezentace!D37","v":"R"},{"$f":"IF(Prezentace!F37=0,\"\",Prezentace!F37)","v":"Antonín"},{"$f":"IF(Prezentace!E37=0,\"\",Prezentace!E37)","v":"Jelínek "},null,null,null,null,null,null,null,null,null,null,null,null,null,null,null,null,0]
[{"$f":"IF(Prezentace!A38=0,\"\",Prezentace!A38)","v":""},{"$f":"IF(Prezentace!B38=0,\"\",Prezentace!B38)","v":""},{"$f":"Prezentace!D38","v":"P"},{"$f":"IF(Prezentace!F38=0,\"\",Prezentace!F38)","v":"Ladislav"},{"$f":"IF(Prezentace!E38=0,\"\",Prezentace!E38)","v":"Píša "},null,null,null,null,null,null,null,null,null,null,null,null,null,null,null,null,0]
[{"$f":"IF(Prezentace!A39=0,\"\",Prezentace!A39)","v":""},{"$f":"IF(Prezentace!B39=0,\"\",Prezentace!B39)","v":""},{"$f":"Prezentace!D39","v":"P"},{"$f":"IF(Prezentace!F39=0,\"\",Prezentace!F39)","v":"Štefan"},{"$f":"IF(Prezentace!E39=0,\"\",Prezentace!E39)","v":"Mesároš"},null,null,null,null,null,null,null,null,null,null,null,null,null,null,null,null,0]
[{"$f":"IF(Prezentace!A40=0,\"\",Prezentace!A40)","v":""},{"$f":"IF(Prezentace!B40=0,\"\",Prezentace!B40)","v":""},{"$f":"Prezentace!D40","v":"P"},{"$f":"IF(Prezentace!F40=0,\"\",Prezentace!F40)","v":"Pavel"},{"$f":"IF(Prezentace!E40=0,\"\",Prezentace!E40)","v":"Červenka"},null,null,null,null,null,null,null,null,null,null,null,null,null,null,null,null,{"$f":"(SUM(F38:T38))-U38","v":0}]
[{"$f":"IF(Prezentace!A41=0,\"\",Prezentace!A41)","v":""},{"$f":"IF(Prezentace!B41=0,\"\",Prezentace!B41)","v":""},{"$f":"Prezentace!D41","v":"R"},{"$f":"IF(Prezentace!F41=0,\"\",Prezentace!F41)","v":"Pavel"},{"$f":"IF(Prezentace!E41=0,\"\",Prezentace!E41)","v":"Červenka "},null,null,null,null,null,null,null,null,null,null,null,null,null,null,null,null,0]
[{"$f":"IF(Prezentace!A42=0,\"\",Prezentace!A42)","v":""},{"$f":"IF(Prezentace!B42=0,\"\",Prezentace!B42)","v":""},{"$f":"Prezentace!D42","v":"P"},{"$f":"IF(Prezentace!F42=0,\"\",Prezentace!F42)","v":"Jiří"},{"$f":"IF(Prezentace!E42=0,\"\",Prezentace!E42)","v":"Švihálek "},null,null,null,null,null,null,null,null,null,null,null,null,null,null,null,null,0]
[{"$f":"IF(Prezentace!A43=0,\"\",Prezentace!A43)","v":""},{"$f":"IF(Prezentace!B43=0,\"\",Prezentace!B43)","v":""},{"$f":"Prezentace!D43","v":"R"},{"$f":"IF(Prezentace!F43=0,\"\",Prezentace!F43)","v":"Jiří"},{"$f":"IF(Prezentace!E43=0,\"\",Prezentace!E43)","v":"Švihálek "},null,null,null,null,null,null,null,null,null,null,null,null,null,null,null,null,0]
[{"$f":"IF(Prezentace!A44=0,\"\",Prezentace!A44)","v":""},{"$f":"IF(Prezentace!B44=0,\"\",Prezentace!B44)","v":""},{"$f":"Prezentace!D44","v":"P"},{"$f":"IF(Prezentace!F44=0,\"\",Prezentace!F44)","v":"František"},{"$f":"IF(Prezentace!E44=0,\"\",Prezentace!E44)","v":"Toman "},null,null,null,null,null,null,null,null,null,null,null,null,null,null,null,null,0]
[{"$f":"IF(Prezentace!A45=0,\"\",Prezentace!A45)","v":""},{"$f":"IF(Prezentace!B45=0,\"\",Prezentace!B45)","v":""},{"$f":"Prezentace!D45","v":"P"},{"$f":"IF(Prezentace!F45=0,\"\",Prezentace!F45)","v":"Vladimír"},{"$f":"IF(Prezentace!E45=0,\"\",Prezentace!E45)","v":"VejslíK "},null,null,null,null,null,null,null,null,null,null,null,null,null,null,null,null,0]
[{"$f":"IF(Prezentace!A46=0,\"\",Prezentace!A46)","v":""},{"$f":"IF(Prezentace!B46=0,\"\",Prezentace!B46)","v":""},{"$f":"Prezentace!D46","v":"P"},{"$f":"IF(Prezentace!F46=0,\"\",Prezentace!F46)","v":"Karel"},{"$f":"IF(Prezentace!E46=0,\"\",Prezentace!E46)","v":"Získal "},null,null,null,null,null,null,null,null,null,null,null,null,null,null,null,null,0]
[{"$f":"IF(Prezentace!A47=0,\"\",Prezentace!A47)","v":""},{"$f":"IF(Prezentace!B47=0,\"\",Prezentace!B47)","v":""},{"$f":"Prezentace!D47","v":"R"},{"$f":"IF(Prezentace!F47=0,\"\",Prezentace!F47)","v":"Karel"},{"$f":"IF(Prezentace!E47=0,\"\",Prezentace!E47)","v":"Získal "},null,null,null,null,null,null,null,null,null,null,null,null,null,null,null,null,0]
[{"$f":"IF(Prezentace!A48=0,\"\",Prezentace!A48)","v":""},{"$f":"IF(Prezentace!B48=0,\"\",Prezentace!B48)","v":""},{"$f":"Prezentace!D48","v":"P"},{"$f":"IF(Prezentace!F48=0,\"\",Prezentace!F48)","v":"Jaroslav"},{"$f":"IF(Prezentace!E48=0,\"\",Prezentace!E48)","v":"Sokolík "},null,null,null,null,null,null,null,null,null,null,null,null,null,null,null,null,0]
[{"$f":"IF(Prezentace!A49=0,\"\",Prezentace!A49)","v":""},{"$f":"IF(Prezentace!B49=0,\"\",Prezentace!B49)","v":""},{"$f":"Prezentace!D49","v":"P"},{"$f":"IF(Prezentace!F49=0,\"\",Prezentace!F49)","v":"Milan"},{"$f":"IF(Prezentace!E49=0,\"\",Prezentace!E49)","v":"Kraus "},null,null,null,null,null,null,null,null,null,null,null,null,null,null,null,null,0]
[{"$f":"IF(Prezentace!A50=0,\"\",Prezentace!A50)","v":""},{"$f":"IF(Prezentace!B50=0,\"\",Prezentace!B50)","v":""},{"$f":"Prezentace!D50","v":"P"},{"$f":"IF(Prezentace!F50=0,\"\",Prezentace!F50)","v":""},{"$f":"IF(Prezentace!E50=0,\"\",Prezentace!E50)","v":""},null,null,null,null,null,null,null,null,null,null,null,null,null,null,null,null,0]
[{"$f":"IF(Prezentace!A51=0,\"\",Prezentace!A51)","v":""},{"$f":"IF(Prezentace!B51=0,\"\",Prezentace!B51)","v":""},{"$f":"Prezentace!D51","v":"P"},{"$f":"IF(Prezentace!F51=0,\"\",Prezentace!F51)","v":""},{"$f":"IF(Prezentace!E51=0,\"\",Prezentace!E51)","v":""},null,null,null,null,null,null,null,null,null,null,null,null,null,null,null,null,0]
[{"$f":"IF(Prezentace!A52=0,\"\",Prezentace!A52)","v":""},{"$f":"IF(Prezentace!B52=0,\"\",Prezentace!B52)","v":""},{"$f":"Prezentace!D52","v":"P"},{"$f":"IF(Prezentace!F52=0,\"\",Prezentace!F52)","v":""},{"$f":"IF(Prezentace!E52=0,\"\",Prezentace!E52)","v":""},null,null,null,null,null,null,null,null,null,null,null,null,null,null,null,null,0]
[{"$f":"IF(Prezentace!A53=0,\"\",Prezentace!A53)","v":""},{"$f":"IF(Prezentace!B53=0,\"\",Prezentace!B53)","v":""},{"$f":"Prezentace!D53","v":"P"},{"$f":"IF(Prezentace!F53=0,\"\",Prezentace!F53)","v":""},{"$f":"IF(Prezentace!E53=0,\"\",Prezentace!E53)","v":""},null,null,null,null,null,null,null,null,null,null,null,null,null,null,null,null,0]
[{"$f":"IF(Prezentace!A54=0,\"\",Prezentace!A54)","v":""},{"$f":"IF(Prezentace!B54=0,\"\",Prezentace!B54)","v":""},{"$f":"Prezentace!D54","v":"P"},{"$f":"IF(Prezentace!F54=0,\"\",Prezentace!F54)","v":""},{"$f":"IF(Prezentace!E54=0,\"\",Prezentace!E54)","v":""},null,null,null,null,null,null,null,null,null,null,null,null,null,null,null,null,0]
[{"$f":"IF(Prezentace!A55=0,\"\",Prezentace!A55)","v":""},{"$f":"IF(Prezentace!B55=0,\"\",Prezentace!B55)","v":""},{"$f":"Prezentace!D55","v":"P"},{"$f":"IF(Prezentace!F55=0,\"\",Prezentace!F55)","v":""},{"$f":"IF(Prezentace!E55=0,\"\",Prezentace!E55)","v":""},null,null,null,null,null,null,null,null,null,null,null,null,null,null,null,null,0]
[{"$f":"IF(Prezentace!A56=0,\"\",Prezentace!A56)","v":""},{"$f":"IF(Prezentace!B56=0,\"\",Prezentace!B56)","v":""},{"$f":"Prezentace!D56","v":"P"},{"$f":"IF(Prezentace!F56=0,\"\",Prezentace!F56)","v":""},{"$f":"IF(Prezentace!E56=0,\"\",Prezentace!E56)","v":""},null,null,null,null,null,null,null,null,null,null,null,null,null,null,null,null,0]
[{"$f":"IF(Prezentace!A57=0,\"\",Prezentace!A57)","v":""},{"$f":"IF(Prezentace!B57=0,\"\",Prezentace!B57)","v":""},{"$f":"Prezentace!D57","v":"P"},{"$f":"IF(Prezentace!F57=0,\"\",Prezentace!F57)","v":""},{"$f":"IF(Prezentace!E57=0,\"\",Prezentace!E57)","v":""},null,null,null,null,null,null,null,null,null,null,null,null,null,null,null,null,0]
[{"$f":"IF(Prezentace!A58=0,\"\",Prezentace!A58)","v":""},{"$f":"IF(Prezentace!B58=0,\"\",Prezentace!B58)","v":""},{"$f":"Prezentace!D58","v":"P"},{"$f":"IF(Prezentace!F58=0,\"\",Prezentace!F58)","v":""},{"$f":"IF(Prezentace!E58=0,\"\",Prezentace!E58)","v":""},null,null,null,null,null,null,null,null,null,null,null,null,null,null,null,null,0]
[{"$f":"IF(Prezentace!A59=0,\"\",Prezentace!A59)","v":""},{"$f":"IF(Prezentace!B59=0,\"\",Prezentace!B59)","v":""},{"$f":"Prezentace!D59","v":"P"},{"$f":"IF(Prezentace!F59=0,\"\",Prezentace!F59)","v":""},{"$f":"IF(Prezentace!E59=0,\"\",Prezentace!E59)","v":""},null,null,null,null,null,null,null,null,null,null,null,null,null,null,null,null,0]
[{"$f":"IF(Prezentace!A60=0,\"\",Prezentace!A60)","v":""},{"$f":"IF(Prezentace!B60=0,\"\",Prezentace!B60)","v":""},{"$f":"Prezentace!D60","v":"P"},{"$f":"IF(Prezentace!F60=0,\"\",Prezentace!F60)","v":""},{"$f":"IF(Prezentace!E60=0,\"\",Prezentace!E60)","v":""},null,null,null,null,null,null,null,null,null,null,null,null,null,null,null,null,0]
[{"$f":"IF(Prezentace!A61=0,\"\",Prezentace!A61)","v":""},{"$f":"IF(Prezentace!B61=0,\"\",Prezentace!B61)","v":""},{"$f":"Prezentace!D61","v":"P"},{"$f":"IF(Prezentace!F61=0,\"\",Prezentace!F61)","v":""},{"$f":"IF(Prezentace!E61=0,\"\",Prezentace!E61)","v":""},null,null,null,null,null,null,null,null,null,null,null,null,null,null,null,null,0]
[{"$f":"IF(Prezentace!A62=0,\"\",Prezentace!A62)","v":""},{"$f":"IF(Prezentace!B62=0,\"\",Prezentace!B62)","v":""},{"$f":"Prezentace!D62","v":"P"},{"$f":"IF(Prezentace!F62=0,\"\",Prezentace!F62)","v":""},{"$f":"IF(Prezentace!E62=0,\"\",Prezentace!E62)","v":""},null,null,null,null,null,null,null,null,null,null,null,null,null,null,null,null,0]
[{"$f":"IF(Prezentace!A63=0,\"\",Prezentace!A63)","v":""},{"$f":"IF(Prezentace!B63=0,\"\",Prezentace!B63)","v":""},{"$f":"Prezentace!D63","v":"P"},{"$f":"IF(Prezentace!F63=0,\"\",Prezentace!F63)","v":""},{"$f":"IF(Prezentace!E63=0,\"\",Prezentace!E63)","v":""},null,null,null,null,null,null,null,null,null,null,null,null,null,null,null,null,0]
[{"$f":"IF(Prezentace!A64=0,\"\",Prezentace!A64)","v":""},{"$f":"IF(Prezentace!B64=0,\"\",Prezentace!B64)","v":""},{"$f":"Prezentace!D64","v":"P"},{"$f":"IF(Prezentace!F64=0,\"\",Prezentace!F64)","v":""},{"$f":"IF(Prezentace!E64=0,\"\",Prezentace!E64)","v":""},null,null,null,null,null,null,null,null,null,null,null,null,null,null,null,null,0]
[{"$f":"IF(Prezentace!A65=0,\"\",Prezentace!A65)","v":""},{"$f":"IF(Prezentace!B65=0,\"\",Prezentace!B65)","v":""},{"$f":"Prezentace!D65","v":"P"},{"$f":"IF(Prezentace!F65=0,\"\",Prezentace!F65)","v":""},{"$f":"IF(Prezentace!E65=0,\"\",Prezentace!E65)","v":""},null,null,null,null,null,null,null,null,null,null,null,null,null,null,null,null,0]
[{"$f":"IF(Prezentace!A66=0,\"\",Prezentace!A66)","v":""},{"$f":"IF(Prezentace!B66=0,\"\",Prezentace!B66)","v":""},{"$f":"Prezentace!D66","v":"P"},{"$f":"IF(Prezentace!F66=0,\"\",Prezentace!F66)","v":""},{"$f":"IF(Prezentace!E66=0,\"\",Prezentace!E66)","v":""},null,null,null,null,null,null,null,null,null,null,null,null,null,null,null,null,0]
[{"$f":"IF(Prezentace!A67=0,\"\",Prezentace!A67)","v":""},{"$f":"IF(Prezentace!B67=0,\"\",Prezentace!B67)","v":""},{"$f":"Prezentace!D67","v":"P"},{"$f":"IF(Prezentace!F67=0,\"\",Prezentace!F67)","v":""},{"$f":"IF(Prezentace!E67=0,\"\",Prezentace!E67)","v":""},null,null,null,null,null,null,null,null,null,null,null,null,null,null,null,null,0]
[{"$f":"IF(Prezentace!A68=0,\"\",Prezentace!A68)","v":""},{"$f":"IF(Prezentace!B68=0,\"\",Prezentace!B68)","v":""},{"$f":"Prezentace!D68","v":"P"},{"$f":"IF(Prezentace!F68=0,\"\",Prezentace!F68)","v":""},{"$f":"IF(Prezentace!E68=0,\"\",Prezentace!E68)","v":""},null,null,null,null,null,null,null,null,null,null,null,null,null,null,null,null,0]
[{"$f":"IF(Prezentace!A69=0,\"\",Prezentace!A69)","v":""},{"$f":"IF(Prezentace!B69=0,\"\",Prezentace!B69)","v":""},{"$f":"Prezentace!D69","v":"P"},{"$f":"IF(Prezentace!F69=0,\"\",Prezentace!F69)","v":""},{"$f":"IF(Prezentace!E69=0,\"\",Prezentace!E69)","v":""},null,null,null,null,null,null,null,null,null,null,null,null,null,null,null,null,0]
[{"$f":"IF(Prezentace!A70=0,\"\",Prezentace!A70)","v":""},{"$f":"IF(Prezentace!B70=0,\"\",Prezentace!B70)","v":""},{"$f":"Prezentace!D70","v":"P"},{"$f":"IF(Prezentace!F70=0,\"\",Prezentace!F70)","v":""},{"$f":"IF(Prezentace!E70=0,\"\",Prezentace!E70)","v":""},null,null,null,null,null,null,null,null,null,null,null,null,null,null,null,null,0]
[{"$f":"IF(Prezentace!A71=0,\"\",Prezentace!A71)","v":""},{"$f":"IF(Prezentace!B71=0,\"\",Prezentace!B71)","v":""},{"$f":"Prezentace!D71","v":"P"},{"$f":"IF(Prezentace!F71=0,\"\",Prezentace!F71)","v":""},{"$f":"IF(Prezentace!E71=0,\"\",Prezentace!E71)","v":""},null,null,null,null,null,null,null,null,null,null,null,null,null,null,null,null,0]
[{"$f":"IF(Prezentace!A72=0,\"\",Prezentace!A72)","v":""},{"$f":"IF(Prezentace!B72=0,\"\",Prezentace!B72)","v":""},{"$f":"Prezentace!D72","v":"P"},{"$f":"IF(Prezentace!F72=0,\"\",Prezentace!F72)","v":""},{"$f":"IF(Prezentace!E72=0,\"\",Prezentace!E72)","v":""},null,null,null,null,null,null,null,null,null,null,null,null,null,null,null,null,0]
[{"$f":"IF(Prezentace!A73=0,\"\",Prezentace!A73)","v":""},{"$f":"IF(Prezentace!B73=0,\"\",Prezentace!B73)","v":""},{"$f":"Prezentace!D73","v":"P"},{"$f":"IF(Prezentace!F73=0,\"\",Prezentace!F73)","v":""},{"$f":"IF(Prezentace!E73=0,\"\",Prezentace!E73)","v":""},null,null,null,null,null,null,null,null,null,null,null,null,null,null,null,null,0]
[{"$f":"IF(Prezentace!A74=0,\"\",Prezentace!A74)","v":""},{"$f":"IF(Prezentace!B74=0,\"\",Prezentace!B74)","v":""},{"$f":"Prezentace!D74","v":"P"},{"$f":"IF(Prezentace!F74=0,\"\",Prezentace!F74)","v":""},{"$f":"IF(Prezentace!E74=0,\"\",Prezentace!E74)","v":""},null,null,null,null,null,null,null,null,null,null,null,null,null,null,null,null,0]
[{"$f":"IF(Prezentace!A75=0,\"\",Prezentace!A75)","v":""},{"$f":"IF(Prezentace!B75=0,\"\",Prezentace!B75)","v":""},{"$f":"Prezentace!D75","v":"P"},{"$f":"IF(Prezentace!F75=0,\"\",Prezentace!F75)","v":""},{"$f":"IF(Prezentace!E75=0,\"\",Prezentace!E75)","v":""},null,null,null,null,null,null,null,null,null,null,null,null,null,null,null,null,0]
[{"$f":"IF(Prezentace!A76=0,\"\",Prezentace!A76)","v":""},{"$f":"IF(Prezentace!B76=0,\"\",Prezentace!B76)","v":""},{"$f":"Prezentace!D76","v":"P"},{"$f":"IF(Prezentace!F76=0,\"\",Prezentace!F76)","v":""},{"$f":"IF(Prezentace!E76=0,\"\",Prezentace!E76)","v":""},null,null,null,null,null,null,null,null,null,null,null,null,null,null,null,null,0]
[{"$f":"IF(Prezentace!A77=0,\"\",Prezentace!A77)","v":""},{"$f":"IF(Prezentace!B77=0,\"\",Prezentace!B77)","v":""},{"$f":"Prezentace!D77","v":"P"},{"$f":"IF(Prezentace!F77=0,\"\",Prezentace!F77)","v":""},{"$f":"IF(Prezentace!E77=0,\"\",Prezentace!E77)","v":""},null,null,null,null,null,null,null,null,null,null,null,null,null,null,null,null,0]
[{"$f":"IF(Prezentace!A78=0,\"\",Prezentace!A78)","v":""},{"$f":"IF(Prezentace!B78=0,\"\",Prezentace!B78)","v":""},{"$f":"Prezentace!D78","v":"P"},{"$f":"IF(Prezentace!F78=0,\"\",Prezentace!F78)","v":""},{"$f":"IF(Prezentace!E78=0,\"\",Prezentace!E78)","v":""},null,null,null,null,null,null,null,null,null,null,null,null,null,null,null,null,0]
[{"$f":"IF(Prezentace!A79=0,\"\",Prezentace!A79)","v":""},{"$f":"IF(Prezentace!B79=0,\"\",Prezentace!B79)","v":""},{"$f":"Prezentace!D79","v":"P"},{"$f":"IF(Prezentace!F79=0,\"\",Prezentace!F79)","v":""},{"$f":"IF(Prezentace!E79=0,\"\",Prezentace!E79)","v":""},null,null,null,null,null,null,null,null,null,null,null,null,null,null,null,null,0]
[{"$f":"IF(Prezentace!A80=0,\"\",Prezentace!A80)","v":""},{"$f":"IF(Prezentace!B80=0,\"\",Prezentace!B80)","v":""},{"$f":"Prezentace!D80","v":"P"},{"$f":"IF(Prezentace!F80=0,\"\",Prezentace!F80)","v":""},{"$f":"IF(Prezentace!E80=0,\"\",Prezentace!E80)","v":""},null,null,null,null,null,null,null,null,null,null,null,null,null,null,null,null,0]
[{"$f":"IF(Prezentace!A81=0,\"\",Prezentace!A81)","v":""},{"$f":"IF(Prezentace!B81=0,\"\",Prezentace!B81)","v":""},{"$f":"Prezentace!D81","v":"P"},{"$f":"IF(Prezentace!F81=0,\"\",Prezentace!F81)","v":""},{"$f":"IF(Prezentace!E81=0,\"\",Prezentace!E81)","v":""},null,null,null,null,null,null,null,null,null,null,null,null,null,null,null,null,0]
[{"$f":"IF(Prezentace!A82=0,\"\",Prezentace!A82)","v":""},{"$f":"IF(Prezentace!B82=0,\"\",Prezentace!B82)","v":""},{"$f":"Prezentace!D82","v":"P"},{"$f":"IF(Prezentace!F82=0,\"\",Prezentace!F82)","v":""},{"$f":"IF(Prezentace!E82=0,\"\",Prezentace!E82)","v":""},null,null,null,null,null,null,null,null,null,null,null,null,null,null,null,null,0]
[{"$f":"IF(Prezentace!A83=0,\"\",Prezentace!A83)","v":""},{"$f":"IF(Prezentace!B83=0,\"\",Prezentace!B83)","v":""},{"$f":"Prezentace!D83","v":"P"},{"$f":"IF(Prezentace!F83=0,\"\",Prezentace!F83)","v":""},{"$f":"IF(Prezentace!E83=0,\"\",Prezentace!E83)","v":""},null,null,null,null,null,null,null,null,null,null,null,null,null,null,null,null,0]
[{"$f":"IF(Prezentace!A84=0,\"\",Prezentace!A84)","v":""},{"$f":"IF(Prezentace!B84=0,\"\",Prezentace!B84)","v":""},{"$f":"Prezentace!D84","v":"P"},{"$f":"IF(Prezentace!F84=0,\"\",Prezentace!F84)","v":""},{"$f":"IF(Prezentace!E84=0,\"\",Prezentace!E84)","v":""},null,null,null,null,null,null,null,null,null,null,null,null,null,null,null,null,0]
[{"$f":"IF(Prezentace!A85=0,\"\",Prezentace!A85)","v":""},{"$f":"IF(Prezentace!B85=0,\"\",Prezentace!B85)","v":""},{"$f":"Prezentace!D85","v":"P"},{"$f":"IF(Prezentace!F85=0,\"\",Prezentace!F85)","v":""},{"$f":"IF(Prezentace!E85=0,\"\",Prezentace!E85)","v":""},null,null,null,null,null,null,null,null,null,null,null,null,null,null,null,null,0]
[{"$f":"IF(Prezentace!A86=0,\"\",Prezentace!A86)","v":""},{"$f":"IF(Prezentace!B86=0,\"\",Prezentace!B86)","v":""},{"$f":"Prezentace!D86","v":"P"},{"$f":"IF(Prezentace!F86=0,\"\",Prezentace!F86)","v":""},{"$f":"IF(Prezentace!E86=0,\"\",Prezentace!E86)","v":""},null,null,null,null,null,null,null,null,null,null,null,null,null,null,null,null,0]
[{"$f":"IF(Prezentace!A87=0,\"\",Prezentace!A87)","v":""},{"$f":"IF(Prezentace!B87=0,\"\",Prezentace!B87)","v":""},{"$f":"Prezentace!D87","v":"P"},{"$f":"IF(Prezentace!F87=0,\"\",Prezentace!F87)","v":""},{"$f":"IF(Prezentace!E87=0,\"\",Prezentace!E87)","v":""},null,null,null,null,null,null,null,null,null,null,null,null,null,null,null,null,0]
[{"$f":"IF(Prezentace!A88=0,\"\",Prezentace!A88)","v":""},{"$f":"IF(Prezentace!B88=0,\"\",Prezentace!B88)","v":""},{"$f":"Prezentace!D88","v":"P"},{"$f":"IF(Prezentace!F88=0,\"\",Prezentace!F88)","v":""},{"$f":"IF(Prezentace!E88=0,\"\",Prezentace!E88)","v":""},null,null,null,null,null,null,null,null,null,null,null,null,null,null,null,null,0]
[{"$f":"IF(Prezentace!A89=0,\"\",Prezentace!A89)","v":""},{"$f":"IF(Prezentace!B89=0,\"\",Prezentace!B89)","v":""},{"$f":"Prezentace!D89","v":"P"},{"$f":"IF(Prezentace!F89=0,\"\",Prezentace!F89)","v":""},{"$f":"IF(Prezentace!E89=0,\"\",Prezentace!E89)","v":""},null,null,null,null,null,null,null,null,null,null,null,null,null,null,null,null,0]
[{"$f":"IF(Prezentace!A90=0,\"\",Prezentace!A90)","v":""},{"$f":"IF(Prezentace!B90=0,\"\",Prezentace!B90)","v":""},{"$f":"Prezentace!D90","v":"P"},{"$f":"IF(Prezentace!F90=0,\"\",Prezentace!F90)","v":""},{"$f":"IF(Prezentace!E90=0,\"\",Prezentace!E90)","v":""},null,null,null,null,null,null,null,null,null,null,null,null,null,null,null,null,0]
[{"$f":"IF(Prezentace!A91=0,\"\",Prezentace!A91)","v":""},{"$f":"IF(Prezentace!B91=0,\"\",Prezentace!B91)","v":""},{"$f":"Prezentace!D91","v":"P"},{"$f":"IF(Prezentace!F91=0,\"\",Prezentace!F91)","v":""},{"$f":"IF(Prezentace!E91=0,\"\",Prezentace!E91)","v":""},null,null,null,null,null,null,null,null,null,null,null,null,null,null,null,null,0]
[{"$f":"IF(Prezentace!A92=0,\"\",Prezentace!A92)","v":""},{"$f":"IF(Prezentace!B92=0,\"\",Prezentace!B92)","v":""},{"$f":"Prezentace!D92","v":"P"},{"$f":"IF(Prezentace!F92=0,\"\",Prezentace!F92)","v":""},{"$f":"IF(Prezentace!E92=0,\"\",Prezentace!E92)","v":""},null,null,null,null,null,null,null,null,null,null,null,null,null,null,null,null,0]
[{"$f":"IF(Prezentace!A93=0,\"\",Prezentace!A93)","v":""},{"$f":"IF(Prezentace!B93=0,\"\",Prezentace!B93)","v":""},{"$f":"Prezentace!D93","v":"P"},{"$f":"IF(Prezentace!F93=0,\"\",Prezentace!F93)","v":""},{"$f":"IF(Prezentace!E93=0,\"\",Prezentace!E93)","v":""},null,null,null,null,null,null,null,null,null,null,null,null,null,null,null,null,0]
[{"$f":"IF(Prezentace!A94=0,\"\",Prezentace!A94)","v":""},{"$f":"IF(Prezentace!B94=0,\"\",Prezentace!B94)","v":""},{"$f":"Prezentace!D94","v":"P"},{"$f":"IF(Prezentace!F94=0,\"\",Prezentace!F94)","v":""},{"$f":"IF(Prezentace!E94=0,\"\",Prezentace!E94)","v":""},null,null,null,null,null,null,null,null,null,null,null,null,null,null,null,null,0]
[{"$f":"IF(Prezentace!A95=0,\"\",Prezentace!A95)","v":""},{"$f":"IF(Prezentace!B95=0,\"\",Prezentace!B95)","v":""},{"$f":"Prezentace!D95","v":"P"},{"$f":"IF(Prezentace!F95=0,\"\",Prezentace!F95)","v":""},{"$f":"IF(Prezentace!E95=0,\"\",Prezentace!E95)","v":""},null,null,null,null,null,null,null,null,null,null,null,null,null,null,null,null,0]
[{"$f":"IF(Prezentace!A96=0,\"\",Prezentace!A96)","v":""},{"$f":"IF(Prezentace!B96=0,\"\",Prezentace!B96)","v":""},{"$f":"Prezentace!D96","v":"P"},{"$f":"IF(Prezentace!F96=0,\"\",Prezentace!F96)","v":""},{"$f":"IF(Prezentace!E96=0,\"\",Prezentace!E96)","v":""},null,null,null,null,null,null,null,null,null,null,null,null,null,null,null,null,0]
[{"$f":"IF(Prezentace!A97=0,\"\",Prezentace!A97)","v":""},{"$f":"IF(Prezentace!B97=0,\"\",Prezentace!B97)","v":""},{"$f":"Prezentace!D97","v":"P"},{"$f":"IF(Prezentace!F97=0,\"\",Prezentace!F97)","v":""},{"$f":"IF(Prezentace!E97=0,\"\",Prezentace!E97)","v":""},null,null,null,null,null,null,null,null,null,null,null,null,null,null,null,null,0]
[{"$f":"IF(Prezentace!A98=0,\"\",Prezentace!A98)","v":""},{"$f":"IF(Prezentace!B98=0,\"\",Prezentace!B98)","v":""},{"$f":"Prezentace!D98","v":"P"},{"$f":"IF(Prezentace!F98=0,\"\",Prezentace!F98)","v":""},{"$f":"IF(Prezentace!E98=0,\"\",Prezentace!E98)","v":""},null,null,null,null,null,null,null,null,null,null,null,null,null,null,null,null,0]
[{"$f":"IF(Prezentace!A99=0,\"\",Prezentace!A99)","v":""},{"$f":"IF(Prezentace!B99=0,\"\",Prezentace!B99)","v":""},{"$f":"Prezentace!D99","v":"P"},{"$f":"IF(Prezentace!F99=0,\"\",Prezentace!F99)","v":""},{"$f":"IF(Prezentace!E99=0,\"\",Prezentace!E99)","v":""},null,null,null,null,null,null,null,null,null,null,null,null,null,null,null,null,0]
[{"$f":"IF(Prezentace!A100=0,\"\",Prezentace!A100)","v":""},{"$f":"IF(Prezentace!B100=0,\"\",Prezentace!B100)","v":""},{"$f":"Prezentace!D100","v":"P"},{"$f":"IF(Prezentace!F100=0,\"\",Prezentace!F100)","v":""},{"$f":"IF(Prezentace!E100=0,\"\",Prezentace!E100)","v":""},null,null,null,null,null,null,null,null,null,null,null,null,null,null,null,null,0]
[{"$f":"IF(Prezentace!A101=0,\"\",Prezentace!A101)","v":""},{"$f":"IF(Prezentace!B101=0,\"\",Prezentace!B101)","v":""},{"$f":"Prezentace!D101","v":"P"},{"$f":"IF(Prezentace!F101=0,\"\",Prezentace!F101)","v":""},{"$f":"IF(Prezentace!E101=0,\"\",Prezentace!E101)","v":""},null,null,null,null,null,null,null,null,null,null,null,null,null,null,null,null,0]
[{"$f":"IF(Prezentace!A102=0,\"\",Prezentace!A102)","v":""},{"$f":"IF(Prezentace!B102=0,\"\",Prezentace!B102)","v":""},{"$f":"Prezentace!D102","v":"P"},{"$f":"IF(Prezentace!F102=0,\"\",Prezentace!F102)","v":""},{"$f":"IF(Prezentace!E102=0,\"\",Prezentace!E102)","v":""},null,null,null,null,null,null,null,null,null,null,null,null,null,null,null,null,0]
[{"$f":"IF(Prezentace!A103=0,\"\",Prezentace!A103)","v":""},{"$f":"IF(Prezentace!B103=0,\"\",Prezentace!B103)","v":""},{"$f":"Prezentace!D103","v":"P"},{"$f":"IF(Prezentace!F103=0,\"\",Prezentace!F103)","v":""},{"$f":"IF(Prezentace!E103=0,\"\",Prezentace!E103)","v":""},null,null,null,null,null,null,null,null,null,null,null,null,null,null,null,null,0]
[{"$f":"IF(Prezentace!A104=0,\"\",Prezentace!A104)","v":""},{"$f":"IF(Prezentace!B104=0,\"\",Prezentace!B104)","v":""},{"$f":"Prezentace!D104","v":"P"},{"$f":"IF(Prezentace!F104=0,\"\",Prezentace!F104)","v":""},{"$f":"IF(Prezentace!E104=0,\"\",Prezentace!E104)","v":""},null,null,null,null,null,null,null,null,null,null,null,null,null,null,null,null,{"$f":"(SUM(F102:T102))-U102","v":0}]

{"sheet":"5(M)","index":11,"n_rows":102,"n_cols":20,"rows_kept":102,"cut":false,"hidden":true,"merged":[[0,3,0,18],[0,0,2,0],[0,1,2,1]]}
["Druž.","Kap.",null,"Disciplina 5"]
[]
[null,null,null,null,null,0,1,2,3,4,5,6,7,8,9,10,12,15,"Čas","Součet"]
[{"$f":"IF(Prezentace!A6=0,\"\",Prezentace!A6)","v":""},{"$f":"IF(Prezentace!B6=0,\"\",Prezentace!B6)","v":""},{"$f":"Prezentace!D6","v":"P"},{"$f":"IF(Prezentace!F6=0,\"\",Prezentace!F6)","v":"Martin"},{"$f":"IF(Prezentace!E6=0,\"\",Prezentace!E6)","v":"Adensam "},null,null,null,null,null,null,null,null,null,null,null,null,null,null,{"$f":"(SUM(F4*$F$3,G4*$G$3,H4*$H$3,I4*$I$3,J4*$J$3,K4*$K$3,L4*$L$3,M4*$M$3,N4*$N$3,O4*$O$3,P4*$P$3,Q4*$Q$3,R4*$R$3))-S4","v":0}]
[{"$f":"IF(Prezentace!A7=0,\"\",Prezentace!A7)","v":""},{"$f":"IF(Prezentace!B7=0,\"\",Prezentace!B7)","v":""},{"$f":"Prezentace!D7","v":"R"},{"$f":"IF(Prezentace!F7=0,\"\",Prezentace!F7)","v":"Martin"},{"$f":"IF(Prezentace!E7=0,\"\",Prezentace!E7)","v":"Adensam"},null,null,null,null,null,null,null,null,null,null,null,null,null,null,{"$f":"(SUM(F5*$F$3,G5*$G$3,H5*$H$3,I5*$I$3,J5*$J$3,K5*$K$3,L5*$L$3,M5*$M$3,N5*$N$3,O5*$O$3,P5*$P$3,Q5*$Q$3,R5*$R$3))-S5","v":0}]
[{"$f":"IF(Prezentace!A8=0,\"\",Prezentace!A8)","v":""},{"$f":"IF(Prezentace!B8=0,\"\",Prezentace!B8)","v":""},{"$f":"Prezentace!D8","v":"P"},{"$f":"IF(Prezentace!F8=0,\"\",Prezentace!F8)","v":"Jaroslav"},{"$f":"IF(Prezentace!E8=0,\"\",Prezentace!E8)","v":"Kostříž "},null,null,null,null,null,null,null,null,null,null,null,null,null,null,0]
[{"$f":"IF(Prezentace!A9=0,\"\",Prezentace!A9)","v":""},{"$f":"IF(Prezentace!B9=0,\"\",Prezentace!B9)","v":""},{"$f":"Prezentace!D9","v":"P"},{"$f":"IF(Prezentace!F9=0,\"\",Prezentace!F9)","v":"Miroslav"},{"$f":"IF(Prezentace!E9=0,\"\",Prezentace!E9)","v":"Koch   ml."},null,null,null,null,null,null,null,null,null,null,null,null,null,null,0]
[{"$f":"IF(Prezentace!A10=0,\"\",Prezentace!A10)","v":""},{"$f":"IF(Prezentace!B10=0,\"\",Prezentace!B10)","v":""},{"$f":"Prezentace!D10","v":"P"},{"$f":"IF(Prezentace!F10=0,\"\",Prezentace!F10)","v":"Miroslav"},{"$f":"IF(Prezentace!E10=0,\"\",Prezentace!E10)","v":"Koch  st. "},null,null,null,null,null,null,null,null,null,null,null,null,null,null,0]
[{"$f":"IF(Prezentace!A11=0,\"\",Prezentace!A11)","v":""},{"$f":"IF(Prezentace!B11=0,\"\",Prezentace!B11)","v":""},{"$f":"Prezentace!D11","v":"P"},{"$f":"IF(Prezentace!F11=0,\"\",Prezentace!F11)","v":"Bohumil"},{"$f":"IF(Prezentace!E11=0,\"\",Prezentace!E11)","v":"Herceg"},null,null,null,null,null,null,null,null,null,null,null,null,null,null,0]
[{"$f":"IF(Prezentace!A12=0,\"\",Prezentace!A12)","v":""},{"$f":"IF(Prezentace!B12=0,\"\",Prezentace!B12)","v":""},{"$f":"Prezentace!D12","v":"P"},{"$f":"IF(Prezentace!F12=0,\"\",Prezentace!F12)","v":"Viktor"},{"$f":"IF(Prezentace!E12=0,\"\",Prezentace!E12)","v":"Fuksa  "},null,null,null,null,null,null,null,null,null,null,null,null,null,null,0]
[{"$f":"IF(Prezentace!A13=0,\"\",Prezentace!A13)","v":""},{"$f":"IF(Prezentace!B13=0,\"\",Prezentace!B13)","v":""},{"$f":"Prezentace!D13","v":"P"},{"$f":"IF(Prezentace!F13=0,\"\",Prezentace!F13)","v":"Milan"},{"$f":"IF(Prezentace!E13=0,\"\",Prezentace!E13)","v":"Matějka  ml."},null,null,null,null,null,null,null,null,null,null,null,null,null,null,0]
[{"$f":"IF(Prezentace!A14=0,\"\",Prezentace!A14)","v":""},{"$f":"IF(Prezentace!B14=0,\"\",Prezentace!B14)","v":""},{"$f":"Prezentace!D14","v":"P"},{"$f":"IF(Prezentace!F14=0,\"\",Prezentace!F14)","v":"Michal"},{"$f":"IF(Prezentace!E14=0,\"\",Prezentace!E14)","v":"Svoboda"},null,null,null,null,null,null,null,null,null,null,null,null,null,null,0]
[{"$f":"IF(Prezentace!A15=0,\"\",Prezentace!A15)","v":""},{"$f":"IF(Prezentace!B15=0,\"\",Prezentace!B15)","v":""},{"$f":"Prezentace!D15","v":"R"},{"$f":"IF(Prezentace!F15=0,\"\",Prezentace!F15)","v":"Lukáš"},{"$f":"IF(Prezentace!E15=0,\"\",Prezentace!E15)","v":"Bouda "},null,null,null,null,null,null,null,null,null,null,null,null,null,null,0]
[{"$f":"IF(Prezentace!A16=0,\"\",Prezentace!A16)","v":""},{"$f":"IF(Prezentace!B16=0,\"\",Prezentace!B16)","v":""},{"$f":"Prezentace!D16","v":"P"},{"$f":"IF(Prezentace!F16=0,\"\",Prezentace!F16)","v":"Lukáš"},{"$f":"IF(Prezentace!E16=0,\"\",Prezentace!E16)","v":"Bouda "},null,null,null,null,null,null,null,null,null,null,null,null,null,null,0]
[{"$f":"IF(Prezentace!A17=0,\"\",Prezentace!A17)","v":""},{"$f":"IF(Prezentace!B17=0,\"\",Prezentace!B17)","v":""},{"$f":"Prezentace!D17","v":"P"},{"$f":"IF(Prezentace!F17=0,\"\",Prezentace!F17)","v":"Pavel"},{"$f":"IF(Prezentace!E17=0,\"\",Prezentace!E17)","v":"Koltai"},null,null,null,null,null,null,null,null,null,null,null,null,null,null,0]
[{"$f":"IF(Prezentace!A18=0,\"\",Prezentace!A18)","v":""},{"$f":"IF(Prezentace!B18=0,\"\",Prezentace!B18)","v":""},{"$f":"Prezentace!D18","v":"P"},{"$f":"IF(Prezentace!F18=0,\"\",Prezentace!F18)","v":"Vladislav"},{"$f":"IF(Prezentace!E18=0,\"\",Prezentace!E18)","v":"Přibyl"},null,null,null,null,null,null,null,null,null,null,null,null,null,null,0]
[{"$f":"IF(Prezentace!A19=0,\"\",Prezentace!A19)","v":""},{"$f":"IF(Prezentace!B19=0,\"\",Prezentace!B19)","v":""},{"$f":"Prezentace!D19","v":"P"},{"$f":"IF(Prezentace!F19=0,\"\",Prezentace!F19)","v":"Milan"},{"$f":"IF(Prezentace!E19=0,\"\",Prezentace!E19)","v":"Matějka st."},null,null,null,null,null,null,null,null,null,null,null,null,null,null,0]
[{"$f":"IF(Prezentace!A20=0,\"\",Prezentace!A20)","v":""},{"$f":"IF(Prezentace!B20=0,\"\",Prezentace!B20)","v":""},{"$f":"Prezentace!D20","v":"P"},{"$f":"IF(Prezentace!F20=0,\"\",Prezentace!F20)","v":"Miroslav"},{"$f":"IF(Prezentace!E20=0,\"\",Prezentace!E20)","v":"Fiala  "},null,null,null,null,null,null,null,null,null,null,null,null,null,null,0]
[{"$f":"IF(Prezentace!A21=0,\"\",Prezentace!A21)","v":""},{"$f":"IF(Prezentace!B21=0,\"\",Prezentace!B21)","v":""},{"$f":"Prezentace!D21","v":"P"},{"$f":"IF(Prezentace!F21=0,\"\",Prezentace!F21)","v":"Karel"},{"$f":"IF(Prezentace!E21=0,\"\",Prezentace!E21)","v":"Gažák "},null,null,null,null,null,null,null,null,null,null,null,null,null,null,0]
[{"$f":"IF(Prezentace!A22=0,\"\",Prezentace!A22)","v":""},{"$f":"IF(Prezentace!B22=0,\"\",Prezentace!B22)","v":""},{"$f":"Prezentace!D22","v":"P"},{"$f":"IF(Prezentace!F22=0,\"\",Prezentace!F22)","v":"Václav"},{"$f":"IF(Prezentace!E22=0,\"\",Prezentace!E22)","v":"Landkammer"},null,null,null,null,null,null,null,null,null,null,null,null,null,null,0]
[{"$f":"IF(Prezentace!A23=0,\"\",Prezentace!A23)","v":""},{"$f":"IF(Prezentace!B23=0,\"\",Prezentace!B23)","v":""},{"$f":"Prezentace!D23","v":"P"},{"$f":"IF(Prezentace!F23=0,\"\",Prezentace!F23)","v":"Vojtěch"},{"$f":"IF(Prezentace!E23=0,\"\",Prezentace!E23)","v":"Brejžek "},null,null,null,null,null,null,null,null,null,null,null,null,null,null,0]
[{"$f":"IF(Prezentace!A24=0,\"\",Prezentace!A24)","v":""},{"$f":"IF(Prezentace!B24=0,\"\",Prezentace!B24)","v":""},{"$f":"Prezentace!D24","v":"P"},{"$f":"IF(Prezentace!F24=0,\"\",Prezentace!F24)","v":"Antonín"},{"$f":"IF(Prezentace!E24=0,\"\",Prezentace!E24)","v":"Urbanec  "},null,null,null,null,null,null,null,null,null,null,null,null,null,null,0]
[{"$f":"IF(Prezentace!A25=0,\"\",Prezentace!A25)","v":""},{"$f":"IF(Prezentace!B25=0,\"\",Prezentace!B25)","v":""},{"$f":"Prezentace!D25","v":"P"},{"$f":"IF(Prezentace!F25=0,\"\",Prezentace!F25)","v":"Milan"},{"$f":"IF(Prezentace!E25=0,\"\",Prezentace!E25)","v":"Jílek  "},null,null,null,null,null,null,null,null,null,null,null,null,null,null,0]
[{"$f":"IF(Prezentace!A26=0,\"\",Prezentace!A26)","v":""},{"$f":"IF(Prezentace!B26=0,\"\",Prezentace!B26)","v":""},{"$f":"Prezentace!D26","v":"P"},{"$f":"IF(Prezentace!F26=0,\"\",Prezentace!F26)","v":"Václav"},{"$f":"IF(Prezentace!E26=0,\"\",Prezentace!E26)","v":"Jírů"},null,null,null,null,null,null,null,null,null,null,null,null,null,null,0]
[{"$f":"IF(Prezentace!A27=0,\"\",Prezentace!A27)","v":""},{"$f":"IF(Prezentace!B27=0,\"\",Prezentace!B27)","v":""},{"$f":"Prezentace!D27","v":"P"},{"$f":"IF(Prezentace!F27=0,\"\",Prezentace!F27)","v":"Milan"},{"$f":"IF(Prezentace!E27=0,\"\",Prezentace!E27)","v":"Krupica"},null,null,null,null,null,null,null,null,null,null,null,null,null,null,0]
[{"$f":"IF(Prezentace!A28=0,\"\",Prezentace!A28)","v":""},{"$f":"IF(Prezentace!B28=0,\"\",Prezentace!B28)","v":""},{"$f":"Prezentace!D28","v":"R"},{"$f":"IF(Prezentace!F28=0,\"\",Prezentace!F28)","v":"Milan"},{"$f":"IF(Prezentace!E28=0,\"\",Prezentace!E28)","v":"Krupica "},null,null,null,null,null,null,null,null,null,null,null,null,null,null,0]
[{"$f":"IF(Prezentace!A29=0,\"\",Prezentace!A29)","v":""},{"$f":"IF(Prezentace!B29=0,\"\",Prezentace!B29)","v":""},{"$f":"Prezentace!D29","v":"P"},{"$f":"IF(Prezentace!F29=0,\"\",Prezentace!F29)","v":"Miloslav"},{"$f":"IF(Prezentace!E29=0,\"\",Prezentace!E29)","v":"Petržílka"},null,null,null,null,null,null,null,null,null,null,null,null,null,null,0]
[{"$f":"IF(Prezentace!A30=0,\"\",Prezentace!A30)","v":""},{"$f":"IF(Prezentace!B30=0,\"\",Prezentace!B30)","v":""},{"$f":"Prezentace!D30","v":"R"},{"$f":"IF(Prezentace!F30=0,\"\",Prezentace!F30)","v":"Aleš"},{"$f":"IF(Prezentace!E30=0,\"\",Prezentace!E30)","v":"Seitl "},null,null,null,null,null,null,null,null,null,null,null,null,null,null,0]
[{"$f":"IF(Prezentace!A31=0,\"\",Prezentace!A31)","v":""},{"$f":"IF(Prezentace!B31=0,\"\",Prezentace!B31)","v":""},{"$f":"Prezentace!D31","v":"P"},{"$f":"IF(Prezentace!F31=0,\"\",Prezentace!F31)","v":"Aleš"},{"$f":"IF(Prezentace!E31=0,\"\",Prezentace!E31)","v":"Seitl "},null,null,null,null,null,null,null,null,null,null,null,null,null,null,0]
[{"$f":"IF(Prezentace!A32=0,\"\",Prezentace!A32)","v":""},{"$f":"IF(Prezentace!B32=0,\"\",Prezentace!B32)","v":""},{"$f":"Prezentace!D32","v":"P"},{"$f":"IF(Prezentace!F32=0,\"\",Prezentace!F32)","v":"Karel"},{"$f":"IF(Prezentace!E32=0,\"\",Prezentace!E32)","v":"Seitl"},null,null,null,null,null,null,null,null,null,null,null,null,null,null,0]
[{"$f":"IF(Prezentace!A33=0,\"\",Prezentace!A33)","v":""},{"$f":"IF(Prezentace!B33=0,\"\",Prezentace!B33)","v":""},{"$f":"Prezentace!D33","v":"P"},{"$f":"IF(Prezentace!F33=0,\"\",Prezentace!F33)","v":"David"},{"$f":"IF(Prezentace!E33=0,\"\",Prezentace!E33)","v":"Nikodým"},null,null,null,null,null,null,null,null,null,null,null,null,null,null,0]
[{"$f":"IF(Prezentace!A34=0,\"\",Prezentace!A34)","v":""},{"$f":"IF(Prezentace!B34=0,\"\",Prezentace!B34)","v":""},{"$f":"Prezentace!D34","v":"R"},{"$f":"IF(Prezentace!F34=0,\"\",Prezentace!F34)","v":"David"},{"$f":"IF(Prezentace!E34=0,\"\",Prezentace!E34)","v":"Nikodým "},null,null,null,null,null,null,null,null,null,null,null,null,null,null,0]
[{"$f":"IF(Prezentace!A35=0,\"\",Prezentace!A35)","v":""},{"$f":"IF(Prezentace!B35=0,\"\",Prezentace!B35)","v":""},{"$f":"Prezentace!D35","v":"P"},{"$f":"IF(Prezentace!F35=0,\"\",Prezentace!F35)","v":"Lukáš"},{"$f":"IF(Prezentace!E35=0,\"\",Prezentace!E35)","v":"Hobza"},null,null,null,null,null,null,null,null,null,null,null,null,null,null,0]
[{"$f":"IF(Prezentace!A36=0,\"\",Prezentace!A36)","v":""},{"$f":"IF(Prezentace!B36=0,\"\",Prezentace!B36)","v":""},{"$f":"Prezentace!D36","v":"P"},{"$f":"IF(Prezentace!F36=0,\"\",Prezentace!F36)","v":"Antonín"},{"$f":"IF(Prezentace!E36=0,\"\",Prezentace!E36)","v":"Jelínek "},null,null,null,null,null,null,null,null,null,null,null,null,null,null,0]
[{"$f":"IF(Prezentace!A37=0,\"\",Prezentace!A37)","v":""},{"$f":"IF(Prezentace!B37=0,\"\",Prezentace!B37)","v":""},{"$f":"Prezentace!D37","v":"R"},{"$f":"IF(Prezentace!F37=0,\"\",Prezentace!F37)","v":"Antonín"},{"$f":"IF(Prezentace!E37=0,\"\",Prezentace!E37)","v":"Jelínek "},null,null,null,null,null,null,null,null,null,null,null,null,null,null,0]
[{"$f":"IF(Prezentace!A38=0,\"\",Prezentace!A38)","v":""},{"$f":"IF(Prezentace!B38=0,\"\",Prezentace!B38)","v":""},{"$f":"Prezentace!D38","v":"P"},{"$f":"IF(Prezentace!F38=0,\"\",Prezentace!F38)","v":"Ladislav"},{"$f":"IF(Prezentace!E38=0,\"\",Prezentace!E38)","v":"Píša "},null,null,null,null,null,null,null,null,null,null,null,null,null,null,0]
[{"$f":"IF(Prezentace!A39=0,\"\",Prezentace!A39)","v":""},{"$f":"IF(Prezentace!B39=0,\"\",Prezentace!B39)","v":""},{"$f":"Prezentace!D39","v":"P"},{"$f":"IF(Prezentace!F39=0,\"\",Prezentace!F39)","v":"Štefan"},{"$f":"IF(Prezentace!E39=0,\"\",Prezentace!E39)","v":"Mesároš"},null,null,null,null,null,null,null,null,null,null,null,null,null,null,0]
[{"$f":"IF(Prezentace!A40=0,\"\",Prezentace!A40)","v":""},{"$f":"IF(Prezentace!B40=0,\"\",Prezentace!B40)","v":""},{"$f":"Prezentace!D40","v":"P"},{"$f":"IF(Prezentace!F40=0,\"\",Prezentace!F40)","v":"Pavel"},{"$f":"IF(Prezentace!E40=0,\"\",Prezentace!E40)","v":"Červenka"},null,null,null,null,null,null,null,null,null,null,null,null,null,null,{"$f":"(SUM(F38*$F$3,G38*$G$3,H38*$H$3,I38*$I$3,J38*$J$3,K38*$K$3,L38*$L$3,M38*$M$3,N38*$N$3,O38*$O$3,P38*$P$3,Q38*$Q$3,R38*$R$3))-S38","v":0}]
[{"$f":"IF(Prezentace!A41=0,\"\",Prezentace!A41)","v":""},{"$f":"IF(Prezentace!B41=0,\"\",Prezentace!B41)","v":""},{"$f":"Prezentace!D41","v":"R"},{"$f":"IF(Prezentace!F41=0,\"\",Prezentace!F41)","v":"Pavel"},{"$f":"IF(Prezentace!E41=0,\"\",Prezentace!E41)","v":"Červenka "},null,null,null,null,null,null,null,null,null,null,null,null,null,null,0]
[{"$f":"IF(Prezentace!A42=0,\"\",Prezentace!A42)","v":""},{"$f":"IF(Prezentace!B42=0,\"\",Prezentace!B42)","v":""},{"$f":"Prezentace!D42","v":"P"},{"$f":"IF(Prezentace!F42=0,\"\",Prezentace!F42)","v":"Jiří"},{"$f":"IF(Prezentace!E42=0,\"\",Prezentace!E42)","v":"Švihálek "},null,null,null,null,null,null,null,null,null,null,null,null,null,null,0]
[{"$f":"IF(Prezentace!A43=0,\"\",Prezentace!A43)","v":""},{"$f":"IF(Prezentace!B43=0,\"\",Prezentace!B43)","v":""},{"$f":"Prezentace!D43","v":"R"},{"$f":"IF(Prezentace!F43=0,\"\",Prezentace!F43)","v":"Jiří"},{"$f":"IF(Prezentace!E43=0,\"\",Prezentace!E43)","v":"Švihálek "},null,null,null,null,null,null,null,null,null,null,null,null,null,null,0]
[{"$f":"IF(Prezentace!A44=0,\"\",Prezentace!A44)","v":""},{"$f":"IF(Prezentace!B44=0,\"\",Prezentace!B44)","v":""},{"$f":"Prezentace!D44","v":"P"},{"$f":"IF(Prezentace!F44=0,\"\",Prezentace!F44)","v":"František"},{"$f":"IF(Prezentace!E44=0,\"\",Prezentace!E44)","v":"Toman "},null,null,null,null,null,null,null,null,null,null,null,null,null,null,0]
[{"$f":"IF(Prezentace!A45=0,\"\",Prezentace!A45)","v":""},{"$f":"IF(Prezentace!B45=0,\"\",Prezentace!B45)","v":""},{"$f":"Prezentace!D45","v":"P"},{"$f":"IF(Prezentace!F45=0,\"\",Prezentace!F45)","v":"Vladimír"},{"$f":"IF(Prezentace!E45=0,\"\",Prezentace!E45)","v":"VejslíK "},null,null,null,null,null,null,null,null,null,null,null,null,null,null,0]
[{"$f":"IF(Prezentace!A46=0,\"\",Prezentace!A46)","v":""},{"$f":"IF(Prezentace!B46=0,\"\",Prezentace!B46)","v":""},{"$f":"Prezentace!D46","v":"P"},{"$f":"IF(Prezentace!F46=0,\"\",Prezentace!F46)","v":"Karel"},{"$f":"IF(Prezentace!E46=0,\"\",Prezentace!E46)","v":"Získal "},null,null,null,null,null,null,null,null,null,null,null,null,null,null,0]
[{"$f":"IF(Prezentace!A47=0,\"\",Prezentace!A47)","v":""},{"$f":"IF(Prezentace!B47=0,\"\",Prezentace!B47)","v":""},{"$f":"Prezentace!D47","v":"R"},{"$f":"IF(Prezentace!F47=0,\"\",Prezentace!F47)","v":"Karel"},{"$f":"IF(Prezentace!E47=0,\"\",Prezentace!E47)","v":"Získal "},null,null,null,null,null,null,null,null,null,null,null,null,null,null,0]
[{"$f":"IF(Prezentace!A48=0,\"\",Prezentace!A48)","v":""},{"$f":"IF(Prezentace!B48=0,\"\",Prezentace!B48)","v":""},{"$f":"Prezentace!D48","v":"P"},{"$f":"IF(Prezentace!F48=0,\"\",Prezentace!F48)","v":"Jaroslav"},{"$f":"IF(Prezentace!E48=0,\"\",Prezentace!E48)","v":"Sokolík "},null,null,null,null,null,null,null,null,null,null,null,null,null,null,0]
[{"$f":"IF(Prezentace!A49=0,\"\",Prezentace!A49)","v":""},{"$f":"IF(Prezentace!B49=0,\"\",Prezentace!B49)","v":""},{"$f":"Prezentace!D49","v":"P"},{"$f":"IF(Prezentace!F49=0,\"\",Prezentace!F49)","v":"Milan"},{"$f":"IF(Prezentace!E49=0,\"\",Prezentace!E49)","v":"Kraus "},null,null,null,null,null,null,null,null,null,null,null,null,null,null,0]
[{"$f":"IF(Prezentace!A50=0,\"\",Prezentace!A50)","v":""},{"$f":"IF(Prezentace!B50=0,\"\",Prezentace!B50)","v":""},{"$f":"Prezentace!D50","v":"P"},{"$f":"IF(Prezentace!F50=0,\"\",Prezentace!F50)","v":""},{"$f":"IF(Prezentace!E50=0,\"\",Prezentace!E50)","v":""},null,null,null,null,null,null,null,null,null,null,null,null,null,null,0]
[{"$f":"IF(Prezentace!A51=0,\"\",Prezentace!A51)","v":""},{"$f":"IF(Prezentace!B51=0,\"\",Prezentace!B51)","v":""},{"$f":"Prezentace!D51","v":"P"},{"$f":"IF(Prezentace!F51=0,\"\",Prezentace!F51)","v":""},{"$f":"IF(Prezentace!E51=0,\"\",Prezentace!E51)","v":""},null,null,null,null,null,null,null,null,null,null,null,null,null,null,0]
[{"$f":"IF(Prezentace!A52=0,\"\",Prezentace!A52)","v":""},{"$f":"IF(Prezentace!B52=0,\"\",Prezentace!B52)","v":""},{"$f":"Prezentace!D52","v":"P"},{"$f":"IF(Prezentace!F52=0,\"\",Prezentace!F52)","v":""},{"$f":"IF(Prezentace!E52=0,\"\",Prezentace!E52)","v":""},null,null,null,null,null,null,null,null,null,null,null,null,null,null,0]
[{"$f":"IF(Prezentace!A53=0,\"\",Prezentace!A53)","v":""},{"$f":"IF(Prezentace!B53=0,\"\",Prezentace!B53)","v":""},{"$f":"Prezentace!D53","v":"P"},{"$f":"IF(Prezentace!F53=0,\"\",Prezentace!F53)","v":""},{"$f":"IF(Prezentace!E53=0,\"\",Prezentace!E53)","v":""},null,null,null,null,null,null,null,null,null,null,null,null,null,null,0]
[{"$f":"IF(Prezentace!A54=0,\"\",Prezentace!A54)","v":""},{"$f":"IF(Prezentace!B54=0,\"\",Prezentace!B54)","v":""},{"$f":"Prezentace!D54","v":"P"},{"$f":"IF(Prezentace!F54=0,\"\",Prezentace!F54)","v":""},{"$f":"IF(Prezentace!E54=0,\"\",Prezentace!E54)","v":""},null,null,null,null,null,null,null,null,null,null,null,null,null,null,0]
[{"$f":"IF(Prezentace!A55=0,\"\",Prezentace!A55)","v":""},{"$f":"IF(Prezentace!B55=0,\"\",Prezentace!B55)","v":""},{"$f":"Prezentace!D55","v":"P"},{"$f":"IF(Prezentace!F55=0,\"\",Prezentace!F55)","v":""},{"$f":"IF(Prezentace!E55=0,\"\",Prezentace!E55)","v":""},null,null,null,null,null,null,null,null,null,null,null,null,null,null,0]
[{"$f":"IF(Prezentace!A56=0,\"\",Prezentace!A56)","v":""},{"$f":"IF(Prezentace!B56=0,\"\",Prezentace!B56)","v":""},{"$f":"Prezentace!D56","v":"P"},{"$f":"IF(Prezentace!F56=0,\"\",Prezentace!F56)","v":""},{"$f":"IF(Prezentace!E56=0,\"\",Prezentace!E56)","v":""},null,null,null,null,null,null,null,null,null,null,null,null,null,null,0]
[{"$f":"IF(Prezentace!A57=0,\"\",Prezentace!A57)","v":""},{"$f":"IF(Prezentace!B57=0,\"\",Prezentace!B57)","v":""},{"$f":"Prezentace!D57","v":"P"},{"$f":"IF(Prezentace!F57=0,\"\",Prezentace!F57)","v":""},{"$f":"IF(Prezentace!E57=0,\"\",Prezentace!E57)","v":""},null,null,null,null,null,null,null,null,null,null,null,null,null,null,0]
[{"$f":"IF(Prezentace!A58=0,\"\",Prezentace!A58)","v":""},{"$f":"IF(Prezentace!B58=0,\"\",Prezentace!B58)","v":""},{"$f":"Prezentace!D58","v":"P"},{"$f":"IF(Prezentace!F58=0,\"\",Prezentace!F58)","v":""},{"$f":"IF(Prezentace!E58=0,\"\",Prezentace!E58)","v":""},null,null,null,null,null,null,null,null,null,null,null,null,null,null,0]
[{"$f":"IF(Prezentace!A59=0,\"\",Prezentace!A59)","v":""},{"$f":"IF(Prezentace!B59=0,\"\",Prezentace!B59)","v":""},{"$f":"Prezentace!D59","v":"P"},{"$f":"IF(Prezentace!F59=0,\"\",Prezentace!F59)","v":""},{"$f":"IF(Prezentace!E59=0,\"\",Prezentace!E59)","v":""},null,null,null,null,null,null,null,null,null,null,null,null,null,null,0]
[{"$f":"IF(Prezentace!A60=0,\"\",Prezentace!A60)","v":""},{"$f":"IF(Prezentace!B60=0,\"\",Prezentace!B60)","v":""},{"$f":"Prezentace!D60","v":"P"},{"$f":"IF(Prezentace!F60=0,\"\",Prezentace!F60)","v":""},{"$f":"IF(Prezentace!E60=0,\"\",Prezentace!E60)","v":""},null,null,null,null,null,null,null,null,null,null,null,null,null,null,0]
[{"$f":"IF(Prezentace!A61=0,\"\",Prezentace!A61)","v":""},{"$f":"IF(Prezentace!B61=0,\"\",Prezentace!B61)","v":""},{"$f":"Prezentace!D61","v":"P"},{"$f":"IF(Prezentace!F61=0,\"\",Prezentace!F61)","v":""},{"$f":"IF(Prezentace!E61=0,\"\",Prezentace!E61)","v":""},null,null,null,null,null,null,null,null,null,null,null,null,null,null,0]
[{"$f":"IF(Prezentace!A62=0,\"\",Prezentace!A62)","v":""},{"$f":"IF(Prezentace!B62=0,\"\",Prezentace!B62)","v":""},{"$f":"Prezentace!D62","v":"P"},{"$f":"IF(Prezentace!F62=0,\"\",Prezentace!F62)","v":""},{"$f":"IF(Prezentace!E62=0,\"\",Prezentace!E62)","v":""},null,null,null,null,null,null,null,null,null,null,null,null,null,null,0]
[{"$f":"IF(Prezentace!A63=0,\"\",Prezentace!A63)","v":""},{"$f":"IF(Prezentace!B63=0,\"\",Prezentace!B63)","v":""},{"$f":"Prezentace!D63","v":"P"},{"$f":"IF(Prezentace!F63=0,\"\",Prezentace!F63)","v":""},{"$f":"IF(Prezentace!E63=0,\"\",Prezentace!E63)","v":""},null,null,null,null,null,null,null,null,null,null,null,null,null,null,0]
[{"$f":"IF(Prezentace!A64=0,\"\",Prezentace!A64)","v":""},{"$f":"IF(Prezentace!B64=0,\"\",Prezentace!B64)","v":""},{"$f":"Prezentace!D64","v":"P"},{"$f":"IF(Prezentace!F64=0,\"\",Prezentace!F64)","v":""},{"$f":"IF(Prezentace!E64=0,\"\",Prezentace!E64)","v":""},null,null,null,null,null,null,null,null,null,null,null,null,null,null,0]
[{"$f":"IF(Prezentace!A65=0,\"\",Prezentace!A65)","v":""},{"$f":"IF(Prezentace!B65=0,\"\",Prezentace!B65)","v":""},{"$f":"Prezentace!D65","v":"P"},{"$f":"IF(Prezentace!F65=0,\"\",Prezentace!F65)","v":""},{"$f":"IF(Prezentace!E65=0,\"\",Prezentace!E65)","v":""},null,null,null,null,null,null,null,null,null,null,null,null,null,null,0]
[{"$f":"IF(Prezentace!A66=0,\"\",Prezentace!A66)","v":""},{"$f":"IF(Prezentace!B66=0,\"\",Prezentace!B66)","v":""},{"$f":"Prezentace!D66","v":"P"},{"$f":"IF(Prezentace!F66=0,\"\",Prezentace!F66)","v":""},{"$f":"IF(Prezentace!E66=0,\"\",Prezentace!E66)","v":""},null,null,null,null,null,null,null,null,null,null,null,null,null,null,0]
[{"$f":"IF(Prezentace!A67=0,\"\",Prezentace!A67)","v":""},{"$f":"IF(Prezentace!B67=0,\"\",Prezentace!B67)","v":""},{"$f":"Prezentace!D67","v":"P"},{"$f":"IF(Prezentace!F67=0,\"\",Prezentace!F67)","v":""},{"$f":"IF(Prezentace!E67=0,\"\",Prezentace!E67)","v":""},null,null,null,null,null,null,null,null,null,null,null,null,null,null,0]
[{"$f":"IF(Prezentace!A68=0,\"\",Prezentace!A68)","v":""},{"$f":"IF(Prezentace!B68=0,\"\",Prezentace!B68)","v":""},{"$f":"Prezentace!D68","v":"P"},{"$f":"IF(Prezentace!F68=0,\"\",Prezentace!F68)","v":""},{"$f":"IF(Prezentace!E68=0,\"\",Prezentace!E68)","v":""},null,null,null,null,null,null,null,null,null,null,null,null,null,null,0]
[{"$f":"IF(Prezentace!A69=0,\"\",Prezentace!A69)","v":""},{"$f":"IF(Prezentace!B69=0,\"\",Prezentace!B69)","v":""},{"$f":"Prezentace!D69","v":"P"},{"$f":"IF(Prezentace!F69=0,\"\",Prezentace!F69)","v":""},{"$f":"IF(Prezentace!E69=0,\"\",Prezentace!E69)","v":""},null,null,null,null,null,null,null,null,null,null,null,null,null,null,0]
[{"$f":"IF(Prezentace!A70=0,\"\",Prezentace!A70)","v":""},{"$f":"IF(Prezentace!B70=0,\"\",Prezentace!B70)","v":""},{"$f":"Prezentace!D70","v":"P"},{"$f":"IF(Prezentace!F70=0,\"\",Prezentace!F70)","v":""},{"$f":"IF(Prezentace!E70=0,\"\",Prezentace!E70)","v":""},null,null,null,null,null,null,null,null,null,null,null,null,null,null,0]
[{"$f":"IF(Prezentace!A71=0,\"\",Prezentace!A71)","v":""},{"$f":"IF(Prezentace!B71=0,\"\",Prezentace!B71)","v":""},{"$f":"Prezentace!D71","v":"P"},{"$f":"IF(Prezentace!F71=0,\"\",Prezentace!F71)","v":""},{"$f":"IF(Prezentace!E71=0,\"\",Prezentace!E71)","v":""},null,null,null,null,null,null,null,null,null,null,null,null,null,null,0]
[{"$f":"IF(Prezentace!A72=0,\"\",Prezentace!A72)","v":""},{"$f":"IF(Prezentace!B72=0,\"\",Prezentace!B72)","v":""},{"$f":"Prezentace!D72","v":"P"},{"$f":"IF(Prezentace!F72=0,\"\",Prezentace!F72)","v":""},{"$f":"IF(Prezentace!E72=0,\"\",Prezentace!E72)","v":""},null,null,null,null,null,null,null,null,null,null,null,null,null,null,0]
[{"$f":"IF(Prezentace!A73=0,\"\",Prezentace!A73)","v":""},{"$f":"IF(Prezentace!B73=0,\"\",Prezentace!B73)","v":""},{"$f":"Prezentace!D73","v":"P"},{"$f":"IF(Prezentace!F73=0,\"\",Prezentace!F73)","v":""},{"$f":"IF(Prezentace!E73=0,\"\",Prezentace!E73)","v":""},null,null,null,null,null,null,null,null,null,null,null,null,null,null,0]
[{"$f":"IF(Prezentace!A74=0,\"\",Prezentace!A74)","v":""},{"$f":"IF(Prezentace!B74=0,\"\",Prezentace!B74)","v":""},{"$f":"Prezentace!D74","v":"P"},{"$f":"IF(Prezentace!F74=0,\"\",Prezentace!F74)","v":""},{"$f":"IF(Prezentace!E74=0,\"\",Prezentace!E74)","v":""},null,null,null,null,null,null,null,null,null,null,null,null,null,null,0]
[{"$f":"IF(Prezentace!A75=0,\"\",Prezentace!A75)","v":""},{"$f":"IF(Prezentace!B75=0,\"\",Prezentace!B75)","v":""},{"$f":"Prezentace!D75","v":"P"},{"$f":"IF(Prezentace!F75=0,\"\",Prezentace!F75)","v":""},{"$f":"IF(Prezentace!E75=0,\"\",Prezentace!E75)","v":""},null,null,null,null,null,null,null,null,null,null,null,null,null,null,0]
[{"$f":"IF(Prezentace!A76=0,\"\",Prezentace!A76)","v":""},{"$f":"IF(Prezentace!B76=0,\"\",Prezentace!B76)","v":""},{"$f":"Prezentace!D76","v":"P"},{"$f":"IF(Prezentace!F76=0,\"\",Prezentace!F76)","v":""},{"$f":"IF(Prezentace!E76=0,\"\",Prezentace!E76)","v":""},null,null,null,null,null,null,null,null,null,null,null,null,null,null,0]
[{"$f":"IF(Prezentace!A77=0,\"\",Prezentace!A77)","v":""},{"$f":"IF(Prezentace!B77=0,\"\",Prezentace!B77)","v":""},{"$f":"Prezentace!D77","v":"P"},{"$f":"IF(Prezentace!F77=0,\"\",Prezentace!F77)","v":""},{"$f":"IF(Prezentace!E77=0,\"\",Prezentace!E77)","v":""},null,null,null,null,null,null,null,null,null,null,null,null,null,null,0]
[{"$f":"IF(Prezentace!A78=0,\"\",Prezentace!A78)","v":""},{"$f":"IF(Prezentace!B78=0,\"\",Prezentace!B78)","v":""},{"$f":"Prezentace!D78","v":"P"},{"$f":"IF(Prezentace!F78=0,\"\",Prezentace!F78)","v":""},{"$f":"IF(Prezentace!E78=0,\"\",Prezentace!E78)","v":""},null,null,null,null,null,null,null,null,null,null,null,null,null,null,0]
[{"$f":"IF(Prezentace!A79=0,\"\",Prezentace!A79)","v":""},{"$f":"IF(Prezentace!B79=0,\"\",Prezentace!B79)","v":""},{"$f":"Prezentace!D79","v":"P"},{"$f":"IF(Prezentace!F79=0,\"\",Prezentace!F79)","v":""},{"$f":"IF(Prezentace!E79=0,\"\",Prezentace!E79)","v":""},null,null,null,null,null,null,null,null,null,null,null,null,null,null,0]
[{"$f":"IF(Prezentace!A80=0,\"\",Prezentace!A80)","v":""},{"$f":"IF(Prezentace!B80=0,\"\",Prezentace!B80)","v":""},{"$f":"Prezentace!D80","v":"P"},{"$f":"IF(Prezentace!F80=0,\"\",Prezentace!F80)","v":""},{"$f":"IF(Prezentace!E80=0,\"\",Prezentace!E80)","v":""},null,null,null,null,null,null,null,null,null,null,null,null,null,null,0]
[{"$f":"IF(Prezentace!A81=0,\"\",Prezentace!A81)","v":""},{"$f":"IF(Prezentace!B81=0,\"\",Prezentace!B81)","v":""},{"$f":"Prezentace!D81","v":"P"},{"$f":"IF(Prezentace!F81=0,\"\",Prezentace!F81)","v":""},{"$f":"IF(Prezentace!E81=0,\"\",Prezentace!E81)","v":""},null,null,null,null,null,null,null,null,null,null,null,null,null,null,0]
[{"$f":"IF(Prezentace!A82=0,\"\",Prezentace!A82)","v":""},{"$f":"IF(Prezentace!B82=0,\"\",Prezentace!B82)","v":""},{"$f":"Prezentace!D82","v":"P"},{"$f":"IF(Prezentace!F82=0,\"\",Prezentace!F82)","v":""},{"$f":"IF(Prezentace!E82=0,\"\",Prezentace!E82)","v":""},null,null,null,null,null,null,null,null,null,null,null,null,null,null,0]
[{"$f":"IF(Prezentace!A83=0,\"\",Prezentace!A83)","v":""},{"$f":"IF(Prezentace!B83=0,\"\",Prezentace!B83)","v":""},{"$f":"Prezentace!D83","v":"P"},{"$f":"IF(Prezentace!F83=0,\"\",Prezentace!F83)","v":""},{"$f":"IF(Prezentace!E83=0,\"\",Prezentace!E83)","v":""},null,null,null,null,null,null,null,null,null,null,null,null,null,null,0]
[{"$f":"IF(Prezentace!A84=0,\"\",Prezentace!A84)","v":""},{"$f":"IF(Prezentace!B84=0,\"\",Prezentace!B84)","v":""},{"$f":"Prezentace!D84","v":"P"},{"$f":"IF(Prezentace!F84=0,\"\",Prezentace!F84)","v":""},{"$f":"IF(Prezentace!E84=0,\"\",Prezentace!E84)","v":""},null,null,null,null,null,null,null,null,null,null,null,null,null,null,0]
[{"$f":"IF(Prezentace!A85=0,\"\",Prezentace!A85)","v":""},{"$f":"IF(Prezentace!B85=0,\"\",Prezentace!B85)","v":""},{"$f":"Prezentace!D85","v":"P"},{"$f":"IF(Prezentace!F85=0,\"\",Prezentace!F85)","v":""},{"$f":"IF(Prezentace!E85=0,\"\",Prezentace!E85)","v":""},null,null,null,null,null,null,null,null,null,null,null,null,null,null,0]
[{"$f":"IF(Prezentace!A86=0,\"\",Prezentace!A86)","v":""},{"$f":"IF(Prezentace!B86=0,\"\",Prezentace!B86)","v":""},{"$f":"Prezentace!D86","v":"P"},{"$f":"IF(Prezentace!F86=0,\"\",Prezentace!F86)","v":""},{"$f":"IF(Prezentace!E86=0,\"\",Prezentace!E86)","v":""},null,null,null,null,null,null,null,null,null,null,null,null,null,null,0]
[{"$f":"IF(Prezentace!A87=0,\"\",Prezentace!A87)","v":""},{"$f":"IF(Prezentace!B87=0,\"\",Prezentace!B87)","v":""},{"$f":"Prezentace!D87","v":"P"},{"$f":"IF(Prezentace!F87=0,\"\",Prezentace!F87)","v":""},{"$f":"IF(Prezentace!E87=0,\"\",Prezentace!E87)","v":""},null,null,null,null,null,null,null,null,null,null,null,null,null,null,0]
[{"$f":"IF(Prezentace!A88=0,\"\",Prezentace!A88)","v":""},{"$f":"IF(Prezentace!B88=0,\"\",Prezentace!B88)","v":""},{"$f":"Prezentace!D88","v":"P"},{"$f":"IF(Prezentace!F88=0,\"\",Prezentace!F88)","v":""},{"$f":"IF(Prezentace!E88=0,\"\",Prezentace!E88)","v":""},null,null,null,null,null,null,null,null,null,null,null,null,null,null,0]
[{"$f":"IF(Prezentace!A89=0,\"\",Prezentace!A89)","v":""},{"$f":"IF(Prezentace!B89=0,\"\",Prezentace!B89)","v":""},{"$f":"Prezentace!D89","v":"P"},{"$f":"IF(Prezentace!F89=0,\"\",Prezentace!F89)","v":""},{"$f":"IF(Prezentace!E89=0,\"\",Prezentace!E89)","v":""},null,null,null,null,null,null,null,null,null,null,null,null,null,null,0]
[{"$f":"IF(Prezentace!A90=0,\"\",Prezentace!A90)","v":""},{"$f":"IF(Prezentace!B90=0,\"\",Prezentace!B90)","v":""},{"$f":"Prezentace!D90","v":"P"},{"$f":"IF(Prezentace!F90=0,\"\",Prezentace!F90)","v":""},{"$f":"IF(Prezentace!E90=0,\"\",Prezentace!E90)","v":""},null,null,null,null,null,null,null,null,null,null,null,null,null,null,0]
[{"$f":"IF(Prezentace!A91=0,\"\",Prezentace!A91)","v":""},{"$f":"IF(Prezentace!B91=0,\"\",Prezentace!B91)","v":""},{"$f":"Prezentace!D91","v":"P"},{"$f":"IF(Prezentace!F91=0,\"\",Prezentace!F91)","v":""},{"$f":"IF(Prezentace!E91=0,\"\",Prezentace!E91)","v":""},null,null,null,null,null,null,null,null,null,null,null,null,null,null,0]
[{"$f":"IF(Prezentace!A92=0,\"\",Prezentace!A92)","v":""},{"$f":"IF(Prezentace!B92=0,\"\",Prezentace!B92)","v":""},{"$f":"Prezentace!D92","v":"P"},{"$f":"IF(Prezentace!F92=0,\"\",Prezentace!F92)","v":""},{"$f":"IF(Prezentace!E92=0,\"\",Prezentace!E92)","v":""},null,null,null,null,null,null,null,null,null,null,null,null,null,null,0]
[{"$f":"IF(Prezentace!A93=0,\"\",Prezentace!A93)","v":""},{"$f":"IF(Prezentace!B93=0,\"\",Prezentace!B93)","v":""},{"$f":"Prezentace!D93","v":"P"},{"$f":"IF(Prezentace!F93=0,\"\",Prezentace!F93)","v":""},{"$f":"IF(Prezentace!E93=0,\"\",Prezentace!E93)","v":""},null,null,null,null,null,null,null,null,null,null,null,null,null,null,0]
[{"$f":"IF(Prezentace!A94=0,\"\",Prezentace!A94)","v":""},{"$f":"IF(Prezentace!B94=0,\"\",Prezentace!B94)","v":""},{"$f":"Prezentace!D94","v":"P"},{"$f":"IF(Prezentace!F94=0,\"\",Prezentace!F94)","v":""},{"$f":"IF(Prezentace!E94=0,\"\",Prezentace!E94)","v":""},null,null,null,null,null,null,null,null,null,null,null,null,null,null,0]
[{"$f":"IF(Prezentace!A95=0,\"\",Prezentace!A95)","v":""},{"$f":"IF(Prezentace!B95=0,\"\",Prezentace!B95)","v":""},{"$f":"Prezentace!D95","v":"P"},{"$f":"IF(Prezentace!F95=0,\"\",Prezentace!F95)","v":""},{"$f":"IF(Prezentace!E95=0,\"\",Prezentace!E95)","v":""},null,null,null,null,null,null,null,null,null,null,null,null,null,null,0]
[{"$f":"IF(Prezentace!A96=0,\"\",Prezentace!A96)","v":""},{"$f":"IF(Prezentace!B96=0,\"\",Prezentace!B96)","v":""},{"$f":"Prezentace!D96","v":"P"},{"$f":"IF(Prezentace!F96=0,\"\",Prezentace!F96)","v":""},{"$f":"IF(Prezentace!E96=0,\"\",Prezentace!E96)","v":""},null,null,null,null,null,null,null,null,null,null,null,null,null,null,0]
[{"$f":"IF(Prezentace!A97=0,\"\",Prezentace!A97)","v":""},{"$f":"IF(Prezentace!B97=0,\"\",Prezentace!B97)","v":""},{"$f":"Prezentace!D97","v":"P"},{"$f":"IF(Prezentace!F97=0,\"\",Prezentace!F97)","v":""},{"$f":"IF(Prezentace!E97=0,\"\",Prezentace!E97)","v":""},null,null,null,null,null,null,null,null,null,null,null,null,null,null,0]
[{"$f":"IF(Prezentace!A98=0,\"\",Prezentace!A98)","v":""},{"$f":"IF(Prezentace!B98=0,\"\",Prezentace!B98)","v":""},{"$f":"Prezentace!D98","v":"P"},{"$f":"IF(Prezentace!F98=0,\"\",Prezentace!F98)","v":""},{"$f":"IF(Prezentace!E98=0,\"\",Prezentace!E98)","v":""},null,null,null,null,null,null,null,null,null,null,null,null,null,null,0]
[{"$f":"IF(Prezentace!A99=0,\"\",Prezentace!A99)","v":""},{"$f":"IF(Prezentace!B99=0,\"\",Prezentace!B99)","v":""},{"$f":"Prezentace!D99","v":"P"},{"$f":"IF(Prezentace!F99=0,\"\",Prezentace!F99)","v":""},{"$f":"IF(Prezentace!E99=0,\"\",Prezentace!E99)","v":""},null,null,null,null,null,null,null,null,null,null,null,null,null,null,0]
[{"$f":"IF(Prezentace!A100=0,\"\",Prezentace!A100)","v":""},{"$f":"IF(Prezentace!B100=0,\"\",Prezentace!B100)","v":""},{"$f":"Prezentace!D100","v":"P"},{"$f":"IF(Prezentace!F100=0,\"\",Prezentace!F100)","v":""},{"$f":"IF(Prezentace!E100=0,\"\",Prezentace!E100)","v":""},null,null,null,null,null,null,null,null,null,null,null,null,null,null,0]
[{"$f":"IF(Prezentace!A101=0,\"\",Prezentace!A101)","v":""},{"$f":"IF(Prezentace!B101=0,\"\",Prezentace!B101)","v":""},{"$f":"Prezentace!D101","v":"P"},{"$f":"IF(Prezentace!F101=0,\"\",Prezentace!F101)","v":""},{"$f":"IF(Prezentace!E101=0,\"\",Prezentace!E101)","v":""},null,null,null,null,null,null,null,null,null,null,null,null,null,null,0]
[{"$f":"IF(Prezentace!A102=0,\"\",Prezentace!A102)","v":""},{"$f":"IF(Prezentace!B102=0,\"\",Prezentace!B102)","v":""},{"$f":"Prezentace!D102","v":"P"},{"$f":"IF(Prezentace!F102=0,\"\",Prezentace!F102)","v":""},{"$f":"IF(Prezentace!E102=0,\"\",Prezentace!E102)","v":""},null,null,null,null,null,null,null,null,null,null,null,null,null,null,0]
[{"$f":"IF(Prezentace!A103=0,\"\",Prezentace!A103)","v":""},{"$f":"IF(Prezentace!B103=0,\"\",Prezentace!B103)","v":""},{"$f":"Prezentace!D103","v":"P"},{"$f":"IF(Prezentace!F103=0,\"\",Prezentace!F103)","v":""},{"$f":"IF(Prezentace!E103=0,\"\",Prezentace!E103)","v":""},null,null,null,null,null,null,null,null,null,null,null,null,null,null,0]
[{"$f":"IF(Prezentace!A104=0,\"\",Prezentace!A104)","v":""},{"$f":"IF(Prezentace!B104=0,\"\",Prezentace!B104)","v":""},{"$f":"Prezentace!D104","v":"P"},{"$f":"IF(Prezentace!F104=0,\"\",Prezentace!F104)","v":""},{"$f":"IF(Prezentace!E104=0,\"\",Prezentace!E104)","v":""},null,null,null,null,null,null,null,null,null,null,null,null,null,null,{"$f":"(SUM(F102*$F$3,G102*$G$3,H102*$H$3,I102*$I$3,J102*$J$3,K102*$K$3,L102*$L$3,M102*$M$3,N102*$N$3,O102*$O$3,P102*$P$3,Q102*$Q$3,R102*$R$3))-S102","v":0}]

{"sheet":"6","index":12,"n_rows":102,"n_cols":22,"rows_kept":102,"cut":false,"hidden":true,"merged":[[0,3,0,20],[0,0,2,0],[0,1,2,1]]}
["Druž.","Kap.",null,"Disciplina 6"]
[]
[null,null,null,null,null,"K","M",1,2,3,4,5,6,7,8,9,10,11,12,"TB","Čas","Součet"]
[{"$f":"IF(Prezentace!A6=0,\"\",Prezentace!A6)","v":""},{"$f":"IF(Prezentace!B6=0,\"\",Prezentace!B6)","v":""},{"$f":"Prezentace!D6","v":"P"},{"$f":"IF(Prezentace!F6=0,\"\",Prezentace!F6)","v":"Martin"},{"$f":"IF(Prezentace!E6=0,\"\",Prezentace!E6)","v":"Adensam "},null,null,null,null,null,null,null,null,null,null,null,null,null,null,null,null,{"$f":"(SUM(F4:T4))-U4","v":0}]
[{"$f":"IF(Prezentace!A7=0,\"\",Prezentace!A7)","v":""},{"$f":"IF(Prezentace!B7=0,\"\",Prezentace!B7)","v":""},{"$f":"Prezentace!D7","v":"R"},{"$f":"IF(Prezentace!F7=0,\"\",Prezentace!F7)","v":"Martin"},{"$f":"IF(Prezentace!E7=0,\"\",Prezentace!E7)","v":"Adensam"},null,null,null,null,null,null,null,null,null,null,null,null,null,null,null,null,{"$f":"(SUM(F5:T5))-U5","v":0}]
[{"$f":"IF(Prezentace!A8=0,\"\",Prezentace!A8)","v":""},{"$f":"IF(Prezentace!B8=0,\"\",Prezentace!B8)","v":""},{"$f":"Prezentace!D8","v":"P"},{"$f":"IF(Prezentace!F8=0,\"\",Prezentace!F8)","v":"Jaroslav"},{"$f":"IF(Prezentace!E8=0,\"\",Prezentace!E8)","v":"Kostříž "},null,null,null,null,null,null,null,null,null,null,null,null,null,null,null,null,0]
[{"$f":"IF(Prezentace!A9=0,\"\",Prezentace!A9)","v":""},{"$f":"IF(Prezentace!B9=0,\"\",Prezentace!B9)","v":""},{"$f":"Prezentace!D9","v":"P"},{"$f":"IF(Prezentace!F9=0,\"\",Prezentace!F9)","v":"Miroslav"},{"$f":"IF(Prezentace!E9=0,\"\",Prezentace!E9)","v":"Koch   ml."},null,null,null,null,null,null,null,null,null,null,null,null,null,null,null,null,0]
[{"$f":"IF(Prezentace!A10=0,\"\",Prezentace!A10)","v":""},{"$f":"IF(Prezentace!B10=0,\"\",Prezentace!B10)","v":""},{"$f":"Prezentace!D10","v":"P"},{"$f":"IF(Prezentace!F10=0,\"\",Prezentace!F10)","v":"Miroslav"},{"$f":"IF(Prezentace!E10=0,\"\",Prezentace!E10)","v":"Koch  st. "},null,null,null,null,null,null,null,null,null,null,null,null,null,null,null,null,0]
[{"$f":"IF(Prezentace!A11=0,\"\",Prezentace!A11)","v":""},{"$f":"IF(Prezentace!B11=0,\"\",Prezentace!B11)","v":""},{"$f":"Prezentace!D11","v":"P"},{"$f":"IF(Prezentace!F11=0,\"\",Prezentace!F11)","v":"Bohumil"},{"$f":"IF(Prezentace!E11=0,\"\",Prezentace!E11)","v":"Herceg"},null,null,null,null,null,null,null,null,null,null,null,null,null,null,null,null,0]
[{"$f":"IF(Prezentace!A12=0,\"\",Prezentace!A12)","v":""},{"$f":"IF(Prezentace!B12=0,\"\",Prezentace!B12)","v":""},{"$f":"Prezentace!D12","v":"P"},{"$f":"IF(Prezentace!F12=0,\"\",Prezentace!F12)","v":"Viktor"},{"$f":"IF(Prezentace!E12=0,\"\",Prezentace!E12)","v":"Fuksa  "},null,null,null,null,null,null,null,null,null,null,null,null,null,null,null,null,0]
[{"$f":"IF(Prezentace!A13=0,\"\",Prezentace!A13)","v":""},{"$f":"IF(Prezentace!B13=0,\"\",Prezentace!B13)","v":""},{"$f":"Prezentace!D13","v":"P"},{"$f":"IF(Prezentace!F13=0,\"\",Prezentace!F13)","v":"Milan"},{"$f":"IF(Prezentace!E13=0,\"\",Prezentace!E13)","v":"Matějka  ml."},null,null,null,null,null,null,null,null,null,null,null,null,null,null,null,null,0]
[{"$f":"IF(Prezentace!A14=0,\"\",Prezentace!A14)","v":""},{"$f":"IF(Prezentace!B14=0,\"\",Prezentace!B14)","v":""},{"$f":"Prezentace!D14","v":"P"},{"$f":"IF(Prezentace!F14=0,\"\",Prezentace!F14)","v":"Michal"},{"$f":"IF(Prezentace!E14=0,\"\",Prezentace!E14)","v":"Svoboda"},null,null,null,null,null,null,null,null,null,null,null,null,null,null,null,null,0]
[{"$f":"IF(Prezentace!A15=0,\"\",Prezentace!A15)","v":""},{"$f":"IF(Prezentace!B15=0,\"\",Prezentace!B15)","v":""},{"$f":"Prezentace!D15","v":"R"},{"$f":"IF(Prezentace!F15=0,\"\",Prezentace!F15)","v":"Lukáš"},{"$f":"IF(Prezentace!E15=0,\"\",Prezentace!E15)","v":"Bouda "},null,null,null,null,null,null,null,null,null,null,null,null,null,null,null,null,0]
[{"$f":"IF(Prezentace!A16=0,\"\",Prezentace!A16)","v":""},{"$f":"IF(Prezentace!B16=0,\"\",Prezentace!B16)","v":""},{"$f":"Prezentace!D16","v":"P"},{"$f":"IF(Prezentace!F16=0,\"\",Prezentace!F16)","v":"Lukáš"},{"$f":"IF(Prezentace!E16=0,\"\",Prezentace!E16)","v":"Bouda "},null,null,null,null,null,null,null,null,null,null,null,null,null,null,null,null,0]
[{"$f":"IF(Prezentace!A17=0,\"\",Prezentace!A17)","v":""},{"$f":"IF(Prezentace!B17=0,\"\",Prezentace!B17)","v":""},{"$f":"Prezentace!D17","v":"P"},{"$f":"IF(Prezentace!F17=0,\"\",Prezentace!F17)","v":"Pavel"},{"$f":"IF(Prezentace!E17=0,\"\",Prezentace!E17)","v":"Koltai"},null,null,null,null,null,null,null,null,null,null,null,null,null,null,null,null,0]
[{"$f":"IF(Prezentace!A18=0,\"\",Prezentace!A18)","v":""},{"$f":"IF(Prezentace!B18=0,\"\",Prezentace!B18)","v":""},{"$f":"Prezentace!D18","v":"P"},{"$f":"IF(Prezentace!F18=0,\"\",Prezentace!F18)","v":"Vladislav"},{"$f":"IF(Prezentace!E18=0,\"\",Prezentace!E18)","v":"Přibyl"},null,null,null,null,null,null,null,null,null,null,null,null,null,null,null,null,0]
[{"$f":"IF(Prezentace!A19=0,\"\",Prezentace!A19)","v":""},{"$f":"IF(Prezentace!B19=0,\"\",Prezentace!B19)","v":""},{"$f":"Prezentace!D19","v":"P"},{"$f":"IF(Prezentace!F19=0,\"\",Prezentace!F19)","v":"Milan"},{"$f":"IF(Prezentace!E19=0,\"\",Prezentace!E19)","v":"Matějka st."},null,null,null,null,null,null,null,null,null,null,null,null,null,null,null,null,0]
[{"$f":"IF(Prezentace!A20=0,\"\",Prezentace!A20)","v":""},{"$f":"IF(Prezentace!B20=0,\"\",Prezentace!B20)","v":""},{"$f":"Prezentace!D20","v":"P"},{"$f":"IF(Prezentace!F20=0,\"\",Prezentace!F20)","v":"Miroslav"},{"$f":"IF(Prezentace!E20=0,\"\",Prezentace!E20)","v":"Fiala  "},null,null,null,null,null,null,null,null,null,null,null,null,null,null,null,null,0]
[{"$f":"IF(Prezentace!A21=0,\"\",Prezentace!A21)","v":""},{"$f":"IF(Prezentace!B21=0,\"\",Prezentace!B21)","v":""},{"$f":"Prezentace!D21","v":"P"},{"$f":"IF(Prezentace!F21=0,\"\",Prezentace!F21)","v":"Karel"},{"$f":"IF(Prezentace!E21=0,\"\",Prezentace!E21)","v":"Gažák "},null,null,null,null,null,null,null,null,null,null,null,null,null,null,null,null,0]
[{"$f":"IF(Prezentace!A22=0,\"\",Prezentace!A22)","v":""},{"$f":"IF(Prezentace!B22=0,\"\",Prezentace!B22)","v":""},{"$f":"Prezentace!D22","v":"P"},{"$f":"IF(Prezentace!F22=0,\"\",Prezentace!F22)","v":"Václav"},{"$f":"IF(Prezentace!E22=0,\"\",Prezentace!E22)","v":"Landkammer"},null,null,null,null,null,null,null,null,null,null,null,null,null,null,null,null,0]
[{"$f":"IF(Prezentace!A23=0,\"\",Prezentace!A23)","v":""},{"$f":"IF(Prezentace!B23=0,\"\",Prezentace!B23)","v":""},{"$f":"Prezentace!D23","v":"P"},{"$f":"IF(Prezentace!F23=0,\"\",Prezentace!F23)","v":"Vojtěch"},{"$f":"IF(Prezentace!E23=0,\"\",Prezentace!E23)","v":"Brejžek "},null,null,null,null,null,null,null,null,null,null,null,null,null,null,null,null,0]
[{"$f":"IF(Prezentace!A24=0,\"\",Prezentace!A24)","v":""},{"$f":"IF(Prezentace!B24=0,\"\",Prezentace!B24)","v":""},{"$f":"Prezentace!D24","v":"P"},{"$f":"IF(Prezentace!F24=0,\"\",Prezentace!F24)","v":"Antonín"},{"$f":"IF(Prezentace!E24=0,\"\",Prezentace!E24)","v":"Urbanec  "},null,null,null,null,null,null,null,null,null,null,null,null,null,null,null,null,0]
[{"$f":"IF(Prezentace!A25=0,\"\",Prezentace!A25)","v":""},{"$f":"IF(Prezentace!B25=0,\"\",Prezentace!B25)","v":""},{"$f":"Prezentace!D25","v":"P"},{"$f":"IF(Prezentace!F25=0,\"\",Prezentace!F25)","v":"Milan"},{"$f":"IF(Prezentace!E25=0,\"\",Prezentace!E25)","v":"Jílek  "},null,null,null,null,null,null,null,null,null,null,null,null,null,null,null,null,0]
[{"$f":"IF(Prezentace!A26=0,\"\",Prezentace!A26)","v":""},{"$f":"IF(Prezentace!B26=0,\"\",Prezentace!B26)","v":""},{"$f":"Prezentace!D26","v":"P"},{"$f":"IF(Prezentace!F26=0,\"\",Prezentace!F26)","v":"Václav"},{"$f":"IF(Prezentace!E26=0,\"\",Prezentace!E26)","v":"Jírů"},null,null,null,null,null,null,null,null,null,null,null,null,null,null,null,null,0]
[{"$f":"IF(Prezentace!A27=0,\"\",Prezentace!A27)","v":""},{"$f":"IF(Prezentace!B27=0,\"\",Prezentace!B27)","v":""},{"$f":"Prezentace!D27","v":"P"},{"$f":"IF(Prezentace!F27=0,\"\",Prezentace!F27)","v":"Milan"},{"$f":"IF(Prezentace!E27=0,\"\",Prezentace!E27)","v":"Krupica"},null,null,null,null,null,null,null,null,null,null,null,null,null,null,null,null,0]
[{"$f":"IF(Prezentace!A28=0,\"\",Prezentace!A28)","v":""},{"$f":"IF(Prezentace!B28=0,\"\",Prezentace!B28)","v":""},{"$f":"Prezentace!D28","v":"R"},{"$f":"IF(Prezentace!F28=0,\"\",Prezentace!F28)","v":"Milan"},{"$f":"IF(Prezentace!E28=0,\"\",Prezentace!E28)","v":"Krupica "},null,null,null,null,null,null,null,null,null,null,null,null,null,null,null,null,0]
[{"$f":"IF(Prezentace!A29=0,\"\",Prezentace!A29)","v":""},{"$f":"IF(Prezentace!B29=0,\"\",Prezentace!B29)","v":""},{"$f":"Prezentace!D29","v":"P"},{"$f":"IF(Prezentace!F29=0,\"\",Prezentace!F29)","v":"Miloslav"},{"$f":"IF(Prezentace!E29=0,\"\",Prezentace!E29)","v":"Petržílka"},null,null,null,null,null,null,null,null,null,null,null,null,null,null,null,null,0]
[{"$f":"IF(Prezentace!A30=0,\"\",Prezentace!A30)","v":""},{"$f":"IF(Prezentace!B30=0,\"\",Prezentace!B30)","v":""},{"$f":"Prezentace!D30","v":"R"},{"$f":"IF(Prezentace!F30=0,\"\",Prezentace!F30)","v":"Aleš"},{"$f":"IF(Prezentace!E30=0,\"\",Prezentace!E30)","v":"Seitl "},null,null,null,null,null,null,null,null,null,null,null,null,null,null,null,null,0]
[{"$f":"IF(Prezentace!A31=0,\"\",Prezentace!A31)","v":""},{"$f":"IF(Prezentace!B31=0,\"\",Prezentace!B31)","v":""},{"$f":"Prezentace!D31","v":"P"},{"$f":"IF(Prezentace!F31=0,\"\",Prezentace!F31)","v":"Aleš"},{"$f":"IF(Prezentace!E31=0,\"\",Prezentace!E31)","v":"Seitl "},null,null,null,null,null,null,null,null,null,null,null,null,null,null,null,null,0]
[{"$f":"IF(Prezentace!A32=0,\"\",Prezentace!A32)","v":""},{"$f":"IF(Prezentace!B32=0,\"\",Prezentace!B32)","v":""},{"$f":"Prezentace!D32","v":"P"},{"$f":"IF(Prezentace!F32=0,\"\",Prezentace!F32)","v":"Karel"},{"$f":"IF(Prezentace!E32=0,\"\",Prezentace!E32)","v":"Seitl"},null,null,null,null,null,null,null,null,null,null,null,null,null,null,null,null,0]
[{"$f":"IF(Prezentace!A33=0,\"\",Prezentace!A33)","v":""},{"$f":"IF(Prezentace!B33=0,\"\",Prezentace!B33)","v":""},{"$f":"Prezentace!D33","v":"P"},{"$f":"IF(Prezentace!F33=0,\"\",Prezentace!F33)","v":"David"},{"$f":"IF(Prezentace!E33=0,\"\",Prezentace!E33)","v":"Nikodým"},null,null,null,null,null,null,null,null,null,null,null,null,null,null,null,null,0]
[{"$f":"IF(Prezentace!A34=0,\"\",Prezentace!A34)","v":""},{"$f":"IF(Prezentace!B34=0,\"\",Prezentace!B34)","v":""},{"$f":"Prezentace!D34","v":"R"},{"$f":"IF(Prezentace!F34=0,\"\",Prezentace!F34)","v":"David"},{"$f":"IF(Prezentace!E34=0,\"\",Prezentace!E34)","v":"Nikodým "},null,null,null,null,null,null,null,null,null,null,null,null,null,null,null,null,0]
[{"$f":"IF(Prezentace!A35=0,\"\",Prezentace!A35)","v":""},{"$f":"IF(Prezentace!B35=0,\"\",Prezentace!B35)","v":""},{"$f":"Prezentace!D35","v":"P"},{"$f":"IF(Prezentace!F35=0,\"\",Prezentace!F35)","v":"Lukáš"},{"$f":"IF(Prezentace!E35=0,\"\",Prezentace!E35)","v":"Hobza"},null,null,null,null,null,null,null,null,null,null,null,null,null,null,null,null,0]
[{"$f":"IF(Prezentace!A36=0,\"\",Prezentace!A36)","v":""},{"$f":"IF(Prezentace!B36=0,\"\",Prezentace!B36)","v":""},{"$f":"Prezentace!D36","v":"P"},{"$f":"IF(Prezentace!F36=0,\"\",Prezentace!F36)","v":"Antonín"},{"$f":"IF(Prezentace!E36=0,\"\",Prezentace!E36)","v":"Jelínek "},null,null,null,null,null,null,null,null,null,null,null,null,null,null,null,null,0]
[{"$f":"IF(Prezentace!A37=0,\"\",Prezentace!A37)","v":""},{"$f":"IF(Prezentace!B37=0,\"\",Prezentace!B37)","v":""},{"$f":"Prezentace!D37","v":"R"},{"$f":"IF(Prezentace!F37=0,\"\",Prezentace!F37)","v":"Antonín"},{"$f":"IF(Prezentace!E37=0,\"\",Prezentace!E37)","v":"Jelínek "},null,null,null,null,null,null,null,null,null,null,null,null,null,null,null,null,0]
[{"$f":"IF(Prezentace!A38=0,\"\",Prezentace!A38)","v":""},{"$f":"IF(Prezentace!B38=0,\"\",Prezentace!B38)","v":""},{"$f":"Prezentace!D38","v":"P"},{"$f":"IF(Prezentace!F38=0,\"\",Prezentace!F38)","v":"Ladislav"},{"$f":"IF(Prezentace!E38=0,\"\",Prezentace!E38)","v":"Píša "},null,null,null,null,null,null,null,null,null,null,null,null,null,null,null,null,0]
[{"$f":"IF(Prezentace!A39=0,\"\",Prezentace!A39)","v":""},{"$f":"IF(Prezentace!B39=0,\"\",Prezentace!B39)","v":""},{"$f":"Prezentace!D39","v":"P"},{"$f":"IF(Prezentace!F39=0,\"\",Prezentace!F39)","v":"Štefan"},{"$f":"IF(Prezentace!E39=0,\"\",Prezentace!E39)","v":"Mesároš"},null,null,null,null,null,null,null,null,null,null,null,null,null,null,null,null,0]
[{"$f":"IF(Prezentace!A40=0,\"\",Prezentace!A40)","v":""},{"$f":"IF(Prezentace!B40=0,\"\",Prezentace!B40)","v":""},{"$f":"Prezentace!D40","v":"P"},{"$f":"IF(Prezentace!F40=0,\"\",Prezentace!F40)","v":"Pavel"},{"$f":"IF(Prezentace!E40=0,\"\",Prezentace!E40)","v":"Červenka"},null,null,null,null,null,null,null,null,null,null,null,null,null,null,null,null,{"$f":"(SUM(F38:T38))-U38","v":0}]
[{"$f":"IF(Prezentace!A41=0,\"\",Prezentace!A41)","v":""},{"$f":"IF(Prezentace!B41=0,\"\",Prezentace!B41)","v":""},{"$f":"Prezentace!D41","v":"R"},{"$f":"IF(Prezentace!F41=0,\"\",Prezentace!F41)","v":"Pavel"},{"$f":"IF(Prezentace!E41=0,\"\",Prezentace!E41)","v":"Červenka "},null,null,null,null,null,null,null,null,null,null,null,null,null,null,null,null,0]
[{"$f":"IF(Prezentace!A42=0,\"\",Prezentace!A42)","v":""},{"$f":"IF(Prezentace!B42=0,\"\",Prezentace!B42)","v":""},{"$f":"Prezentace!D42","v":"P"},{"$f":"IF(Prezentace!F42=0,\"\",Prezentace!F42)","v":"Jiří"},{"$f":"IF(Prezentace!E42=0,\"\",Prezentace!E42)","v":"Švihálek "},null,null,null,null,null,null,null,null,null,null,null,null,null,null,null,null,0]
[{"$f":"IF(Prezentace!A43=0,\"\",Prezentace!A43)","v":""},{"$f":"IF(Prezentace!B43=0,\"\",Prezentace!B43)","v":""},{"$f":"Prezentace!D43","v":"R"},{"$f":"IF(Prezentace!F43=0,\"\",Prezentace!F43)","v":"Jiří"},{"$f":"IF(Prezentace!E43=0,\"\",Prezentace!E43)","v":"Švihálek "},null,null,null,null,null,null,null,null,null,null,null,null,null,null,null,null,0]
[{"$f":"IF(Prezentace!A44=0,\"\",Prezentace!A44)","v":""},{"$f":"IF(Prezentace!B44=0,\"\",Prezentace!B44)","v":""},{"$f":"Prezentace!D44","v":"P"},{"$f":"IF(Prezentace!F44=0,\"\",Prezentace!F44)","v":"František"},{"$f":"IF(Prezentace!E44=0,\"\",Prezentace!E44)","v":"Toman "},null,null,null,null,null,null,null,null,null,null,null,null,null,null,null,null,0]
[{"$f":"IF(Prezentace!A45=0,\"\",Prezentace!A45)","v":""},{"$f":"IF(Prezentace!B45=0,\"\",Prezentace!B45)","v":""},{"$f":"Prezentace!D45","v":"P"},{"$f":"IF(Prezentace!F45=0,\"\",Prezentace!F45)","v":"Vladimír"},{"$f":"IF(Prezentace!E45=0,\"\",Prezentace!E45)","v":"VejslíK "},null,null,null,null,null,null,null,null,null,null,null,null,null,null,null,null,0]
[{"$f":"IF(Prezentace!A46=0,\"\",Prezentace!A46)","v":""},{"$f":"IF(Prezentace!B46=0,\"\",Prezentace!B46)","v":""},{"$f":"Prezentace!D46","v":"P"},{"$f":"IF(Prezentace!F46=0,\"\",Prezentace!F46)","v":"Karel"},{"$f":"IF(Prezentace!E46=0,\"\",Prezentace!E46)","v":"Získal "},null,null,null,null,null,null,null,null,null,null,null,null,null,null,null,null,0]
[{"$f":"IF(Prezentace!A47=0,\"\",Prezentace!A47)","v":""},{"$f":"IF(Prezentace!B47=0,\"\",Prezentace!B47)","v":""},{"$f":"Prezentace!D47","v":"R"},{"$f":"IF(Prezentace!F47=0,\"\",Prezentace!F47)","v":"Karel"},{"$f":"IF(Prezentace!E47=0,\"\",Prezentace!E47)","v":"Získal "},null,null,null,null,null,null,null,null,null,null,null,null,null,null,null,null,0]
[{"$f":"IF(Prezentace!A48=0,\"\",Prezentace!A48)","v":""},{"$f":"IF(Prezentace!B48=0,\"\",Prezentace!B48)","v":""},{"$f":"Prezentace!D48","v":"P"},{"$f":"IF(Prezentace!F48=0,\"\",Prezentace!F48)","v":"Jaroslav"},{"$f":"IF(Prezentace!E48=0,\"\",Prezentace!E48)","v":"Sokolík "},null,null,null,null,null,null,null,null,null,null,null,null,null,null,null,null,0]
[{"$f":"IF(Prezentace!A49=0,\"\",Prezentace!A49)","v":""},{"$f":"IF(Prezentace!B49=0,\"\",Prezentace!B49)","v":""},{"$f":"Prezentace!D49","v":"P"},{"$f":"IF(Prezentace!F49=0,\"\",Prezentace!F49)","v":"Milan"},{"$f":"IF(Prezentace!E49=0,\"\",Prezentace!E49)","v":"Kraus "},null,null,null,null,null,null,null,null,null,null,null,null,null,null,null,null,0]
[{"$f":"IF(Prezentace!A50=0,\"\",Prezentace!A50)","v":""},{"$f":"IF(Prezentace!B50=0,\"\",Prezentace!B50)","v":""},{"$f":"Prezentace!D50","v":"P"},{"$f":"IF(Prezentace!F50=0,\"\",Prezentace!F50)","v":""},{"$f":"IF(Prezentace!E50=0,\"\",Prezentace!E50)","v":""},null,null,null,null,null,null,null,null,null,null,null,null,null,null,null,null,0]
[{"$f":"IF(Prezentace!A51=0,\"\",Prezentace!A51)","v":""},{"$f":"IF(Prezentace!B51=0,\"\",Prezentace!B51)","v":""},{"$f":"Prezentace!D51","v":"P"},{"$f":"IF(Prezentace!F51=0,\"\",Prezentace!F51)","v":""},{"$f":"IF(Prezentace!E51=0,\"\",Prezentace!E51)","v":""},null,null,null,null,null,null,null,null,null,null,null,null,null,null,null,null,0]
[{"$f":"IF(Prezentace!A52=0,\"\",Prezentace!A52)","v":""},{"$f":"IF(Prezentace!B52=0,\"\",Prezentace!B52)","v":""},{"$f":"Prezentace!D52","v":"P"},{"$f":"IF(Prezentace!F52=0,\"\",Prezentace!F52)","v":""},{"$f":"IF(Prezentace!E52=0,\"\",Prezentace!E52)","v":""},null,null,null,null,null,null,null,null,null,null,null,null,null,null,null,null,0]
[{"$f":"IF(Prezentace!A53=0,\"\",Prezentace!A53)","v":""},{"$f":"IF(Prezentace!B53=0,\"\",Prezentace!B53)","v":""},{"$f":"Prezentace!D53","v":"P"},{"$f":"IF(Prezentace!F53=0,\"\",Prezentace!F53)","v":""},{"$f":"IF(Prezentace!E53=0,\"\",Prezentace!E53)","v":""},null,null,null,null,null,null,null,null,null,null,null,null,null,null,null,null,0]
[{"$f":"IF(Prezentace!A54=0,\"\",Prezentace!A54)","v":""},{"$f":"IF(Prezentace!B54=0,\"\",Prezentace!B54)","v":""},{"$f":"Prezentace!D54","v":"P"},{"$f":"IF(Prezentace!F54=0,\"\",Prezentace!F54)","v":""},{"$f":"IF(Prezentace!E54=0,\"\",Prezentace!E54)","v":""},null,null,null,null,null,null,null,null,null,null,null,null,null,null,null,null,0]
[{"$f":"IF(Prezentace!A55=0,\"\",Prezentace!A55)","v":""},{"$f":"IF(Prezentace!B55=0,\"\",Prezentace!B55)","v":""},{"$f":"Prezentace!D55","v":"P"},{"$f":"IF(Prezentace!F55=0,\"\",Prezentace!F55)","v":""},{"$f":"IF(Prezentace!E55=0,\"\",Prezentace!E55)","v":""},null,null,null,null,null,null,null,null,null,null,null,null,null,null,null,null,0]
[{"$f":"IF(Prezentace!A56=0,\"\",Prezentace!A56)","v":""},{"$f":"IF(Prezentace!B56=0,\"\",Prezentace!B56)","v":""},{"$f":"Prezentace!D56","v":"P"},{"$f":"IF(Prezentace!F56=0,\"\",Prezentace!F56)","v":""},{"$f":"IF(Prezentace!E56=0,\"\",Prezentace!E56)","v":""},null,null,null,null,null,null,null,null,null,null,null,null,null,null,null,null,0]
[{"$f":"IF(Prezentace!A57=0,\"\",Prezentace!A57)","v":""},{"$f":"IF(Prezentace!B57=0,\"\",Prezentace!B57)","v":""},{"$f":"Prezentace!D57","v":"P"},{"$f":"IF(Prezentace!F57=0,\"\",Prezentace!F57)","v":""},{"$f":"IF(Prezentace!E57=0,\"\",Prezentace!E57)","v":""},null,null,null,null,null,null,null,null,null,null,null,null,null,null,null,null,0]
[{"$f":"IF(Prezentace!A58=0,\"\",Prezentace!A58)","v":""},{"$f":"IF(Prezentace!B58=0,\"\",Prezentace!B58)","v":""},{"$f":"Prezentace!D58","v":"P"},{"$f":"IF(Prezentace!F58=0,\"\",Prezentace!F58)","v":""},{"$f":"IF(Prezentace!E58=0,\"\",Prezentace!E58)","v":""},null,null,null,null,null,null,null,null,null,null,null,null,null,null,null,null,0]
[{"$f":"IF(Prezentace!A59=0,\"\",Prezentace!A59)","v":""},{"$f":"IF(Prezentace!B59=0,\"\",Prezentace!B59)","v":""},{"$f":"Prezentace!D59","v":"P"},{"$f":"IF(Prezentace!F59=0,\"\",Prezentace!F59)","v":""},{"$f":"IF(Prezentace!E59=0,\"\",Prezentace!E59)","v":""},null,null,null,null,null,null,null,null,null,null,null,null,null,null,null,null,0]
[{"$f":"IF(Prezentace!A60=0,\"\",Prezentace!A60)","v":""},{"$f":"IF(Prezentace!B60=0,\"\",Prezentace!B60)","v":""},{"$f":"Prezentace!D60","v":"P"},{"$f":"IF(Prezentace!F60=0,\"\",Prezentace!F60)","v":""},{"$f":"IF(Prezentace!E60=0,\"\",Prezentace!E60)","v":""},null,null,null,null,null,null,null,null,null,null,null,null,null,null,null,null,0]
[{"$f":"IF(Prezentace!A61=0,\"\",Prezentace!A61)","v":""},{"$f":"IF(Prezentace!B61=0,\"\",Prezentace!B61)","v":""},{"$f":"Prezentace!D61","v":"P"},{"$f":"IF(Prezentace!F61=0,\"\",Prezentace!F61)","v":""},{"$f":"IF(Prezentace!E61=0,\"\",Prezentace!E61)","v":""},null,null,null,null,null,null,null,null,null,null,null,null,null,null,null,null,0]
[{"$f":"IF(Prezentace!A62=0,\"\",Prezentace!A62)","v":""},{"$f":"IF(Prezentace!B62=0,\"\",Prezentace!B62)","v":""},{"$f":"Prezentace!D62","v":"P"},{"$f":"IF(Prezentace!F62=0,\"\",Prezentace!F62)","v":""},{"$f":"IF(Prezentace!E62=0,\"\",Prezentace!E62)","v":""},null,null,null,null,null,null,null,null,null,null,null,null,null,null,null,null,0]
[{"$f":"IF(Prezentace!A63=0,\"\",Prezentace!A63)","v":""},{"$f":"IF(Prezentace!B63=0,\"\",Prezentace!B63)","v":""},{"$f":"Prezentace!D63","v":"P"},{"$f":"IF(Prezentace!F63=0,\"\",Prezentace!F63)","v":""},{"$f":"IF(Prezentace!E63=0,\"\",Prezentace!E63)","v":""},null,null,null,null,null,null,null,null,null,null,null,null,null,null,null,null,0]
[{"$f":"IF(Prezentace!A64=0,\"\",Prezentace!A64)","v":""},{"$f":"IF(Prezentace!B64=0,\"\",Prezentace!B64)","v":""},{"$f":"Prezentace!D64","v":"P"},{"$f":"IF(Prezentace!F64=0,\"\",Prezentace!F64)","v":""},{"$f":"IF(Prezentace!E64=0,\"\",Prezentace!E64)","v":""},null,null,null,null,null,null,null,null,null,null,null,null,null,null,null,null,0]
[{"$f":"IF(Prezentace!A65=0,\"\",Prezentace!A65)","v":""},{"$f":"IF(Prezentace!B65=0,\"\",Prezentace!B65)","v":""},{"$f":"Prezentace!D65","v":"P"},{"$f":"IF(Prezentace!F65=0,\"\",Prezentace!F65)","v":""},{"$f":"IF(Prezentace!E65=0,\"\",Prezentace!E65)","v":""},null,null,null,null,null,null,null,null,null,null,null,null,null,null,null,null,0]
[{"$f":"IF(Prezentace!A66=0,\"\",Prezentace!A66)","v":""},{"$f":"IF(Prezentace!B66=0,\"\",Prezentace!B66)","v":""},{"$f":"Prezentace!D66","v":"P"},{"$f":"IF(Prezentace!F66=0,\"\",Prezentace!F66)","v":""},{"$f":"IF(Prezentace!E66=0,\"\",Prezentace!E66)","v":""},null,null,null,null,null,null,null,null,null,null,null,null,null,null,null,null,0]
[{"$f":"IF(Prezentace!A67=0,\"\",Prezentace!A67)","v":""},{"$f":"IF(Prezentace!B67=0,\"\",Prezentace!B67)","v":""},{"$f":"Prezentace!D67","v":"P"},{"$f":"IF(Prezentace!F67=0,\"\",Prezentace!F67)","v":""},{"$f":"IF(Prezentace!E67=0,\"\",Prezentace!E67)","v":""},null,null,null,null,null,null,null,null,null,null,null,null,null,null,null,null,0]
[{"$f":"IF(Prezentace!A68=0,\"\",Prezentace!A68)","v":""},{"$f":"IF(Prezentace!B68=0,\"\",Prezentace!B68)","v":""},{"$f":"Prezentace!D68","v":"P"},{"$f":"IF(Prezentace!F68=0,\"\",Prezentace!F68)","v":""},{"$f":"IF(Prezentace!E68=0,\"\",Prezentace!E68)","v":""},null,null,null,null,null,null,null,null,null,null,null,null,null,null,null,null,0]
[{"$f":"IF(Prezentace!A69=0,\"\",Prezentace!A69)","v":""},{"$f":"IF(Prezentace!B69=0,\"\",Prezentace!B69)","v":""},{"$f":"Prezentace!D69","v":"P"},{"$f":"IF(Prezentace!F69=0,\"\",Prezentace!F69)","v":""},{"$f":"IF(Prezentace!E69=0,\"\",Prezentace!E69)","v":""},null,null,null,null,null,null,null,null,null,null,null,null,null,null,null,null,0]
[{"$f":"IF(Prezentace!A70=0,\"\",Prezentace!A70)","v":""},{"$f":"IF(Prezentace!B70=0,\"\",Prezentace!B70)","v":""},{"$f":"Prezentace!D70","v":"P"},{"$f":"IF(Prezentace!F70=0,\"\",Prezentace!F70)","v":""},{"$f":"IF(Prezentace!E70=0,\"\",Prezentace!E70)","v":""},null,null,null,null,null,null,null,null,null,null,null,null,null,null,null,null,0]
[{"$f":"IF(Prezentace!A71=0,\"\",Prezentace!A71)","v":""},{"$f":"IF(Prezentace!B71=0,\"\",Prezentace!B71)","v":""},{"$f":"Prezentace!D71","v":"P"},{"$f":"IF(Prezentace!F71=0,\"\",Prezentace!F71)","v":""},{"$f":"IF(Prezentace!E71=0,\"\",Prezentace!E71)","v":""},null,null,null,null,null,null,null,null,null,null,null,null,null,null,null,null,0]
[{"$f":"IF(Prezentace!A72=0,\"\",Prezentace!A72)","v":""},{"$f":"IF(Prezentace!B72=0,\"\",Prezentace!B72)","v":""},{"$f":"Prezentace!D72","v":"P"},{"$f":"IF(Prezentace!F72=0,\"\",Prezentace!F72)","v":""},{"$f":"IF(Prezentace!E72=0,\"\",Prezentace!E72)","v":""},null,null,null,null,null,null,null,null,null,null,null,null,null,null,null,null,0]
[{"$f":"IF(Prezentace!A73=0,\"\",Prezentace!A73)","v":""},{"$f":"IF(Prezentace!B73=0,\"\",Prezentace!B73)","v":""},{"$f":"Prezentace!D73","v":"P"},{"$f":"IF(Prezentace!F73=0,\"\",Prezentace!F73)","v":""},{"$f":"IF(Prezentace!E73=0,\"\",Prezentace!E73)","v":""},null,null,null,null,null,null,null,null,null,null,null,null,null,null,null,null,0]
[{"$f":"IF(Prezentace!A74=0,\"\",Prezentace!A74)","v":""},{"$f":"IF(Prezentace!B74=0,\"\",Prezentace!B74)","v":""},{"$f":"Prezentace!D74","v":"P"},{"$f":"IF(Prezentace!F74=0,\"\",Prezentace!F74)","v":""},{"$f":"IF(Prezentace!E74=0,\"\",Prezentace!E74)","v":""},null,null,null,null,null,null,null,null,null,null,null,null,null,null,null,null,0]
[{"$f":"IF(Prezentace!A75=0,\"\",Prezentace!A75)","v":""},{"$f":"IF(Prezentace!B75=0,\"\",Prezentace!B75)","v":""},{"$f":"Prezentace!D75","v":"P"},{"$f":"IF(Prezentace!F75=0,\"\",Prezentace!F75)","v":""},{"$f":"IF(Prezentace!E75=0,\"\",Prezentace!E75)","v":""},null,null,null,null,null,null,null,null,null,null,null,null,null,null,null,null,0]
[{"$f":"IF(Prezentace!A76=0,\"\",Prezentace!A76)","v":""},{"$f":"IF(Prezentace!B76=0,\"\",Prezentace!B76)","v":""},{"$f":"Prezentace!D76","v":"P"},{"$f":"IF(Prezentace!F76=0,\"\",Prezentace!F76)","v":""},{"$f":"IF(Prezentace!E76=0,\"\",Prezentace!E76)","v":""},null,null,null,null,null,null,null,null,null,null,null,null,null,null,null,null,0]
[{"$f":"IF(Prezentace!A77=0,\"\",Prezentace!A77)","v":""},{"$f":"IF(Prezentace!B77=0,\"\",Prezentace!B77)","v":""},{"$f":"Prezentace!D77","v":"P"},{"$f":"IF(Prezentace!F77=0,\"\",Prezentace!F77)","v":""},{"$f":"IF(Prezentace!E77=0,\"\",Prezentace!E77)","v":""},null,null,null,null,null,null,null,null,null,null,null,null,null,null,null,null,0]
[{"$f":"IF(Prezentace!A78=0,\"\",Prezentace!A78)","v":""},{"$f":"IF(Prezentace!B78=0,\"\",Prezentace!B78)","v":""},{"$f":"Prezentace!D78","v":"P"},{"$f":"IF(Prezentace!F78=0,\"\",Prezentace!F78)","v":""},{"$f":"IF(Prezentace!E78=0,\"\",Prezentace!E78)","v":""},null,null,null,null,null,null,null,null,null,null,null,null,null,null,null,null,0]
[{"$f":"IF(Prezentace!A79=0,\"\",Prezentace!A79)","v":""},{"$f":"IF(Prezentace!B79=0,\"\",Prezentace!B79)","v":""},{"$f":"Prezentace!D79","v":"P"},{"$f":"IF(Prezentace!F79=0,\"\",Prezentace!F79)","v":""},{"$f":"IF(Prezentace!E79=0,\"\",Prezentace!E79)","v":""},null,null,null,null,null,null,null,null,null,null,null,null,null,null,null,null,0]
[{"$f":"IF(Prezentace!A80=0,\"\",Prezentace!A80)","v":""},{"$f":"IF(Prezentace!B80=0,\"\",Prezentace!B80)","v":""},{"$f":"Prezentace!D80","v":"P"},{"$f":"IF(Prezentace!F80=0,\"\",Prezentace!F80)","v":""},{"$f":"IF(Prezentace!E80=0,\"\",Prezentace!E80)","v":""},null,null,null,null,null,null,null,null,null,null,null,null,null,null,null,null,0]
[{"$f":"IF(Prezentace!A81=0,\"\",Prezentace!A81)","v":""},{"$f":"IF(Prezentace!B81=0,\"\",Prezentace!B81)","v":""},{"$f":"Prezentace!D81","v":"P"},{"$f":"IF(Prezentace!F81=0,\"\",Prezentace!F81)","v":""},{"$f":"IF(Prezentace!E81=0,\"\",Prezentace!E81)","v":""},null,null,null,null,null,null,null,null,null,null,null,null,null,null,null,null,0]
[{"$f":"IF(Prezentace!A82=0,\"\",Prezentace!A82)","v":""},{"$f":"IF(Prezentace!B82=0,\"\",Prezentace!B82)","v":""},{"$f":"Prezentace!D82","v":"P"},{"$f":"IF(Prezentace!F82=0,\"\",Prezentace!F82)","v":""},{"$f":"IF(Prezentace!E82=0,\"\",Prezentace!E82)","v":""},null,null,null,null,null,null,null,null,null,null,null,null,null,null,null,null,0]
[{"$f":"IF(Prezentace!A83=0,\"\",Prezentace!A83)","v":""},{"$f":"IF(Prezentace!B83=0,\"\",Prezentace!B83)","v":""},{"$f":"Prezentace!D83","v":"P"},{"$f":"IF(Prezentace!F83=0,\"\",Prezentace!F83)","v":""},{"$f":"IF(Prezentace!E83=0,\"\",Prezentace!E83)","v":""},null,null,null,null,null,null,null,null,null,null,null,null,null,null,null,null,0]
[{"$f":"IF(Prezentace!A84=0,\"\",Prezentace!A84)","v":""},{"$f":"IF(Prezentace!B84=0,\"\",Prezentace!B84)","v":""},{"$f":"Prezentace!D84","v":"P"},{"$f":"IF(Prezentace!F84=0,\"\",Prezentace!F84)","v":""},{"$f":"IF(Prezentace!E84=0,\"\",Prezentace!E84)","v":""},null,null,null,null,null,null,null,null,null,null,null,null,null,null,null,null,0]
[{"$f":"IF(Prezentace!A85=0,\"\",Prezentace!A85)","v":""},{"$f":"IF(Prezentace!B85=0,\"\",Prezentace!B85)","v":""},{"$f":"Prezentace!D85","v":"P"},{"$f":"IF(Prezentace!F85=0,\"\",Prezentace!F85)","v":""},{"$f":"IF(Prezentace!E85=0,\"\",Prezentace!E85)","v":""},null,null,null,null,null,null,null,null,null,null,null,null,null,null,null,null,0]
[{"$f":"IF(Prezentace!A86=0,\"\",Prezentace!A86)","v":""},{"$f":"IF(Prezentace!B86=0,\"\",Prezentace!B86)","v":""},{"$f":"Prezentace!D86","v":"P"},{"$f":"IF(Prezentace!F86=0,\"\",Prezentace!F86)","v":""},{"$f":"IF(Prezentace!E86=0,\"\",Prezentace!E86)","v":""},null,null,null,null,null,null,null,null,null,null,null,null,null,null,null,null,0]
[{"$f":"IF(Prezentace!A87=0,\"\",Prezentace!A87)","v":""},{"$f":"IF(Prezentace!B87=0,\"\",Prezentace!B87)","v":""},{"$f":"Prezentace!D87","v":"P"},{"$f":"IF(Prezentace!F87=0,\"\",Prezentace!F87)","v":""},{"$f":"IF(Prezentace!E87=0,\"\",Prezentace!E87)","v":""},null,null,null,null,null,null,null,null,null,null,null,null,null,null,null,null,0]
[{"$f":"IF(Prezentace!A88=0,\"\",Prezentace!A88)","v":""},{"$f":"IF(Prezentace!B88=0,\"\",Prezentace!B88)","v":""},{"$f":"Prezentace!D88","v":"P"},{"$f":"IF(Prezentace!F88=0,\"\",Prezentace!F88)","v":""},{"$f":"IF(Prezentace!E88=0,\"\",Prezentace!E88)","v":""},null,null,null,null,null,null,null,null,null,null,null,null,null,null,null,null,0]
[{"$f":"IF(Prezentace!A89=0,\"\",Prezentace!A89)","v":""},{"$f":"IF(Prezentace!B89=0,\"\",Prezentace!B89)","v":""},{"$f":"Prezentace!D89","v":"P"},{"$f":"IF(Prezentace!F89=0,\"\",Prezentace!F89)","v":""},{"$f":"IF(Prezentace!E89=0,\"\",Prezentace!E89)","v":""},null,null,null,null,null,null,null,null,null,null,null,null,null,null,null,null,0]
[{"$f":"IF(Prezentace!A90=0,\"\",Prezentace!A90)","v":""},{"$f":"IF(Prezentace!B90=0,\"\",Prezentace!B90)","v":""},{"$f":"Prezentace!D90","v":"P"},{"$f":"IF(Prezentace!F90=0,\"\",Prezentace!F90)","v":""},{"$f":"IF(Prezentace!E90=0,\"\",Prezentace!E90)","v":""},null,null,null,null,null,null,null,null,null,null,null,null,null,null,null,null,0]
[{"$f":"IF(Prezentace!A91=0,\"\",Prezentace!A91)","v":""},{"$f":"IF(Prezentace!B91=0,\"\",Prezentace!B91)","v":""},{"$f":"Prezentace!D91","v":"P"},{"$f":"IF(Prezentace!F91=0,\"\",Prezentace!F91)","v":""},{"$f":"IF(Prezentace!E91=0,\"\",Prezentace!E91)","v":""},null,null,null,null,null,null,null,null,null,null,null,null,null,null,null,null,0]
[{"$f":"IF(Prezentace!A92=0,\"\",Prezentace!A92)","v":""},{"$f":"IF(Prezentace!B92=0,\"\",Prezentace!B92)","v":""},{"$f":"Prezentace!D92","v":"P"},{"$f":"IF(Prezentace!F92=0,\"\",Prezentace!F92)","v":""},{"$f":"IF(Prezentace!E92=0,\"\",Prezentace!E92)","v":""},null,null,null,null,null,null,null,null,null,null,null,null,null,null,null,null,0]
[{"$f":"IF(Prezentace!A93=0,\"\",Prezentace!A93)","v":""},{"$f":"IF(Prezentace!B93=0,\"\",Prezentace!B93)","v":""},{"$f":"Prezentace!D93","v":"P"},{"$f":"IF(Prezentace!F93=0,\"\",Prezentace!F93)","v":""},{"$f":"IF(Prezentace!E93=0,\"\",Prezentace!E93)","v":""},null,null,null,null,null,null,null,null,null,null,null,null,null,null,null,null,0]
[{"$f":"IF(Prezentace!A94=0,\"\",Prezentace!A94)","v":""},{"$f":"IF(Prezentace!B94=0,\"\",Prezentace!B94)","v":""},{"$f":"Prezentace!D94","v":"P"},{"$f":"IF(Prezentace!F94=0,\"\",Prezentace!F94)","v":""},{"$f":"IF(Prezentace!E94=0,\"\",Prezentace!E94)","v":""},null,null,null,null,null,null,null,null,null,null,null,null,null,null,null,null,0]
[{"$f":"IF(Prezentace!A95=0,\"\",Prezentace!A95)","v":""},{"$f":"IF(Prezentace!B95=0,\"\",Prezentace!B95)","v":""},{"$f":"Prezentace!D95","v":"P"},{"$f":"IF(Prezentace!F95=0,\"\",Prezentace!F95)","v":""},{"$f":"IF(Prezentace!E95=0,\"\",Prezentace!E95)","v":""},null,null,null,null,null,null,null,null,null,null,null,null,null,null,null,null,0]
[{"$f":"IF(Prezentace!A96=0,\"\",Prezentace!A96)","v":""},{"$f":"IF(Prezentace!B96=0,\"\",Prezentace!B96)","v":""},{"$f":"Prezentace!D96","v":"P"},{"$f":"IF(Prezentace!F96=0,\"\",Prezentace!F96)","v":""},{"$f":"IF(Prezentace!E96=0,\"\",Prezentace!E96)","v":""},null,null,null,null,null,null,null,null,null,null,null,null,null,null,null,null,0]
[{"$f":"IF(Prezentace!A97=0,\"\",Prezentace!A97)","v":""},{"$f":"IF(Prezentace!B97=0,\"\",Prezentace!B97)","v":""},{"$f":"Prezentace!D97","v":"P"},{"$f":"IF(Prezentace!F97=0,\"\",Prezentace!F97)","v":""},{"$f":"IF(Prezentace!E97=0,\"\",Prezentace!E97)","v":""},null,null,null,null,null,null,null,null,null,null,null,null,null,null,null,null,0]
[{"$f":"IF(Prezentace!A98=0,\"\",Prezentace!A98)","v":""},{"$f":"IF(Prezentace!B98=0,\"\",Prezentace!B98)","v":""},{"$f":"Prezentace!D98","v":"P"},{"$f":"IF(Prezentace!F98=0,\"\",Prezentace!F98)","v":""},{"$f":"IF(Prezentace!E98=0,\"\",Prezentace!E98)","v":""},null,null,null,null,null,null,null,null,null,null,null,null,null,null,null,null,0]
[{"$f":"IF(Prezentace!A99=0,\"\",Prezentace!A99)","v":""},{"$f":"IF(Prezentace!B99=0,\"\",Prezentace!B99)","v":""},{"$f":"Prezentace!D99","v":"P"},{"$f":"IF(Prezentace!F99=0,\"\",Prezentace!F99)","v":""},{"$f":"IF(Prezentace!E99=0,\"\",Prezentace!E99)","v":""},null,null,null,null,null,null,null,null,null,null,null,null,null,null,null,null,0]
[{"$f":"IF(Prezentace!A100=0,\"\",Prezentace!A100)","v":""},{"$f":"IF(Prezentace!B100=0,\"\",Prezentace!B100)","v":""},{"$f":"Prezentace!D100","v":"P"},{"$f":"IF(Prezentace!F100=0,\"\",Prezentace!F100)","v":""},{"$f":"IF(Prezentace!E100=0,\"\",Prezentace!E100)","v":""},null,null,null,null,null,null,null,null,null,null,null,null,null,null,null,null,0]
[{"$f":"IF(Prezentace!A101=0,\"\",Prezentace!A101)","v":""},{"$f":"IF(Prezentace!B101=0,\"\",Prezentace!B101)","v":""},{"$f":"Prezentace!D101","v":"P"},{"$f":"IF(Prezentace!F101=0,\"\",Prezentace!F101)","v":""},{"$f":"IF(Prezentace!E101=0,\"\",Prezentace!E101)","v":""},null,null,null,null,null,null,null,null,null,null,null,null,null,null,null,null,0]
[{"$f":"IF(Prezentace!A102=0,\"\",Prezentace!A102)","v":""},{"$f":"IF(Prezentace!B102=0,\"\",Prezentace!B102)","v":""},{"$f":"Prezentace!D102","v":"P"},{"$f":"IF(Prezentace!F102=0,\"\",Prezentace!F102)","v":""},{"$f":"IF(Prezentace!E102=0,\"\",Prezentace!E102)","v":""},null,null,null,null,null,null,null,null,null,null,null,null,null,null,null,null,0]
[{"$f":"IF(Prezentace!A103=0,\"\",Prezentace!A103)","v":""},{"$f":"IF(Prezentace!B103=0,\"\",Prezentace!B103)","v":""},{"$f":"Prezentace!D103","v":"P"},{"$f":"IF(Prezentace!F103=0,\"\",Prezentace!F103)","v":""},{"$f":"IF(Prezentace!E103=0,\"\",Prezentace!E103)","v":""},null,null,null,null,null,null,null,null,null,null,null,null,null,null,null,null,0]
[{"$f":"IF(Prezentace!A104=0,\"\",Prezentace!A104)","v":""},{"$f":"IF(Prezentace!B104=0,\"\",Prezentace!B104)","v":""},{"$f":"Prezentace!D104","v":"P"},{"$f":"IF(Prezentace!F104=0,\"\",Prezentace!F104)","v":""},{"$f":"IF(Prezentace!E104=0,\"\",Prezentace!E104)","v":""},null,null,null,null,null,null,null,null,null,null,null,null,null,null,null,null,{"$f":"(SUM(F102:T102))-U102","v":0}]

{"sheet":"6(M)","index":13,"n_rows":102,"n_cols":20,"rows_kept":102,"cut":false,"hidden":true,"merged":[[0,3,0,18],[0,0,2,0],[0,1,2,1]]}
["Druž.","Kap.",null,"Disciplina 6"]
[]
[null,null,null,null,null,0,1,2,3,4,5,6,7,8,9,10,12,15,"Čas","Součet"]
[{"$f":"IF(Prezentace!A6=0,\"\",Prezentace!A6)","v":""},{"$f":"IF(Prezentace!B6=0,\"\",Prezentace!B6)","v":""},{"$f":"Prezentace!D6","v":"P"},{"$f":"IF(Prezentace!F6=0,\"\",Prezentace!F6)","v":"Martin"},{"$f":"IF(Prezentace!E6=0,\"\",Prezentace!E6)","v":"Adensam "},null,null,null,null,null,null,null,null,null,null,null,null,null,null,{"$f":"(SUM(F4*$F$3,G4*$G$3,H4*$H$3,I4*$I$3,J4*$J$3,K4*$K$3,L4*$L$3,M4*$M$3,N4*$N$3,O4*$O$3,P4*$P$3,Q4*$Q$3,R4*$R$3))-S4","v":0}]
[{"$f":"IF(Prezentace!A7=0,\"\",Prezentace!A7)","v":""},{"$f":"IF(Prezentace!B7=0,\"\",Prezentace!B7)","v":""},{"$f":"Prezentace!D7","v":"R"},{"$f":"IF(Prezentace!F7=0,\"\",Prezentace!F7)","v":"Martin"},{"$f":"IF(Prezentace!E7=0,\"\",Prezentace!E7)","v":"Adensam"},null,null,null,null,null,null,null,null,null,null,null,null,null,null,{"$f":"(SUM(F5*$F$3,G5*$G$3,H5*$H$3,I5*$I$3,J5*$J$3,K5*$K$3,L5*$L$3,M5*$M$3,N5*$N$3,O5*$O$3,P5*$P$3,Q5*$Q$3,R5*$R$3))-S5","v":0}]
[{"$f":"IF(Prezentace!A8=0,\"\",Prezentace!A8)","v":""},{"$f":"IF(Prezentace!B8=0,\"\",Prezentace!B8)","v":""},{"$f":"Prezentace!D8","v":"P"},{"$f":"IF(Prezentace!F8=0,\"\",Prezentace!F8)","v":"Jaroslav"},{"$f":"IF(Prezentace!E8=0,\"\",Prezentace!E8)","v":"Kostříž "},null,null,null,null,null,null,null,null,null,null,null,null,null,null,0]
[{"$f":"IF(Prezentace!A9=0,\"\",Prezentace!A9)","v":""},{"$f":"IF(Prezentace!B9=0,\"\",Prezentace!B9)","v":""},{"$f":"Prezentace!D9","v":"P"},{"$f":"IF(Prezentace!F9=0,\"\",Prezentace!F9)","v":"Miroslav"},{"$f":"IF(Prezentace!E9=0,\"\",Prezentace!E9)","v":"Koch   ml."},null,null,null,null,null,null,null,null,null,null,null,null,null,null,0]
[{"$f":"IF(Prezentace!A10=0,\"\",Prezentace!A10)","v":""},{"$f":"IF(Prezentace!B10=0,\"\",Prezentace!B10)","v":""},{"$f":"Prezentace!D10","v":"P"},{"$f":"IF(Prezentace!F10=0,\"\",Prezentace!F10)","v":"Miroslav"},{"$f":"IF(Prezentace!E10=0,\"\",Prezentace!E10)","v":"Koch  st. "},null,null,null,null,null,null,null,null,null,null,null,null,null,null,0]
[{"$f":"IF(Prezentace!A11=0,\"\",Prezentace!A11)","v":""},{"$f":"IF(Prezentace!B11=0,\"\",Prezentace!B11)","v":""},{"$f":"Prezentace!D11","v":"P"},{"$f":"IF(Prezentace!F11=0,\"\",Prezentace!F11)","v":"Bohumil"},{"$f":"IF(Prezentace!E11=0,\"\",Prezentace!E11)","v":"Herceg"},null,null,null,null,null,null,null,null,null,null,null,null,null,null,0]
[{"$f":"IF(Prezentace!A12=0,\"\",Prezentace!A12)","v":""},{"$f":"IF(Prezentace!B12=0,\"\",Prezentace!B12)","v":""},{"$f":"Prezentace!D12","v":"P"},{"$f":"IF(Prezentace!F12=0,\"\",Prezentace!F12)","v":"Viktor"},{"$f":"IF(Prezentace!E12=0,\"\",Prezentace!E12)","v":"Fuksa  "},null,null,null,null,null,null,null,null,null,null,null,null,null,null,0]
[{"$f":"IF(Prezentace!A13=0,\"\",Prezentace!A13)","v":""},{"$f":"IF(Prezentace!B13=0,\"\",Prezentace!B13)","v":""},{"$f":"Prezentace!D13","v":"P"},{"$f":"IF(Prezentace!F13=0,\"\",Prezentace!F13)","v":"Milan"},{"$f":"IF(Prezentace!E13=0,\"\",Prezentace!E13)","v":"Matějka  ml."},null,null,null,null,null,null,null,null,null,null,null,null,null,null,0]
[{"$f":"IF(Prezentace!A14=0,\"\",Prezentace!A14)","v":""},{"$f":"IF(Prezentace!B14=0,\"\",Prezentace!B14)","v":""},{"$f":"Prezentace!D14","v":"P"},{"$f":"IF(Prezentace!F14=0,\"\",Prezentace!F14)","v":"Michal"},{"$f":"IF(Prezentace!E14=0,\"\",Prezentace!E14)","v":"Svoboda"},null,null,null,null,null,null,null,null,null,null,null,null,null,null,0]
[{"$f":"IF(Prezentace!A15=0,\"\",Prezentace!A15)","v":""},{"$f":"IF(Prezentace!B15=0,\"\",Prezentace!B15)","v":""},{"$f":"Prezentace!D15","v":"R"},{"$f":"IF(Prezentace!F15=0,\"\",Prezentace!F15)","v":"Lukáš"},{"$f":"IF(Prezentace!E15=0,\"\",Prezentace!E15)","v":"Bouda "},null,null,null,null,null,null,null,null,null,null,null,null,null,null,0]
[{"$f":"IF(Prezentace!A16=0,\"\",Prezentace!A16)","v":""},{"$f":"IF(Prezentace!B16=0,\"\",Prezentace!B16)","v":""},{"$f":"Prezentace!D16","v":"P"},{"$f":"IF(Prezentace!F16=0,\"\",Prezentace!F16)","v":"Lukáš"},{"$f":"IF(Prezentace!E16=0,\"\",Prezentace!E16)","v":"Bouda "},null,null,null,null,null,null,null,null,null,null,null,null,null,null,0]
[{"$f":"IF(Prezentace!A17=0,\"\",Prezentace!A17)","v":""},{"$f":"IF(Prezentace!B17=0,\"\",Prezentace!B17)","v":""},{"$f":"Prezentace!D17","v":"P"},{"$f":"IF(Prezentace!F17=0,\"\",Prezentace!F17)","v":"Pavel"},{"$f":"IF(Prezentace!E17=0,\"\",Prezentace!E17)","v":"Koltai"},null,null,null,null,null,null,null,null,null,null,null,null,null,null,0]
[{"$f":"IF(Prezentace!A18=0,\"\",Prezentace!A18)","v":""},{"$f":"IF(Prezentace!B18=0,\"\",Prezentace!B18)","v":""},{"$f":"Prezentace!D18","v":"P"},{"$f":"IF(Prezentace!F18=0,\"\",Prezentace!F18)","v":"Vladislav"},{"$f":"IF(Prezentace!E18=0,\"\",Prezentace!E18)","v":"Přibyl"},null,null,null,null,null,null,null,null,null,null,null,null,null,null,0]
[{"$f":"IF(Prezentace!A19=0,\"\",Prezentace!A19)","v":""},{"$f":"IF(Prezentace!B19=0,\"\",Prezentace!B19)","v":""},{"$f":"Prezentace!D19","v":"P"},{"$f":"IF(Prezentace!F19=0,\"\",Prezentace!F19)","v":"Milan"},{"$f":"IF(Prezentace!E19=0,\"\",Prezentace!E19)","v":"Matějka st."},null,null,null,null,null,null,null,null,null,null,null,null,null,null,0]
[{"$f":"IF(Prezentace!A20=0,\"\",Prezentace!A20)","v":""},{"$f":"IF(Prezentace!B20=0,\"\",Prezentace!B20)","v":""},{"$f":"Prezentace!D20","v":"P"},{"$f":"IF(Prezentace!F20=0,\"\",Prezentace!F20)","v":"Miroslav"},{"$f":"IF(Prezentace!E20=0,\"\",Prezentace!E20)","v":"Fiala  "},null,null,null,null,null,null,null,null,null,null,null,null,null,null,0]
[{"$f":"IF(Prezentace!A21=0,\"\",Prezentace!A21)","v":""},{"$f":"IF(Prezentace!B21=0,\"\",Prezentace!B21)","v":""},{"$f":"Prezentace!D21","v":"P"},{"$f":"IF(Prezentace!F21=0,\"\",Prezentace!F21)","v":"Karel"},{"$f":"IF(Prezentace!E21=0,\"\",Prezentace!E21)","v":"Gažák "},null,null,null,null,null,null,null,null,null,null,null,null,null,null,0]
[{"$f":"IF(Prezentace!A22=0,\"\",Prezentace!A22)","v":""},{"$f":"IF(Prezentace!B22=0,\"\",Prezentace!B22)","v":""},{"$f":"Prezentace!D22","v":"P"},{"$f":"IF(Prezentace!F22=0,\"\",Prezentace!F22)","v":"Václav"},{"$f":"IF(Prezentace!E22=0,\"\",Prezentace!E22)","v":"Landkammer"},null,null,null,null,null,null,null,null,null,null,null,null,null,null,0]
[{"$f":"IF(Prezentace!A23=0,\"\",Prezentace!A23)","v":""},{"$f":"IF(Prezentace!B23=0,\"\",Prezentace!B23)","v":""},{"$f":"Prezentace!D23","v":"P"},{"$f":"IF(Prezentace!F23=0,\"\",Prezentace!F23)","v":"Vojtěch"},{"$f":"IF(Prezentace!E23=0,\"\",Prezentace!E23)","v":"Brejžek "},null,null,null,null,null,null,null,null,null,null,null,null,null,null,0]
[{"$f":"IF(Prezentace!A24=0,\"\",Prezentace!A24)","v":""},{"$f":"IF(Prezentace!B24=0,\"\",Prezentace!B24)","v":""},{"$f":"Prezentace!D24","v":"P"},{"$f":"IF(Prezentace!F24=0,\"\",Prezentace!F24)","v":"Antonín"},{"$f":"IF(Prezentace!E24=0,\"\",Prezentace!E24)","v":"Urbanec  "},null,null,null,null,null,null,null,null,null,null,null,null,null,null,0]
[{"$f":"IF(Prezentace!A25=0,\"\",Prezentace!A25)","v":""},{"$f":"IF(Prezentace!B25=0,\"\",Prezentace!B25)","v":""},{"$f":"Prezentace!D25","v":"P"},{"$f":"IF(Prezentace!F25=0,\"\",Prezentace!F25)","v":"Milan"},{"$f":"IF(Prezentace!E25=0,\"\",Prezentace!E25)","v":"Jílek  "},null,null,null,null,null,null,null,null,null,null,null,null,null,null,0]
[{"$f":"IF(Prezentace!A26=0,\"\",Prezentace!A26)","v":""},{"$f":"IF(Prezentace!B26=0,\"\",Prezentace!B26)","v":""},{"$f":"Prezentace!D26","v":"P"},{"$f":"IF(Prezentace!F26=0,\"\",Prezentace!F26)","v":"Václav"},{"$f":"IF(Prezentace!E26=0,\"\",Prezentace!E26)","v":"Jírů"},null,null,null,null,null,null,null,null,null,null,null,null,null,null,0]
[{"$f":"IF(Prezentace!A27=0,\"\",Prezentace!A27)","v":""},{"$f":"IF(Prezentace!B27=0,\"\",Prezentace!B27)","v":""},{"$f":"Prezentace!D27","v":"P"},{"$f":"IF(Prezentace!F27=0,\"\",Prezentace!F27)","v":"Milan"},{"$f":"IF(Prezentace!E27=0,\"\",Prezentace!E27)","v":"Krupica"},null,null,null,null,null,null,null,null,null,null,null,null,null,null,0]
[{"$f":"IF(Prezentace!A28=0,\"\",Prezentace!A28)","v":""},{"$f":"IF(Prezentace!B28=0,\"\",Prezentace!B28)","v":""},{"$f":"Prezentace!D28","v":"R"},{"$f":"IF(Prezentace!F28=0,\"\",Prezentace!F28)","v":"Milan"},{"$f":"IF(Prezentace!E28=0,\"\",Prezentace!E28)","v":"Krupica "},null,null,null,null,null,null,null,null,null,null,null,null,null,null,0]
[{"$f":"IF(Prezentace!A29=0,\"\",Prezentace!A29)","v":""},{"$f":"IF(Prezentace!B29=0,\"\",Prezentace!B29)","v":""},{"$f":"Prezentace!D29","v":"P"},{"$f":"IF(Prezentace!F29=0,\"\",Prezentace!F29)","v":"Miloslav"},{"$f":"IF(Prezentace!E29=0,\"\",Prezentace!E29)","v":"Petržílka"},null,null,null,null,null,null,null,null,null,null,null,null,null,null,0]
[{"$f":"IF(Prezentace!A30=0,\"\",Prezentace!A30)","v":""},{"$f":"IF(Prezentace!B30=0,\"\",Prezentace!B30)","v":""},{"$f":"Prezentace!D30","v":"R"},{"$f":"IF(Prezentace!F30=0,\"\",Prezentace!F30)","v":"Aleš"},{"$f":"IF(Prezentace!E30=0,\"\",Prezentace!E30)","v":"Seitl "},null,null,null,null,null,null,null,null,null,null,null,null,null,null,0]
[{"$f":"IF(Prezentace!A31=0,\"\",Prezentace!A31)","v":""},{"$f":"IF(Prezentace!B31=0,\"\",Prezentace!B31)","v":""},{"$f":"Prezentace!D31","v":"P"},{"$f":"IF(Prezentace!F31=0,\"\",Prezentace!F31)","v":"Aleš"},{"$f":"IF(Prezentace!E31=0,\"\",Prezentace!E31)","v":"Seitl "},null,null,null,null,null,null,null,null,null,null,null,null,null,null,0]
[{"$f":"IF(Prezentace!A32=0,\"\",Prezentace!A32)","v":""},{"$f":"IF(Prezentace!B32=0,\"\",Prezentace!B32)","v":""},{"$f":"Prezentace!D32","v":"P"},{"$f":"IF(Prezentace!F32=0,\"\",Prezentace!F32)","v":"Karel"},{"$f":"IF(Prezentace!E32=0,\"\",Prezentace!E32)","v":"Seitl"},null,null,null,null,null,null,null,null,null,null,null,null,null,null,0]
[{"$f":"IF(Prezentace!A33=0,\"\",Prezentace!A33)","v":""},{"$f":"IF(Prezentace!B33=0,\"\",Prezentace!B33)","v":""},{"$f":"Prezentace!D33","v":"P"},{"$f":"IF(Prezentace!F33=0,\"\",Prezentace!F33)","v":"David"},{"$f":"IF(Prezentace!E33=0,\"\",Prezentace!E33)","v":"Nikodým"},null,null,null,null,null,null,null,null,null,null,null,null,null,null,0]
[{"$f":"IF(Prezentace!A34=0,\"\",Prezentace!A34)","v":""},{"$f":"IF(Prezentace!B34=0,\"\",Prezentace!B34)","v":""},{"$f":"Prezentace!D34","v":"R"},{"$f":"IF(Prezentace!F34=0,\"\",Prezentace!F34)","v":"David"},{"$f":"IF(Prezentace!E34=0,\"\",Prezentace!E34)","v":"Nikodým "},null,null,null,null,null,null,null,null,null,null,null,null,null,null,0]
[{"$f":"IF(Prezentace!A35=0,\"\",Prezentace!A35)","v":""},{"$f":"IF(Prezentace!B35=0,\"\",Prezentace!B35)","v":""},{"$f":"Prezentace!D35","v":"P"},{"$f":"IF(Prezentace!F35=0,\"\",Prezentace!F35)","v":"Lukáš"},{"$f":"IF(Prezentace!E35=0,\"\",Prezentace!E35)","v":"Hobza"},null,null,null,null,null,null,null,null,null,null,null,null,null,null,0]
[{"$f":"IF(Prezentace!A36=0,\"\",Prezentace!A36)","v":""},{"$f":"IF(Prezentace!B36=0,\"\",Prezentace!B36)","v":""},{"$f":"Prezentace!D36","v":"P"},{"$f":"IF(Prezentace!F36=0,\"\",Prezentace!F36)","v":"Antonín"},{"$f":"IF(Prezentace!E36=0,\"\",Prezentace!E36)","v":"Jelínek "},null,null,null,null,null,null,null,null,null,null,null,null,null,null,0]
[{"$f":"IF(Prezentace!A37=0,\"\",Prezentace!A37)","v":""},{"$f":"IF(Prezentace!B37=0,\"\",Prezentace!B37)","v":""},{"$f":"Prezentace!D37","v":"R"},{"$f":"IF(Prezentace!F37=0,\"\",Prezentace!F37)","v":"Antonín"},{"$f":"IF(Prezentace!E37=0,\"\",Prezentace!E37)","v":"Jelínek "},null,null,null,null,null,null,null,null,null,null,null,null,null,null,0]
[{"$f":"IF(Prezentace!A38=0,\"\",Prezentace!A38)","v":""},{"$f":"IF(Prezentace!B38=0,\"\",Prezentace!B38)","v":""},{"$f":"Prezentace!D38","v":"P"},{"$f":"IF(Prezentace!F38=0,\"\",Prezentace!F38)","v":"Ladislav"},{"$f":"IF(Prezentace!E38=0,\"\",Prezentace!E38)","v":"Píša "},null,null,null,null,null,null,null,null,null,null,null,null,null,null,0]
[{"$f":"IF(Prezentace!A39=0,\"\",Prezentace!A39)","v":""},{"$f":"IF(Prezentace!B39=0,\"\",Prezentace!B39)","v":""},{"$f":"Prezentace!D39","v":"P"},{"$f":"IF(Prezentace!F39=0,\"\",Prezentace!F39)","v":"Štefan"},{"$f":"IF(Prezentace!E39=0,\"\",Prezentace!E39)","v":"Mesároš"},null,null,null,null,null,null,null,null,null,null,null,null,null,null,0]
[{"$f":"IF(Prezentace!A40=0,\"\",Prezentace!A40)","v":""},{"$f":"IF(Prezentace!B40=0,\"\",Prezentace!B40)","v":""},{"$f":"Prezentace!D40","v":"P"},{"$f":"IF(Prezentace!F40=0,\"\",Prezentace!F40)","v":"Pavel"},{"$f":"IF(Prezentace!E40=0,\"\",Prezentace!E40)","v":"Červenka"},null,null,null,null,null,null,null,null,null,null,null,null,null,null,{"$f":"(SUM(F38*$F$3,G38*$G$3,H38*$H$3,I38*$I$3,J38*$J$3,K38*$K$3,L38*$L$3,M38*$M$3,N38*$N$3,O38*$O$3,P38*$P$3,Q38*$Q$3,R38*$R$3))-S38","v":0}]
[{"$f":"IF(Prezentace!A41=0,\"\",Prezentace!A41)","v":""},{"$f":"IF(Prezentace!B41=0,\"\",Prezentace!B41)","v":""},{"$f":"Prezentace!D41","v":"R"},{"$f":"IF(Prezentace!F41=0,\"\",Prezentace!F41)","v":"Pavel"},{"$f":"IF(Prezentace!E41=0,\"\",Prezentace!E41)","v":"Červenka "},null,null,null,null,null,null,null,null,null,null,null,null,null,null,0]
[{"$f":"IF(Prezentace!A42=0,\"\",Prezentace!A42)","v":""},{"$f":"IF(Prezentace!B42=0,\"\",Prezentace!B42)","v":""},{"$f":"Prezentace!D42","v":"P"},{"$f":"IF(Prezentace!F42=0,\"\",Prezentace!F42)","v":"Jiří"},{"$f":"IF(Prezentace!E42=0,\"\",Prezentace!E42)","v":"Švihálek "},null,null,null,null,null,null,null,null,null,null,null,null,null,null,0]
[{"$f":"IF(Prezentace!A43=0,\"\",Prezentace!A43)","v":""},{"$f":"IF(Prezentace!B43=0,\"\",Prezentace!B43)","v":""},{"$f":"Prezentace!D43","v":"R"},{"$f":"IF(Prezentace!F43=0,\"\",Prezentace!F43)","v":"Jiří"},{"$f":"IF(Prezentace!E43=0,\"\",Prezentace!E43)","v":"Švihálek "},null,null,null,null,null,null,null,null,null,null,null,null,null,null,0]
[{"$f":"IF(Prezentace!A44=0,\"\",Prezentace!A44)","v":""},{"$f":"IF(Prezentace!B44=0,\"\",Prezentace!B44)","v":""},{"$f":"Prezentace!D44","v":"P"},{"$f":"IF(Prezentace!F44=0,\"\",Prezentace!F44)","v":"František"},{"$f":"IF(Prezentace!E44=0,\"\",Prezentace!E44)","v":"Toman "},null,null,null,null,null,null,null,null,null,null,null,null,null,null,0]
[{"$f":"IF(Prezentace!A45=0,\"\",Prezentace!A45)","v":""},{"$f":"IF(Prezentace!B45=0,\"\",Prezentace!B45)","v":""},{"$f":"Prezentace!D45","v":"P"},{"$f":"IF(Prezentace!F45=0,\"\",Prezentace!F45)","v":"Vladimír"},{"$f":"IF(Prezentace!E45=0,\"\",Prezentace!E45)","v":"VejslíK "},null,null,null,null,null,null,null,null,null,null,null,null,null,null,0]
[{"$f":"IF(Prezentace!A46=0,\"\",Prezentace!A46)","v":""},{"$f":"IF(Prezentace!B46=0,\"\",Prezentace!B46)","v":""},{"$f":"Prezentace!D46","v":"P"},{"$f":"IF(Prezentace!F46=0,\"\",Prezentace!F46)","v":"Karel"},{"$f":"IF(Prezentace!E46=0,\"\",Prezentace!E46)","v":"Získal "},null,null,null,null,null,null,null,null,null,null,null,null,null,null,0]
[{"$f":"IF(Prezentace!A47=0,\"\",Prezentace!A47)","v":""},{"$f":"IF(Prezentace!B47=0,\"\",Prezentace!B47)","v":""},{"$f":"Prezentace!D47","v":"R"},{"$f":"IF(Prezentace!F47=0,\"\",Prezentace!F47)","v":"Karel"},{"$f":"IF(Prezentace!E47=0,\"\",Prezentace!E47)","v":"Získal "},null,null,null,null,null,null,null,null,null,null,null,null,null,null,0]
[{"$f":"IF(Prezentace!A48=0,\"\",Prezentace!A48)","v":""},{"$f":"IF(Prezentace!B48=0,\"\",Prezentace!B48)","v":""},{"$f":"Prezentace!D48","v":"P"},{"$f":"IF(Prezentace!F48=0,\"\",Prezentace!F48)","v":"Jaroslav"},{"$f":"IF(Prezentace!E48=0,\"\",Prezentace!E48)","v":"Sokolík "},null,null,null,null,null,null,null,null,null,null,null,null,null,null,0]
[{"$f":"IF(Prezentace!A49=0,\"\",Prezentace!A49)","v":""},{"$f":"IF(Prezentace!B49=0,\"\",Prezentace!B49)","v":""},{"$f":"Prezentace!D49","v":"P"},{"$f":"IF(Prezentace!F49=0,\"\",Prezentace!F49)","v":"Milan"},{"$f":"IF(Prezentace!E49=0,\"\",Prezentace!E49)","v":"Kraus "},null,null,null,null,null,null,null,null,null,null,null,null,null,null,0]
[{"$f":"IF(Prezentace!A50=0,\"\",Prezentace!A50)","v":""},{"$f":"IF(Prezentace!B50=0,\"\",Prezentace!B50)","v":""},{"$f":"Prezentace!D50","v":"P"},{"$f":"IF(Prezentace!F50=0,\"\",Prezentace!F50)","v":""},{"$f":"IF(Prezentace!E50=0,\"\",Prezentace!E50)","v":""},null,null,null,null,null,null,null,null,null,null,null,null,null,null,0]
[{"$f":"IF(Prezentace!A51=0,\"\",Prezentace!A51)","v":""},{"$f":"IF(Prezentace!B51=0,\"\",Prezentace!B51)","v":""},{"$f":"Prezentace!D51","v":"P"},{"$f":"IF(Prezentace!F51=0,\"\",Prezentace!F51)","v":""},{"$f":"IF(Prezentace!E51=0,\"\",Prezentace!E51)","v":""},null,null,null,null,null,null,null,null,null,null,null,null,null,null,0]
[{"$f":"IF(Prezentace!A52=0,\"\",Prezentace!A52)","v":""},{"$f":"IF(Prezentace!B52=0,\"\",Prezentace!B52)","v":""},{"$f":"Prezentace!D52","v":"P"},{"$f":"IF(Prezentace!F52=0,\"\",Prezentace!F52)","v":""},{"$f":"IF(Prezentace!E52=0,\"\",Prezentace!E52)","v":""},null,null,null,null,null,null,null,null,null,null,null,null,null,null,0]
[{"$f":"IF(Prezentace!A53=0,\"\",Prezentace!A53)","v":""},{"$f":"IF(Prezentace!B53=0,\"\",Prezentace!B53)","v":""},{"$f":"Prezentace!D53","v":"P"},{"$f":"IF(Prezentace!F53=0,\"\",Prezentace!F53)","v":""},{"$f":"IF(Prezentace!E53=0,\"\",Prezentace!E53)","v":""},null,null,null,null,null,null,null,null,null,null,null,null,null,null,0]
[{"$f":"IF(Prezentace!A54=0,\"\",Prezentace!A54)","v":""},{"$f":"IF(Prezentace!B54=0,\"\",Prezentace!B54)","v":""},{"$f":"Prezentace!D54","v":"P"},{"$f":"IF(Prezentace!F54=0,\"\",Prezentace!F54)","v":""},{"$f":"IF(Prezentace!E54=0,\"\",Prezentace!E54)","v":""},null,null,null,null,null,null,null,null,null,null,null,null,null,null,0]
[{"$f":"IF(Prezentace!A55=0,\"\",Prezentace!A55)","v":""},{"$f":"IF(Prezentace!B55=0,\"\",Prezentace!B55)","v":""},{"$f":"Prezentace!D55","v":"P"},{"$f":"IF(Prezentace!F55=0,\"\",Prezentace!F55)","v":""},{"$f":"IF(Prezentace!E55=0,\"\",Prezentace!E55)","v":""},null,null,null,null,null,null,null,null,null,null,null,null,null,null,0]
[{"$f":"IF(Prezentace!A56=0,\"\",Prezentace!A56)","v":""},{"$f":"IF(Prezentace!B56=0,\"\",Prezentace!B56)","v":""},{"$f":"Prezentace!D56","v":"P"},{"$f":"IF(Prezentace!F56=0,\"\",Prezentace!F56)","v":""},{"$f":"IF(Prezentace!E56=0,\"\",Prezentace!E56)","v":""},null,null,null,null,null,null,null,null,null,null,null,null,null,null,0]
[{"$f":"IF(Prezentace!A57=0,\"\",Prezentace!A57)","v":""},{"$f":"IF(Prezentace!B57=0,\"\",Prezentace!B57)","v":""},{"$f":"Prezentace!D57","v":"P"},{"$f":"IF(Prezentace!F57=0,\"\",Prezentace!F57)","v":""},{"$f":"IF(Prezentace!E57=0,\"\",Prezentace!E57)","v":""},null,null,null,null,null,null,null,null,null,null,null,null,null,null,0]
[{"$f":"IF(Prezentace!A58=0,\"\",Prezentace!A58)","v":""},{"$f":"IF(Prezentace!B58=0,\"\",Prezentace!B58)","v":""},{"$f":"Prezentace!D58","v":"P"},{"$f":"IF(Prezentace!F58=0,\"\",Prezentace!F58)","v":""},{"$f":"IF(Prezentace!E58=0,\"\",Prezentace!E58)","v":""},null,null,null,null,null,null,null,null,null,null,null,null,null,null,0]
[{"$f":"IF(Prezentace!A59=0,\"\",Prezentace!A59)","v":""},{"$f":"IF(Prezentace!B59=0,\"\",Prezentace!B59)","v":""},{"$f":"Prezentace!D59","v":"P"},{"$f":"IF(Prezentace!F59=0,\"\",Prezentace!F59)","v":""},{"$f":"IF(Prezentace!E59=0,\"\",Prezentace!E59)","v":""},null,null,null,null,null,null,null,null,null,null,null,null,null,null,0]
[{"$f":"IF(Prezentace!A60=0,\"\",Prezentace!A60)","v":""},{"$f":"IF(Prezentace!B60=0,\"\",Prezentace!B60)","v":""},{"$f":"Prezentace!D60","v":"P"},{"$f":"IF(Prezentace!F60=0,\"\",Prezentace!F60)","v":""},{"$f":"IF(Prezentace!E60=0,\"\",Prezentace!E60)","v":""},null,null,null,null,null,null,null,null,null,null,null,null,null,null,0]
[{"$f":"IF(Prezentace!A61=0,\"\",Prezentace!A61)","v":""},{"$f":"IF(Prezentace!B61=0,\"\",Prezentace!B61)","v":""},{"$f":"Prezentace!D61","v":"P"},{"$f":"IF(Prezentace!F61=0,\"\",Prezentace!F61)","v":""},{"$f":"IF(Prezentace!E61=0,\"\",Prezentace!E61)","v":""},null,null,null,null,null,null,null,null,null,null,null,null,null,null,0]
[{"$f":"IF(Prezentace!A62=0,\"\",Prezentace!A62)","v":""},{"$f":"IF(Prezentace!B62=0,\"\",Prezentace!B62)","v":""},{"$f":"Prezentace!D62","v":"P"},{"$f":"IF(Prezentace!F62=0,\"\",Prezentace!F62)","v":""},{"$f":"IF(Prezentace!E62=0,\"\",Prezentace!E62)","v":""},null,null,null,null,null,null,null,null,null,null,null,null,null,null,0]
[{"$f":"IF(Prezentace!A63=0,\"\",Prezentace!A63)","v":""},{"$f":"IF(Prezentace!B63=0,\"\",Prezentace!B63)","v":""},{"$f":"Prezentace!D63","v":"P"},{"$f":"IF(Prezentace!F63=0,\"\",Prezentace!F63)","v":""},{"$f":"IF(Prezentace!E63=0,\"\",Prezentace!E63)","v":""},null,null,null,null,null,null,null,null,null,null,null,null,null,null,0]
[{"$f":"IF(Prezentace!A64=0,\"\",Prezentace!A64)","v":""},{"$f":"IF(Prezentace!B64=0,\"\",Prezentace!B64)","v":""},{"$f":"Prezentace!D64","v":"P"},{"$f":"IF(Prezentace!F64=0,\"\",Prezentace!F64)","v":""},{"$f":"IF(Prezentace!E64=0,\"\",Prezentace!E64)","v":""},null,null,null,null,null,null,null,null,null,null,null,null,null,null,0]
[{"$f":"IF(Prezentace!A65=0,\"\",Prezentace!A65)","v":""},{"$f":"IF(Prezentace!B65=0,\"\",Prezentace!B65)","v":""},{"$f":"Prezentace!D65","v":"P"},{"$f":"IF(Prezentace!F65=0,\"\",Prezentace!F65)","v":""},{"$f":"IF(Prezentace!E65=0,\"\",Prezentace!E65)","v":""},null,null,null,null,null,null,null,null,null,null,null,null,null,null,0]
[{"$f":"IF(Prezentace!A66=0,\"\",Prezentace!A66)","v":""},{"$f":"IF(Prezentace!B66=0,\"\",Prezentace!B66)","v":""},{"$f":"Prezentace!D66","v":"P"},{"$f":"IF(Prezentace!F66=0,\"\",Prezentace!F66)","v":""},{"$f":"IF(Prezentace!E66=0,\"\",Prezentace!E66)","v":""},null,null,null,null,null,null,null,null,null,null,null,null,null,null,0]
[{"$f":"IF(Prezentace!A67=0,\"\",Prezentace!A67)","v":""},{"$f":"IF(Prezentace!B67=0,\"\",Prezentace!B67)","v":""},{"$f":"Prezentace!D67","v":"P"},{"$f":"IF(Prezentace!F67=0,\"\",Prezentace!F67)","v":""},{"$f":"IF(Prezentace!E67=0,\"\",Prezentace!E67)","v":""},null,null,null,null,null,null,null,null,null,null,null,null,null,null,0]
[{"$f":"IF(Prezentace!A68=0,\"\",Prezentace!A68)","v":""},{"$f":"IF(Prezentace!B68=0,\"\",Prezentace!B68)","v":""},{"$f":"Prezentace!D68","v":"P"},{"$f":"IF(Prezentace!F68=0,\"\",Prezentace!F68)","v":""},{"$f":"IF(Prezentace!E68=0,\"\",Prezentace!E68)","v":""},null,null,null,null,null,null,null,null,null,null,null,null,null,null,0]
[{"$f":"IF(Prezentace!A69=0,\"\",Prezentace!A69)","v":""},{"$f":"IF(Prezentace!B69=0,\"\",Prezentace!B69)","v":""},{"$f":"Prezentace!D69","v":"P"},{"$f":"IF(Prezentace!F69=0,\"\",Prezentace!F69)","v":""},{"$f":"IF(Prezentace!E69=0,\"\",Prezentace!E69)","v":""},null,null,null,null,null,null,null,null,null,null,null,null,null,null,0]
[{"$f":"IF(Prezentace!A70=0,\"\",Prezentace!A70)","v":""},{"$f":"IF(Prezentace!B70=0,\"\",Prezentace!B70)","v":""},{"$f":"Prezentace!D70","v":"P"},{"$f":"IF(Prezentace!F70=0,\"\",Prezentace!F70)","v":""},{"$f":"IF(Prezentace!E70=0,\"\",Prezentace!E70)","v":""},null,null,null,null,null,null,null,null,null,null,null,null,null,null,0]
[{"$f":"IF(Prezentace!A71=0,\"\",Prezentace!A71)","v":""},{"$f":"IF(Prezentace!B71=0,\"\",Prezentace!B71)","v":""},{"$f":"Prezentace!D71","v":"P"},{"$f":"IF(Prezentace!F71=0,\"\",Prezentace!F71)","v":""},{"$f":"IF(Prezentace!E71=0,\"\",Prezentace!E71)","v":""},null,null,null,null,null,null,null,null,null,null,null,null,null,null,0]
[{"$f":"IF(Prezentace!A72=0,\"\",Prezentace!A72)","v":""},{"$f":"IF(Prezentace!B72=0,\"\",Prezentace!B72)","v":""},{"$f":"Prezentace!D72","v":"P"},{"$f":"IF(Prezentace!F72=0,\"\",Prezentace!F72)","v":""},{"$f":"IF(Prezentace!E72=0,\"\",Prezentace!E72)","v":""},null,null,null,null,null,null,null,null,null,null,null,null,null,null,0]
[{"$f":"IF(Prezentace!A73=0,\"\",Prezentace!A73)","v":""},{"$f":"IF(Prezentace!B73=0,\"\",Prezentace!B73)","v":""},{"$f":"Prezentace!D73","v":"P"},{"$f":"IF(Prezentace!F73=0,\"\",Prezentace!F73)","v":""},{"$f":"IF(Prezentace!E73=0,\"\",Prezentace!E73)","v":""},null,null,null,null,null,null,null,null,null,null,null,null,null,null,0]
[{"$f":"IF(Prezentace!A74=0,\"\",Prezentace!A74)","v":""},{"$f":"IF(Prezentace!B74=0,\"\",Prezentace!B74)","v":""},{"$f":"Prezentace!D74","v":"P"},{"$f":"IF(Prezentace!F74=0,\"\",Prezentace!F74)","v":""},{"$f":"IF(Prezentace!E74=0,\"\",Prezentace!E74)","v":""},null,null,null,null,null,null,null,null,null,null,null,null,null,null,0]
[{"$f":"IF(Prezentace!A75=0,\"\",Prezentace!A75)","v":""},{"$f":"IF(Prezentace!B75=0,\"\",Prezentace!B75)","v":""},{"$f":"Prezentace!D75","v":"P"},{"$f":"IF(Prezentace!F75=0,\"\",Prezentace!F75)","v":""},{"$f":"IF(Prezentace!E75=0,\"\",Prezentace!E75)","v":""},null,null,null,null,null,null,null,null,null,null,null,null,null,null,0]
[{"$f":"IF(Prezentace!A76=0,\"\",Prezentace!A76)","v":""},{"$f":"IF(Prezentace!B76=0,\"\",Prezentace!B76)","v":""},{"$f":"Prezentace!D76","v":"P"},{"$f":"IF(Prezentace!F76=0,\"\",Prezentace!F76)","v":""},{"$f":"IF(Prezentace!E76=0,\"\",Prezentace!E76)","v":""},null,null,null,null,null,null,null,null,null,null,null,null,null,null,0]
[{"$f":"IF(Prezentace!A77=0,\"\",Prezentace!A77)","v":""},{"$f":"IF(Prezentace!B77=0,\"\",Prezentace!B77)","v":""},{"$f":"Prezentace!D77","v":"P"},{"$f":"IF(Prezentace!F77=0,\"\",Prezentace!F77)","v":""},{"$f":"IF(Prezentace!E77=0,\"\",Prezentace!E77)","v":""},null,null,null,null,null,null,null,null,null,null,null,null,null,null,0]
[{"$f":"IF(Prezentace!A78=0,\"\",Prezentace!A78)","v":""},{"$f":"IF(Prezentace!B78=0,\"\",Prezentace!B78)","v":""},{"$f":"Prezentace!D78","v":"P"},{"$f":"IF(Prezentace!F78=0,\"\",Prezentace!F78)","v":""},{"$f":"IF(Prezentace!E78=0,\"\",Prezentace!E78)","v":""},null,null,null,null,null,null,null,null,null,null,null,null,null,null,0]
[{"$f":"IF(Prezentace!A79=0,\"\",Prezentace!A79)","v":""},{"$f":"IF(Prezentace!B79=0,\"\",Prezentace!B79)","v":""},{"$f":"Prezentace!D79","v":"P"},{"$f":"IF(Prezentace!F79=0,\"\",Prezentace!F79)","v":""},{"$f":"IF(Prezentace!E79=0,\"\",Prezentace!E79)","v":""},null,null,null,null,null,null,null,null,null,null,null,null,null,null,0]
[{"$f":"IF(Prezentace!A80=0,\"\",Prezentace!A80)","v":""},{"$f":"IF(Prezentace!B80=0,\"\",Prezentace!B80)","v":""},{"$f":"Prezentace!D80","v":"P"},{"$f":"IF(Prezentace!F80=0,\"\",Prezentace!F80)","v":""},{"$f":"IF(Prezentace!E80=0,\"\",Prezentace!E80)","v":""},null,null,null,null,null,null,null,null,null,null,null,null,null,null,0]
[{"$f":"IF(Prezentace!A81=0,\"\",Prezentace!A81)","v":""},{"$f":"IF(Prezentace!B81=0,\"\",Prezentace!B81)","v":""},{"$f":"Prezentace!D81","v":"P"},{"$f":"IF(Prezentace!F81=0,\"\",Prezentace!F81)","v":""},{"$f":"IF(Prezentace!E81=0,\"\",Prezentace!E81)","v":""},null,null,null,null,null,null,null,null,null,null,null,null,null,null,0]
[{"$f":"IF(Prezentace!A82=0,\"\",Prezentace!A82)","v":""},{"$f":"IF(Prezentace!B82=0,\"\",Prezentace!B82)","v":""},{"$f":"Prezentace!D82","v":"P"},{"$f":"IF(Prezentace!F82=0,\"\",Prezentace!F82)","v":""},{"$f":"IF(Prezentace!E82=0,\"\",Prezentace!E82)","v":""},null,null,null,null,null,null,null,null,null,null,null,null,null,null,0]
[{"$f":"IF(Prezentace!A83=0,\"\",Prezentace!A83)","v":""},{"$f":"IF(Prezentace!B83=0,\"\",Prezentace!B83)","v":""},{"$f":"Prezentace!D83","v":"P"},{"$f":"IF(Prezentace!F83=0,\"\",Prezentace!F83)","v":""},{"$f":"IF(Prezentace!E83=0,\"\",Prezentace!E83)","v":""},null,null,null,null,null,null,null,null,null,null,null,null,null,null,0]
[{"$f":"IF(Prezentace!A84=0,\"\",Prezentace!A84)","v":""},{"$f":"IF(Prezentace!B84=0,\"\",Prezentace!B84)","v":""},{"$f":"Prezentace!D84","v":"P"},{"$f":"IF(Prezentace!F84=0,\"\",Prezentace!F84)","v":""},{"$f":"IF(Prezentace!E84=0,\"\",Prezentace!E84)","v":""},null,null,null,null,null,null,null,null,null,null,null,null,null,null,0]
[{"$f":"IF(Prezentace!A85=0,\"\",Prezentace!A85)","v":""},{"$f":"IF(Prezentace!B85=0,\"\",Prezentace!B85)","v":""},{"$f":"Prezentace!D85","v":"P"},{"$f":"IF(Prezentace!F85=0,\"\",Prezentace!F85)","v":""},{"$f":"IF(Prezentace!E85=0,\"\",Prezentace!E85)","v":""},null,null,null,null,null,null,null,null,null,null,null,null,null,null,0]
[{"$f":"IF(Prezentace!A86=0,\"\",Prezentace!A86)","v":""},{"$f":"IF(Prezentace!B86=0,\"\",Prezentace!B86)","v":""},{"$f":"Prezentace!D86","v":"P"},{"$f":"IF(Prezentace!F86=0,\"\",Prezentace!F86)","v":""},{"$f":"IF(Prezentace!E86=0,\"\",Prezentace!E86)","v":""},null,null,null,null,null,null,null,null,null,null,null,null,null,null,0]
[{"$f":"IF(Prezentace!A87=0,\"\",Prezentace!A87)","v":""},{"$f":"IF(Prezentace!B87=0,\"\",Prezentace!B87)","v":""},{"$f":"Prezentace!D87","v":"P"},{"$f":"IF(Prezentace!F87=0,\"\",Prezentace!F87)","v":""},{"$f":"IF(Prezentace!E87=0,\"\",Prezentace!E87)","v":""},null,null,null,null,null,null,null,null,null,null,null,null,null,null,0]
[{"$f":"IF(Prezentace!A88=0,\"\",Prezentace!A88)","v":""},{"$f":"IF(Prezentace!B88=0,\"\",Prezentace!B88)","v":""},{"$f":"Prezentace!D88","v":"P"},{"$f":"IF(Prezentace!F88=0,\"\",Prezentace!F88)","v":""},{"$f":"IF(Prezentace!E88=0,\"\",Prezentace!E88)","v":""},null,null,null,null,null,null,null,null,null,null,null,null,null,null,0]
[{"$f":"IF(Prezentace!A89=0,\"\",Prezentace!A89)","v":""},{"$f":"IF(Prezentace!B89=0,\"\",Prezentace!B89)","v":""},{"$f":"Prezentace!D89","v":"P"},{"$f":"IF(Prezentace!F89=0,\"\",Prezentace!F89)","v":""},{"$f":"IF(Prezentace!E89=0,\"\",Prezentace!E89)","v":""},null,null,null,null,null,null,null,null,null,null,null,null,null,null,0]
[{"$f":"IF(Prezentace!A90=0,\"\",Prezentace!A90)","v":""},{"$f":"IF(Prezentace!B90=0,\"\",Prezentace!B90)","v":""},{"$f":"Prezentace!D90","v":"P"},{"$f":"IF(Prezentace!F90=0,\"\",Prezentace!F90)","v":""},{"$f":"IF(Prezentace!E90=0,\"\",Prezentace!E90)","v":""},null,null,null,null,null,null,null,null,null,null,null,null,null,null,0]
[{"$f":"IF(Prezentace!A91=0,\"\",Prezentace!A91)","v":""},{"$f":"IF(Prezentace!B91=0,\"\",Prezentace!B91)","v":""},{"$f":"Prezentace!D91","v":"P"},{"$f":"IF(Prezentace!F91=0,\"\",Prezentace!F91)","v":""},{"$f":"IF(Prezentace!E91=0,\"\",Prezentace!E91)","v":""},null,null,null,null,null,null,null,null,null,null,null,null,null,null,0]
[{"$f":"IF(Prezentace!A92=0,\"\",Prezentace!A92)","v":""},{"$f":"IF(Prezentace!B92=0,\"\",Prezentace!B92)","v":""},{"$f":"Prezentace!D92","v":"P"},{"$f":"IF(Prezentace!F92=0,\"\",Prezentace!F92)","v":""},{"$f":"IF(Prezentace!E92=0,\"\",Prezentace!E92)","v":""},null,null,null,null,null,null,null,null,null,null,null,null,null,null,0]
[{"$f":"IF(Prezentace!A93=0,\"\",Prezentace!A93)","v":""},{"$f":"IF(Prezentace!B93=0,\"\",Prezentace!B93)","v":""},{"$f":"Prezentace!D93","v":"P"},{"$f":"IF(Prezentace!F93=0,\"\",Prezentace!F93)","v":""},{"$f":"IF(Prezentace!E93=0,\"\",Prezentace!E93)","v":""},null,null,null,null,null,null,null,null,null,null,null,null,null,null,0]
[{"$f":"IF(Prezentace!A94=0,\"\",Prezentace!A94)","v":""},{"$f":"IF(Prezentace!B94=0,\"\",Prezentace!B94)","v":""},{"$f":"Prezentace!D94","v":"P"},{"$f":"IF(Prezentace!F94=0,\"\",Prezentace!F94)","v":""},{"$f":"IF(Prezentace!E94=0,\"\",Prezentace!E94)","v":""},null,null,null,null,null,null,null,null,null,null,null,null,null,null,0]
[{"$f":"IF(Prezentace!A95=0,\"\",Prezentace!A95)","v":""},{"$f":"IF(Prezentace!B95=0,\"\",Prezentace!B95)","v":""},{"$f":"Prezentace!D95","v":"P"},{"$f":"IF(Prezentace!F95=0,\"\",Prezentace!F95)","v":""},{"$f":"IF(Prezentace!E95=0,\"\",Prezentace!E95)","v":""},null,null,null,null,null,null,null,null,null,null,null,null,null,null,0]
[{"$f":"IF(Prezentace!A96=0,\"\",Prezentace!A96)","v":""},{"$f":"IF(Prezentace!B96=0,\"\",Prezentace!B96)","v":""},{"$f":"Prezentace!D96","v":"P"},{"$f":"IF(Prezentace!F96=0,\"\",Prezentace!F96)","v":""},{"$f":"IF(Prezentace!E96=0,\"\",Prezentace!E96)","v":""},null,null,null,null,null,null,null,null,null,null,null,null,null,null,0]
[{"$f":"IF(Prezentace!A97=0,\"\",Prezentace!A97)","v":""},{"$f":"IF(Prezentace!B97=0,\"\",Prezentace!B97)","v":""},{"$f":"Prezentace!D97","v":"P"},{"$f":"IF(Prezentace!F97=0,\"\",Prezentace!F97)","v":""},{"$f":"IF(Prezentace!E97=0,\"\",Prezentace!E97)","v":""},null,null,null,null,null,null,null,null,null,null,null,null,null,null,0]
[{"$f":"IF(Prezentace!A98=0,\"\",Prezentace!A98)","v":""},{"$f":"IF(Prezentace!B98=0,\"\",Prezentace!B98)","v":""},{"$f":"Prezentace!D98","v":"P"},{"$f":"IF(Prezentace!F98=0,\"\",Prezentace!F98)","v":""},{"$f":"IF(Prezentace!E98=0,\"\",Prezentace!E98)","v":""},null,null,null,null,null,null,null,null,null,null,null,null,null,null,0]
[{"$f":"IF(Prezentace!A99=0,\"\",Prezentace!A99)","v":""},{"$f":"IF(Prezentace!B99=0,\"\",Prezentace!B99)","v":""},{"$f":"Prezentace!D99","v":"P"},{"$f":"IF(Prezentace!F99=0,\"\",Prezentace!F99)","v":""},{"$f":"IF(Prezentace!E99=0,\"\",Prezentace!E99)","v":""},null,null,null,null,null,null,null,null,null,null,null,null,null,null,0]
[{"$f":"IF(Prezentace!A100=0,\"\",Prezentace!A100)","v":""},{"$f":"IF(Prezentace!B100=0,\"\",Prezentace!B100)","v":""},{"$f":"Prezentace!D100","v":"P"},{"$f":"IF(Prezentace!F100=0,\"\",Prezentace!F100)","v":""},{"$f":"IF(Prezentace!E100=0,\"\",Prezentace!E100)","v":""},null,null,null,null,null,null,null,null,null,null,null,null,null,null,0]
[{"$f":"IF(Prezentace!A101=0,\"\",Prezentace!A101)","v":""},{"$f":"IF(Prezentace!B101=0,\"\",Prezentace!B101)","v":""},{"$f":"Prezentace!D101","v":"P"},{"$f":"IF(Prezentace!F101=0,\"\",Prezentace!F101)","v":""},{"$f":"IF(Prezentace!E101=0,\"\",Prezentace!E101)","v":""},null,null,null,null,null,null,null,null,null,null,null,null,null,null,0]
[{"$f":"IF(Prezentace!A102=0,\"\",Prezentace!A102)","v":""},{"$f":"IF(Prezentace!B102=0,\"\",Prezentace!B102)","v":""},{"$f":"Prezentace!D102","v":"P"},{"$f":"IF(Prezentace!F102=0,\"\",Prezentace!F102)","v":""},{"$f":"IF(Prezentace!E102=0,\"\",Prezentace!E102)","v":""},null,null,null,null,null,null,null,null,null,null,null,null,null,null,0]
[{"$f":"IF(Prezentace!A103=0,\"\",Prezentace!A103)","v":""},{"$f":"IF(Prezentace!B103=0,\"\",Prezentace!B103)","v":""},{"$f":"Prezentace!D103","v":"P"},{"$f":"IF(Prezentace!F103=0,\"\",Prezentace!F103)","v":""},{"$f":"IF(Prezentace!E103=0,\"\",Prezentace!E103)","v":""},null,null,null,null,null,null,null,null,null,null,null,null,null,null,0]
[{"$f":"IF(Prezentace!A104=0,\"\",Prezentace!A104)","v":""},{"$f":"IF(Prezentace!B104=0,\"\",Prezentace!B104)","v":""},{"$f":"Prezentace!D104","v":"P"},{"$f":"IF(Prezentace!F104=0,\"\",Prezentace!F104)","v":""},{"$f":"IF(Prezentace!E104=0,\"\",Prezentace!E104)","v":""},null,null,null,null,null,null,null,null,null,null,null,null,null,null,{"$f":"(SUM(F102*$F$3,G102*$G$3,H102*$H$3,I102*$I$3,J102*$J$3,K102*$K$3,L102*$L$3,M102*$M$3,N102*$N$3,O102*$O$3,P102*$P$3,Q102*$Q$3,R102*$R$3))-S102","v":0}]

{"sheet":"Výsledky","index":14,"n_rows":109,"n_cols":23,"rows_kept":109,"cut":false,"hidden":false,"merged":[[0,0,2,3],[0,4,2,6],[3,14,4,14],[3,15,4,15],[3,16,4,16],[3,0,4,0],[3,3,4,3],[3,4,4,4],[3,5,4,5],[3,6,4,6],[3,17,4,17],[3,18,4,18],[0,19,2,22],[3,12,4,12],[3,1,4,1],[3,7,4,7],[3,8,4,8],[3,9,4,9],[3,10,4,10],[3,11,4,11],[3,19,4,19],[3,20,4,20],[3,21,4,21],[3,22,4,22],[3,13,4,13],[3,2,4,2]]}
["Výsledková listina ",null,null,null,"Paňác open",null,null,null,null,null,null,null,null,null,null,null,null,null,null,"Datum: 29.6. 2019\nHorní Cerekev\nPočátky"]
[]
[]
["Druž.","Kap.","Start.\nčíslo","Zbraň","Příjmení","Jméno","Klub (organizace)","Disc.\n1","Disc.\n1","Disc.\n2","Disc.\n2","Disc.\n3","Disc.\n3","Disc.\n4","Disc.\n4","Disc.\n5","Disc.\n5","Disc.\n6","Disc.\n6","Celkový výsledek","Pořadí","Celkem družstvo","Pořadí družstvo"]
[]
[null,null,43,"P","Sokolík ","Jaroslav","KVZ Fruko J.Hradec",239.99,0,332.53,0,289.62,0,0,0,0,0,0,0,{"$f":"IF(SUM(H6:S6)<0,0,SUM(H6:S6))","v":862.14},{"$f":"RANK(T6,$T$6:$T$104)","v":1},{"$f":"IF($B6=\"K\",SUMIFS($T$6:$T$104,$A$6:$A$104,A6),\"\")","v":""},{"$f":"IF($B6=\"K\",RANK(V6,$V$6:$V$104),\"\")","v":""}]
[null,null,11,"P","Bouda ","Lukáš","KVZ  Telč",245.92000000000002,0,328.95,0,282.77999999999997,0,0,0,0,0,0,0,857.65,2,"",""]
[null,null,40,"P","VejslíK ","Vladimír","KVZ Fruko J.Hradec",253.31,0,328.19,0,270.95999999999998,0,0,0,0,0,0,0,852.46,3,"",""]
[null,null,34,"P","Mesároš","Štefan","KVZ Fruko J.Hradec",242.25,0,322.92,0,281.7,0,0,0,0,0,0,0,846.87000000000012,4,"",""]
[null,null,35,"P","Červenka","Pavel","KVZ Perlhřimov",242.75,0,326.95,0,268.23,0,0,0,0,0,0,0,837.93000000000006,5,"",""]
[null,null,12,"P","Koltai","Pavel","KVZ Telč",251.88,0,316.27999999999997,0,266.40999999999997,0,0,0,0,0,0,0,834.56999999999994,6,"",""]
[null,null,9,"P","Svoboda","Michal","KVZ Počátky",237.59,0,327.87,0,264.39999999999998,0,0,0,0,0,0,0,829.86,7,"",""]
[null,null,28,"P","Nikodým","David","KVZ Pelhřimov",251.88,0,311.7,0,249.32,0,0,0,0,0,0,0,812.89999999999986,8,"",""]
[null,null,44,"P","Kraus ","Milan","KVZ Týn n Vltavou",237.91,0,310.47000000000003,0,261.14,0,0,0,0,0,0,0,809.52,9,"",""]
[null,null,21,"P","Jírů","Václav","SK Jednorožec",223.54000000000002,0,315.93,0,254.14,0,0,0,0,0,0,0,793.61,10,"",""]
[null,null,1,"P","Adensam ","Martin","SK Žirovnice",229.89,0,288.40999999999997,0,269.75,0,0,0,0,0,0,0,788.05,11,"",""]
[null,null,37,"P","Švihálek ","Jiří","KVZ Fruko J.Hradec",234.12,0,300.48,0,250.61,0,0,0,0,0,0,0,785.21,12,"",""]
[null,null,30,"P","Hobza","Lukáš","KVZ Telč",231.56,0,289.79000000000002,0,258.34000000000003,0,0,0,0,0,0,0,779.69,13,"",""]
[null,null,41,"P","Získal ","Karel","KVZ Pelhřimov",215.02,0,312.35000000000002,0,251.39,0,0,0,0,0,0,0,778.76,14,"",""]
[null,null,22,"P","Krupica","Milan","SK Jednorožec",214.14,0,307.42,0,252.93,0,0,0,0,0,0,0,774.49,15,"",""]
[null,null,29,"R","Nikodým ","David","KVZ Pelhřimov",231.07,0,286.10000000000002,0,253.49,0,0,0,0,0,0,0,770.66000000000008,16,"",""]
[null,null,24,"P","Petržílka","Miloslav","KVZ UVS J.Hradec",207.37,0,300.45,0,261.49,0,0,0,0,0,0,0,769.31,17,"",""]
[null,null,16,"P","Gažák ","Karel","SSK Borek",204.57,0,309.10000000000002,0,251.85,0,0,0,0,0,0,0,765.5200000000001,18,"",""]
[null,null,32,"R","Jelínek ","Antonín","KVZ Pelhřimov",207.57999999999998,0,304.68,0,246.56,0,0,0,0,0,0,0,758.81999999999994,19,"",""]
[null,null,5,"P","Koch  st. ","Miroslav","Kvz Policie Počátky",208.92000000000002,0,298.31,0,244.06,0,0,0,0,0,0,0,751.29,20,"",""]
[null,null,38,"R","Švihálek ","Jiří","KVZ Fruko J.Hradec",205.12,0,295.47000000000003,0,249.31,0,0,0,0,0,0,0,749.90000000000009,21,"",""]
[null,null,10,"R","Bouda ","Lukáš","KVZ  Telč",217.31,0,284.89999999999998,0,246.3,0,0,0,0,0,0,0,748.51,22,"",""]
[null,null,7,"P","Fuksa  ","Viktor","Kvz Policie Počátky",205.20999999999998,0,288.56,0,253.94,0,0,0,0,0,0,0,747.71,23,"",""]
[null,null,36,"R","Červenka ","Pavel","KVZ Perlhřimov",199.4,0,281.83,0,263.29000000000002,0,0,0,0,0,0,0,744.52,24,"",""]
[null,null,8,"P","Matějka  ml.","Milan","KVZ Policie Počátky",210.54000000000002,0,307.44,0,225.87,0,0,0,0,0,0,0,743.85,25,"",""]
[null,null,15,"P","Fiala  ","Miroslav","KVZ Fruko J.Hradec",181.28,0,298.62,0,252.75,0,0,0,0,0,0,0,732.65,26,"",""]
[null,null,18,"P","Brejžek ","Vojtěch","KVZ Fruko J.Hradec",212.95999999999998,0,269.27,0,247.63,0,0,0,0,0,0,0,729.8599999999999,27,"",""]
[null,null,39,"P","Toman ","František","KVZ Fruko J.Hradec",169.3,0,317.10000000000002,0,240.07999999999998,0,0,0,0,0,0,0,726.48,28,"",""]
[null,null,4,"P","Koch   ml.","Miroslav","Kvz Policie Počátky",207.94,0,265.3,0,247.88,0,0,0,0,0,0,0,721.12,29,"",""]
[null,null,27,"P","Seitl","Karel","SSK lavonice",194.6,0,280.22000000000003,0,240.15,0,0,0,0,0,0,0,714.97,30,"",""]
[null,null,3,"P","Kostříž ","Jaroslav","Kvz Policie Počátky",193,0,305.2,0,211.72,0,0,0,0,0,0,0,709.92,31,"",""]
[null,null,17,"P","Landkammer","Václav","KVZ Fruko J.Hradec",199.85,0,272.8,0,233.04000000000002,0,0,0,0,0,0,0,705.69,32,"",""]
[null,null,25,"R","Seitl ","Aleš","SSK lavonice",189.8,0,272.8,0,235.38,0,0,0,0,0,0,0,697.98,33,"",""]
[null,null,31,"P","Jelínek ","Antonín","KVZ Pelhřimov",173.43,0,288,0,231.74,0,0,0,0,0,0,0,693.17000000000007,34,"",""]
[null,null,6,"P","Herceg","Bohumil","Kvz Policie Počátky",186.4,0,254.5,0,223.31,0,0,0,0,0,0,0,664.21,35,"",""]
[null,null,33,"P","Píša ","Ladislav","KVZ Třebíč",219.32999999999998,0,186.61,0,241.47,0,0,0,0,0,0,0,647.41,36,"",""]
[null,null,23,"R","Krupica ","Milan","SK Jednorožec",196.3,0,251.7,0,195.7,0,0,0,0,0,0,0,643.70000000000005,37,"",""]
[null,null,20,"P","Jílek  ","Milan","KVZ Fruko J.Hradec",166.8,0,248.3,0,203.3,0,0,0,0,0,0,0,618.40000000000009,38,"",""]
[null,null,42,"R","Získal ","Karel","KVZ Pelhřimov",181.9,0,245,0,155.6,0,0,0,0,0,0,0,582.5,39,"",""]
[null,null,26,"P","Seitl ","Aleš","SSK lavonice",150.92000000000002,0,221.69,0,195.3,0,0,0,0,0,0,0,567.91000000000008,40,"",""]
[null,null,2,"R","Adensam","Martin","SK Žirovnice",160.4,0,196.54000000000002,0,203.88,0,0,0,0,0,0,0,560.82000000000005,41,"",""]
[null,null,13,"P","Přibyl","Vladislav","KVZ Telč",186.4,0,181.3,0,160.5,0,0,0,0,0,0,0,528.20000000000005,42,"",""]
[null,null,14,"P","Matějka st.","Milan","Jindřichův Hradec",104.4,0,140.80000000000001,0,116.6,0,0,0,0,0,0,0,361.8,43,"",""]
[null,null,19,"P","Urbanec  ","Antonín","KVZ Fruko J.Hradec",111.69999999999999,0,163.4,0,79.300000000000011,0,0,0,0,0,0,0,354.40000000000003,44,"",""]
[null,null,45,"P",null,null,null,0,0,0,0,0,0,0,0,0,0,0,0,{"$f":"IF(SUM(H50:S50)<0,0,SUM(H50:S50))","v":0},{"$f":"RANK(T50,$T$6:$T$104)","v":45},{"$f":"IF($B50=\"K\",SUMIFS($T$6:$T$104,$A$6:$A$104,A50),\"\")","v":""},{"$f":"IF($B50=\"K\",RANK(V50,$V$6:$V$104),\"\")","v":""}]
[null,null,46,"P",null,null,null,0,0,0,0,0,0,0,0,0,0,0,0,0,45,"",""]
[null,null,47,"P",null,null,null,0,0,0,0,0,0,0,0,0,0,0,0,0,45,"",""]
[null,null,48,"P",null,null,null,0,0,0,0,0,0,0,0,0,0,0,0,0,45,"",""]
[null,null,49,"P",null,null,null,0,0,0,0,0,0,0,0,0,0,0,0,0,45,"",""]
[null,null,50,"P",null,null,null,0,0,0,0,0,0,0,0,0,0,0,0,0,45,"",""]
[null,null,51,"P",null,null,null,0,0,0,0,0,0,0,0,0,0,0,0,{"$f":"IF(SUM(H56:S56)<0,0,SUM(H56:S56))","v":0},{"$f":"RANK(T56,$T$6:$T$104)","v":45},{"$f":"IF($B56=\"K\",SUMIFS($T$6:$T$104,$A$6:$A$104,A56),\"\")","v":""},{"$f":"IF($B56=\"K\",RANK(V56,$V$6:$V$104),\"\")","v":""}]
[null,null,52,"P",null,null,null,0,0,0,0,0,0,0,0,0,0,0,0,0,45,"",""]
[null,null,53,"P",null,null,null,0,0,0,0,0,0,0,0,0,0,0,0,0,45,"",""]
[null,null,54,"P",null,null,null,0,0,0,0,0,0,0,0,0,0,0,0,0,45,"",""]
[null,null,55,"P",null,null,null,0,0,0,0,0,0,0,0,0,0,0,0,0,45,"",""]
[null,null,56,"P",null,null,null,0,0,0,0,0,0,0,0,0,0,0,0,0,45,"",""]
[null,null,57,"P",null,null,null,0,0,0,0,0,0,0,0,0,0,0,0,0,45,"",""]
[null,null,58,"P",null,null,null,0,0,0,0,0,0,0,0,0,0,0,0,0,45,"",""]
[null,null,59,"P",null,null,null,0,0,0,0,0,0,0,0,0,0,0,0,0,45,"",""]
[null,null,60,"P",null,null,null,0,0,0,0,0,0,0,0,0,0,0,0,0,45,"",""]
[null,null,61,"P",null,null,null,0,0,0,0,0,0,0,0,0,0,0,0,0,45,"",""]
[null,null,62,"P",null,null,null,0,0,0,0,0,0,0,0,0,0,0,0,0,45,"",""]
[null,null,63,"P",null,null,null,0,0,0,0,0,0,0,0,0,0,0,0,0,45,"",""]
[null,null,64,"P",null,null,null,0,0,0,0,0,0,0,0,0,0,0,0,0,45,"",""]
[null,null,65,"P",null,null,null,0,0,0,0,0,0,0,0,0,0,0,0,{"$f":"IF(SUM(H70:S70)<0,0,SUM(H70:S70))","v":0},{"$f":"RANK(T70,$T$6:$T$104)","v":45},{"$f":"IF($B70=\"K\",SUMIFS($T$6:$T$104,$A$6:$A$104,A70),\"\")","v":""},{"$f":"IF($B70=\"K\",RANK(V70,$V$6:$V$104),\"\")","v":""}]
[null,null,66,"P",null,null,null,0,0,0,0,0,0,0,0,0,0,0,0,0,45,"",""]
[null,null,67,"P",null,null,null,0,0,0,0,0,0,0,0,0,0,0,0,0,45,"",""]
[null,null,68,"P",null,null,null,0,0,0,0,0,0,0,0,0,0,0,0,0,45,"",""]
[null,null,69,"P",null,null,null,0,0,0,0,0,0,0,0,0,0,0,0,0,45,"",""]
[null,null,70,"P",null,null,null,0,0,0,0,0,0,0,0,0,0,0,0,0,45,"",""]
[null,null,71,"P",null,null,null,0,0,0,0,0,0,0,0,0,0,0,0,0,45,"",""]
[null,null,72,"P",null,null,null,0,0,0,0,0,0,0,0,0,0,0,0,0,45,"",""]
[null,null,73,"P",null,null,null,0,0,0,0,0,0,0,0,0,0,0,0,0,45,"",""]
[null,null,74,"P",null,null,null,0,0,0,0,0,0,0,0,0,0,0,0,0,45,"",""]
[null,null,75,"P",null,null,null,0,0,0,0,0,0,0,0,0,0,0,0,0,45,"",""]
[null,null,76,"P",null,null,null,0,0,0,0,0,0,0,0,0,0,0,0,0,45,"",""]
[null,null,77,"P",null,null,null,0,0,0,0,0,0,0,0,0,0,0,0,0,45,"",""]
[null,null,78,"P",null,null,null,0,0,0,0,0,0,0,0,0,0,0,0,0,45,"",""]
[null,null,79,"P",null,null,null,0,0,0,0,0,0,0,0,0,0,0,0,0,45,"",""]
[null,null,80,"P",null,null,null,0,0,0,0,0,0,0,0,0,0,0,0,0,45,"",""]
[null,null,81,"P",null,null,null,0,0,0,0,0,0,0,0,0,0,0,0,0,45,"",""]
[null,null,82,"P",null,null,null,0,0,0,0,0,0,0,0,0,0,0,0,0,45,"",""]
[null,null,83,"P",null,null,null,0,0,0,0,0,0,0,0,0,0,0,0,0,45,"",""]
[null,null,84,"P",null,null,null,0,0,0,0,0,0,0,0,0,0,0,0,0,45,"",""]
[null,null,85,"P",null,null,null,0,0,0,0,0,0,0,0,0,0,0,0,0,45,"",""]
[null,null,86,"P",null,null,null,0,0,0,0,0,0,0,0,0,0,0,0,0,45,"",""]
[null,null,87,"P",null,null,null,0,0,0,0,0,0,0,0,0,0,0,0,0,45,"",""]
[null,null,88,"P",null,null,null,0,0,0,0,0,0,0,0,0,0,0,0,0,45,"",""]
[null,null,89,"P",null,null,null,0,0,0,0,0,0,0,0,0,0,0,0,0,45,"",""]
[null,null,90,"P",null,null,null,0,0,0,0,0,0,0,0,0,0,0,0,0,45,"",""]
[null,null,91,"P",null,null,null,0,0,0,0,0,0,0,0,0,0,0,0,0,45,"",""]
[null,null,92,"P",null,null,null,0,0,0,0,0,0,0,0,0,0,0,0,0,45,"",""]
[null,null,93,"P",null,null,null,0,0,0,0,0,0,0,0,0,0,0,0,0,45,"",""]
[null,null,94,"P",null,null,null,0,0,0,0,0,0,0,0,0,0,0,0,0,45,"",""]
[null,null,95,"P",null,null,null,0,0,0,0,0,0,0,0,0,0,0,0,0,45,"",""]
[null,null,96,"P",null,null,null,0,0,0,0,0,0,0,0,0,0,0,0,0,45,"",""]
[null,null,97,"P",null,null,null,0,0,0,0,0,0,0,0,0,0,0,0,{"$f":"IF(SUM(H102:S102)<0,0,SUM(H102:S102))","v":0},{"$f":"RANK(T102,$T$6:$T$104)","v":45},"",{"$f":"IF($B102=\"K\",RANK(V102,$V$6:$V$104),\"\")","v":""}]
[null,null,98,"P",null,null,null,0,0,0,0,0,0,0,0,0,0,0,0,0,45,"",""]
[null,null,99,"P",null,null,null,0,0,0,0,0,0,0,0,0,0,0,0,0,45,"",""]
[null,null,null,"R=",{"$f":"COUNTIF(D6:D104,\"R\")","v":9}]
[null,null,null,null,null,"Čas vyvěšení:"]
[]
[null,null,null,null,"Hlavní rozhodčí:",null,null,"Ředitel závodu:"]
[null,null,null,null,"Miroslav  Koch  1-089",null,null,"Vladimír Krejča  1-090"]

{"sheet":"List1","index":15,"n_rows":111,"n_cols":25,"rows_kept":111,"cut":false,"hidden":false,"merged":[[3,12,4,12],[0,0,2,3],[0,4,2,6],[0,19,2,22],[3,0,4,0],[3,1,4,1],[3,2,4,2],[3,3,4,3],[3,4,4,4],[3,5,4,5],[3,6,4,6],[3,7,4,7],[3,8,4,8],[3,9,4,9],[3,10,4,10],[3,11,4,11],[3,19,4,19],[3,20,4,20],[3,21,4,21],[3,22,4,22],[3,13,4,13],[3,14,4,14],[3,15,4,15],[3,16,4,16],[3,17,4,17],[3,18,4,18]]}
["Výsledková listina ",null,null,null,"Paňác open",null,null,null,null,null,null,null,null,null,null,null,null,null,null,"Datum: 29.6. 2019\nHorní Cerekev\nPočátky"]
[]
[]
["Druž.","Kap.","Start.\nčíslo","Zbraň","Příjmení","Jméno","Klub (organizace)","Disc.\n1","Disc.\n1","Disc.\n2","Disc.\n2","Disc.\n3","Disc.\n3","Disc.\n4","Disc.\n4","Disc.\n5","Disc.\n5","Disc.\n6","Disc.\n6","Celkový výsledek","Pořadí","Celkem družstvo","Pořadí družstvo"]
[]
[null,null,43,"P","Sokolík ","Jaroslav","KVZ Fruko J.Hradec",239.99,0,332.53,0,289.62,0,0,0,0,0,0,0,{"$f":"IF(SUM(H6:S6)<0,0,SUM(H6:S6))","v":862.14},{"$f":"RANK(T6,$T$6:$T$106)","v":1},{"$f":"IF($B6=\"K\",SUMIFS($T$6:$T$106,$A$6:$A$106,A6),\"\")","v":""},{"$f":"IF($B6=\"K\",RANK(V6,$V$6:$V$106),\"\")","v":""}]
[null,null,11,"P","Bouda ","Lukáš","KVZ  Telč",245.92000000000002,0,328.95,0,282.77999999999997,0,0,0,0,0,0,0,857.65,2,"",""]
[null,null,40,"P","VejslíK ","Vladimír","KVZ Fruko J.Hradec",253.31,0,328.19,0,270.95999999999998,0,0,0,0,0,0,0,852.46,3,"",""]
[null,null,34,"P","Mesároš","Štefan","KVZ Fruko J.Hradec",242.25,0,322.92,0,281.7,0,0,0,0,0,0,0,846.87000000000012,4,"",""]
[null,null,35,"P","Červenka","Pavel","KVZ Perlhřimov",242.75,0,326.95,0,268.23,0,0,0,0,0,0,0,837.93000000000006,5,"",""]
[null,null,12,"P","Koltai","Pavel","KVZ Telč",251.88,0,316.27999999999997,0,266.40999999999997,0,0,0,0,0,0,0,834.56999999999994,6,"",""]
[null,null,9,"P","Svoboda","Michal","KVZ Počátky",237.59,0,327.87,0,264.39999999999998,0,0,0,0,0,0,0,829.86,7,"",""]
[null,null,28,"P","Nikodým","David","KVZ Pelhřimov",251.88,0,311.7,0,249.32,0,0,0,0,0,0,0,812.89999999999986,8,"",""]
[null,null,44,"P","Kraus ","Milan","KVZ Týn n Vltavou",237.91,0,310.47000000000003,0,261.14,0,0,0,0,0,0,0,809.52,9,"",""]
[null,null,21,"P","Jírů","Václav","SK Jednorožec",223.54000000000002,0,315.93,0,254.14,0,0,0,0,0,0,0,793.61,10,"",""]
[null,null,1,"P","Adensam ","Martin","SK Žirovnice",229.89,0,288.40999999999997,0,269.75,0,0,0,0,0,0,0,788.05,11,"",""]
[null,null,37,"P","Švihálek ","Jiří","KVZ Fruko J.Hradec",234.12,0,300.48,0,250.61,0,0,0,0,0,0,0,785.21,12,"",""]
[null,null,30,"P","Hobza","Lukáš","KVZ Telč",231.56,0,289.79000000000002,0,258.34000000000003,0,0,0,0,0,0,0,779.69,13,"",""]
[null,null,41,"P","Získal ","Karel","KVZ Pelhřimov",215.02,0,312.35000000000002,0,251.39,0,0,0,0,0,0,0,778.76,14,"",""]
[null,null,22,"P","Krupica","Milan","SK Jednorožec",214.14,0,307.42,0,252.93,0,0,0,0,0,0,0,774.49,15,"",""]
[null,null,24,"P","Petržílka","Miloslav","KVZ UVS J.Hradec",207.37,0,300.45,0,261.49,0,0,0,0,0,0,0,769.31,16,"",""]
[null,null,16,"P","Gažák ","Karel","SSK Borek",204.57,0,309.10000000000002,0,251.85,0,0,0,0,0,0,0,765.5200000000001,17,"",""]
[null,null,5,"P","Koch  st. ","Miroslav","Kvz Policie Počátky",208.92000000000002,0,298.31,0,244.06,0,0,0,0,0,0,0,751.29,18,"",""]
[null,null,7,"P","Fuksa  ","Viktor","Kvz Policie Počátky",205.20999999999998,0,288.56,0,253.94,0,0,0,0,0,0,0,747.71,19,"",""]
[null,null,8,"P","Matějka  ml.","Milan","KVZ Policie Počátky",210.54000000000002,0,307.44,0,225.87,0,0,0,0,0,0,0,743.85,20,"",""]
[null,null,15,"P","Fiala  ","Miroslav","KVZ Fruko J.Hradec",181.28,0,298.62,0,252.75,0,0,0,0,0,0,0,732.65,21,"",""]
[null,null,18,"P","Brejžek ","Vojtěch","KVZ Fruko J.Hradec",212.95999999999998,0,269.27,0,247.63,0,0,0,0,0,0,0,729.8599999999999,22,"",""]
[null,null,39,"P","Toman ","František","KVZ Fruko J.Hradec",169.3,0,317.10000000000002,0,240.07999999999998,0,0,0,0,0,0,0,726.48,23,"",""]
[null,null,4,"P","Koch   ml.","Miroslav","Kvz Policie Počátky",207.94,0,265.3,0,247.88,0,0,0,0,0,0,0,721.12,24,"",""]
[null,null,27,"P","Seitl","Karel","SSK Slavonice",194.6,0,280.22000000000003,0,240.15,0,0,0,0,0,0,0,714.97,25,"",""]
[null,null,3,"P","Kostříž ","Jaroslav","Kvz Policie Počátky",193,0,305.2,0,211.72,0,0,0,0,0,0,0,709.92,26,"",""]
[null,null,17,"P","Landkammer","Václav","KVZ Fruko J.Hradec",199.85,0,272.8,0,233.04000000000002,0,0,0,0,0,0,0,705.69,27,"",""]
[null,null,31,"P","Jelínek ","Antonín","KVZ Pelhřimov",173.43,0,288,0,231.74,0,0,0,0,0,0,0,693.17000000000007,28,"",""]
[null,null,6,"P","Herceg","Bohumil","Kvz Policie Počátky",186.4,0,254.5,0,223.31,0,0,0,0,0,0,0,664.21,29,"",""]
[null,null,33,"P","Píša ","Ladislav","KVZ Třebíč",219.32999999999998,0,186.61,0,241.47,0,0,0,0,0,0,0,647.41,30,"","",null,"-"]
[null,null,20,"P","Jílek  ","Milan","KVZ Fruko J.Hradec",166.8,0,248.3,0,203.3,0,0,0,0,0,0,0,618.40000000000009,31,"",""]
[null,null,26,"P","Seitl ","Aleš","SSK Slavonice",150.92000000000002,0,221.69,0,195.3,0,0,0,0,0,0,0,567.91000000000008,32,"",""]
[null,null,13,"P","Přibyl","Vladislav","KVZ Telč",186.4,0,181.3,0,160.5,0,0,0,0,0,0,0,528.20000000000005,33,"",""]
[null,null,14,"P","Matějka st.","Milan","Jindřichův Hradec",104.4,0,140.80000000000001,0,116.6,0,0,0,0,0,0,0,361.8,34,"",""]
[null,null,19,"P","Urbanec  ","Antonín","KVZ Fruko J.Hradec",111.69999999999999,0,163.4,0,79.300000000000011,0,0,0,0,0,0,0,354.40000000000003,35,"",""]
[]
[]
[null,null,29,"R","Nikodým ","David","KVZ Pelhřimov",231.07,0,286.10000000000002,0,253.49,0,0,0,0,0,0,0,{"$f":"IF(SUM(H43:S43)<0,0,SUM(H43:S43))","v":770.66000000000008},1,{"$f":"IF($B43=\"K\",SUMIFS($T$6:$T$106,$A$6:$A$106,A43),\"\")","v":""},{"$f":"IF($B43=\"K\",RANK(V43,$V$6:$V$106),\"\")","v":""}]
[null,null,32,"R","Jelínek ","Antonín","KVZ Pelhřimov",207.57999999999998,0,304.68,0,246.56,0,0,0,0,0,0,0,758.81999999999994,2,"",""]
[null,null,38,"R","Švihálek ","Jiří","KVZ Fruko J.Hradec",205.12,0,295.47000000000003,0,249.31,0,0,0,0,0,0,0,749.90000000000009,3,"",""]
[null,null,10,"R","Bouda ","Lukáš","KVZ  Telč",217.31,0,284.89999999999998,0,246.3,0,0,0,0,0,0,0,748.51,4,"",""]
[null,null,36,"R","Červenka ","Pavel","KVZ Perlhřimov",199.4,0,281.83,0,263.29000000000002,0,0,0,0,0,0,0,744.52,5,"",""]
[null,null,25,"R","Seitl ","Aleš","SSK lavonice",189.8,0,272.8,0,235.38,0,0,0,0,0,0,0,697.98,6,"",""]
[null,null,23,"R","Krupica ","Milan","SK Jednorožec",196.3,0,251.7,0,195.7,0,0,0,0,0,0,0,643.70000000000005,7,"",""]
[null,null,42,"R","Získal ","Karel","KVZ Pelhřimov",181.9,0,245,0,155.6,0,0,0,0,0,0,0,582.5,8,"",""]
[null,null,2,"R","Adensam","Martin","SK Žirovnice",160.4,0,196.54000000000002,0,203.88,0,0,0,0,0,0,0,560.82000000000005,9,"",""]
[null,null,45,"P",null,null,null,0,0,0,0,0,0,0,0,0,0,0,0,{"$f":"IF(SUM(H52:S52)<0,0,SUM(H52:S52))","v":0},{"$f":"RANK(T52,$T$6:$T$106)","v":45},"",""]
[null,null,46,"P",null,null,null,0,0,0,0,0,0,0,0,0,0,0,0,0,45,"",""]
[null,null,47,"P",null,null,null,0,0,0,0,0,0,0,0,0,0,0,0,0,45,"",""]
[null,null,48,"P",null,null,null,0,0,0,0,0,0,0,0,0,0,0,0,0,45,"",""]
[null,null,49,"P",null,null,null,0,0,0,0,0,0,0,0,0,0,0,0,0,45,"",""]
[null,null,50,"P",null,null,null,0,0,0,0,0,0,0,0,0,0,0,0,0,45,"",""]
[null,null,51,"P",null,null,null,0,0,0,0,0,0,0,0,0,0,0,0,{"$f":"IF(SUM(H58:S58)<0,0,SUM(H58:S58))","v":0},45,"",""]
[null,null,52,"P",null,null,null,0,0,0,0,0,0,0,0,0,0,0,0,0,45,"",""]
[null,null,53,"P",null,null,null,0,0,0,0,0,0,0,0,0,0,0,0,0,45,"",""]
[null,null,54,"P",null,null,null,0,0,0,0,0,0,0,0,0,0,0,0,0,45,"",""]
[null,null,55,"P",null,null,null,0,0,0,0,0,0,0,0,0,0,0,0,0,45,"",""]
[null,null,56,"P",null,null,null,0,0,0,0,0,0,0,0,0,0,0,0,0,45,"",""]
[null,null,57,"P",null,null,null,0,0,0,0,0,0,0,0,0,0,0,0,0,45,"",""]
[null,null,58,"P",null,null,null,0,0,0,0,0,0,0,0,0,0,0,0,0,45,"",""]
[null,null,59,"P",null,null,null,0,0,0,0,0,0,0,0,0,0,0,0,0,45,"",""]
[null,null,60,"P",null,null,null,0,0,0,0,0,0,0,0,0,0,0,0,0,45,"",""]
[null,null,61,"P",null,null,null,0,0,0,0,0,0,0,0,0,0,0,0,0,45,"",""]
[null,null,62,"P",null,null,null,0,0,0,0,0,0,0,0,0,0,0,0,0,45,"",""]
[null,null,63,"P",null,null,null,0,0,0,0,0,0,0,0,0,0,0,0,0,45,"",""]
[null,null,64,"P",null,null,null,0,0,0,0,0,0,0,0,0,0,0,0,0,45,"",""]
[null,null,65,"P",null,null,null,0,0,0,0,0,0,0,0,0,0,0,0,{"$f":"IF(SUM(H72:S72)<0,0,SUM(H72:S72))","v":0},45,"",""]
[null,null,66,"P",null,null,null,0,0,0,0,0,0,0,0,0,0,0,0,0,45,"",""]
[null,null,67,"P",null,null,null,0,0,0,0,0,0,0,0,0,0,0,0,0,45,"",""]
[null,null,68,"P",null,null,null,0,0,0,0,0,0,0,0,0,0,0,0,0,45,{"$f":"IF($B75=\"K\",SUMIFS($T$6:$T$106,$A$6:$A$106,A75),\"\")","v":""},{"$f":"IF($B75=\"K\",RANK(V75,$V$6:$V$106),\"\")","v":""}]
[null,null,69,"P",null,null,null,0,0,0,0,0,0,0,0,0,0,0,0,0,45,"",""]
[null,null,70,"P",null,null,null,0,0,0,0,0,0,0,0,0,0,0,0,0,45,"",""]
[null,null,71,"P",null,null,null,0,0,0,0,0,0,0,0,0,0,0,0,0,45,"",""]
[null,null,72,"P",null,null,null,0,0,0,0,0,0,0,0,0,0,0,0,0,45,"",""]
[null,null,73,"P",null,null,null,0,0,0,0,0,0,0,0,0,0,0,0,0,45,"",""]
[null,null,74,"P",null,null,null,0,0,0,0,0,0,0,0,0,0,0,0,0,45,"",""]
[null,null,75,"P",null,null,null,0,0,0,0,0,0,0,0,0,0,0,0,0,45,"",""]
[null,null,76,"P",null,null,null,0,0,0,0,0,0,0,0,0,0,0,0,0,45,"",""]
[null,null,77,"P",null,null,null,0,0,0,0,0,0,0,0,0,0,0,0,0,{"$f":"RANK(T84,$T$6:$T$106)","v":45},"",""]
[null,null,78,"P",null,null,null,0,0,0,0,0,0,0,0,0,0,0,0,0,45,"",""]
[null,null,79,"P",null,null,null,0,0,0,0,0,0,0,0,0,0,0,0,0,45,"",""]
[null,null,80,"P",null,null,null,0,0,0,0,0,0,0,0,0,0,0,0,0,45,"",""]
[null,null,81,"P",null,null,null,0,0,0,0,0,0,0,0,0,0,0,0,0,45,"",""]
[null,null,82,"P",null,null,null,0,0,0,0,0,0,0,0,0,0,0,0,0,45,"",""]
[null,null,83,"P",null,null,null,0,0,0,0,0,0,0,0,0,0,0,0,0,45,"",""]
[null,null,84,"P",null,null,null,0,0,0,0,0,0,0,0,0,0,0,0,0,45,"",""]
[null,null,85,"P",null,null,null,0,0,0,0,0,0,0,0,0,0,0,0,0,45,"",""]
[null,null,86,"P",null,null,null,0,0,0,0,0,0,0,0,0,0,0,0,0,45,"",""]
[null,null,87,"P",null,null,null,0,0,0,0,0,0,0,0,0,0,0,0,0,45,"",""]
[null,null,88,"P",null,null,null,0,0,0,0,0,0,0,0,0,0,0,0,0,45,"",""]
[null,null,89,"P",null,null,null,0,0,0,0,0,0,0,0,0,0,0,0,0,45,"",""]
[null,null,90,"P",null,null,null,0,0,0,0,0,0,0,0,0,0,0,0,0,45,"",""]
[null,null,91,"P",null,null,null,0,0,0,0,0,0,0,0,0,0,0,0,0,45,"",""]
[null,null,92,"P",null,null,null,0,0,0,0,0,0,0,0,0,0,0,0,0,45,"",""]
[null,null,93,"P",null,null,null,0,0,0,0,0,0,0,0,0,0,0,0,0,45,"",""]
[null,null,94,"P",null,null,null,0,0,0,0,0,0,0,0,0,0,0,0,0,45,"",""]
[null,null,95,"P",null,null,null,0,0,0,0,0,0,0,0,0,0,0,0,0,45,"",""]
[null,null,96,"P",null,null,null,0,0,0,0,0,0,0,0,0,0,0,0,0,45,"",""]
[null,null,97,"P",null,null,null,0,0,0,0,0,0,0,0,0,0,0,0,0,45,"",""]
[null,null,98,"P",null,null,null,0,0,0,0,0,0,0,0,0,0,0,0,0,45,"",""]
[null,null,99,"P",null,null,null,0,0,0,0,0,0,0,0,0,0,0,0,0,45,"",""]
[null,null,null,"R=",{"$f":"COUNTIF(D6:D106,\"R\")","v":9}]
[null,null,null,null,null,"Čas vyvěšení:"]
[]
[null,null,null,null,"Hlavní rozhodčí:",null,null,"Ředitel závodu:"]
[null,null,null,null,"Miroslav  Koch  1-089",null,null,"Viktor Fuksa  1-090"]